Summary
Suite / PlanTVTS / tvts-cert
Suite / Build2.6_r1 / P52650009
Host Info Result/@start xts-deskmini (Linux - 5.15.0-73-generic)
Start time / End TimeWed Jun 07 11:42:32 CST 2023 / Wed Jun 07 11:46:24 CST 2023
Tests Passed244
Tests Failed12
Modules Done1
Modules Total1
FingerprintSKB/BFX_AT100/BFX-AT100:12/STTC.220724.001/15.537.50-20230604:user/release-keys
Security Patch2023-04-01
Release (SDK)12 (31)
ABIsarmeabi-v7a,armeabi

ModulePassedFailedAssumption FailureIgnoredTotal TestsDoneReason
armeabi-v7a TvtsHdmiHostTestCases24412480304true

Failed Tests (12)

armeabi-v7a TvtsHdmiHostTestCases
TestResultDetails
com.google.android.tvts.hdmi.HdmiEdidHostTest#testDpiMatch[/home/xts/tools/android-tvts/./tools/../../android-tvts/testcases/res/EDID/shortlist/0399697E7ADE.bin : 2]
fail
java.lang.AssertionError: DPI does not match: device reported DPI: 160.0, 160.0 is expected to match EDID DPI calculated from DTD: 69.868195, 69.97959 (screen size = 69.799995cm x 39.2cm) or EDID DPI calculated from basic display info: unavailable Capabilities according to Android APIs: { device product info: { product name: Panasonic-TV manufacturer name: MEI manufacture week: -1 manufacture year: 2011 model year: -1 } real size: Point(1920, 1080) real metrics: EdidDisplayMetrics{density=2.0, width=1920, height=1080, scaledDensity=2.0, xdpi=160.0, ydpi=160.0} audio profiles: [ { Encoding format: ENCODING_PCM_16BIT (2) sampling rates: [32000, 44100, 48000, 88200, 96000, 176400, 192000] channel masks: [ 0xC (2 channels) 0xFC (6 channels) 0x18FC (8 channels) ] channel counts: [2, 6, 8] channel index masks: [] } { Encoding format: ENCODING_AC3 (5) sampling rates: [32000, 44100, 48000] channel masks: [ 0x4 (1 channels) 0xC (2 channels) 0x1C (3 channels) 0x3C (4 channels) 0xCC (4 channels) 0xDC (5 channels) 0xFC (6 channels) 0x40C (3 channels) 0x41C (4 channels) ] channel counts: [1, 2, 3, 3, 4, 4, 4, 5, 6] channel index masks: [] } { Encoding format: ENCODING_E_AC3 (6) sampling rates: [44100, 48000] channel masks: [ 0x4 (1 channels) 0xC (2 channels) 0x1C (3 channels) 0x3C (4 channels) 0xCC (4 channels) 0xDC (5 channels) 0xFC (6 channels) 0x40C (3 channels) 0x41C (4 channels) 0x4FC (7 channels) 0x18FC (8 channels) ] channel counts: [1, 2, 3, 3, 4, 4, 4, 5, 6, 7, 8] channel index masks: [] } { Encoding format: ENCODING_DTS (7) sampling rates: [32000, 44100, 48000, 88200, 96000] channel masks: [ 0x4 (1 channels) 0xC (2 channels) 0x1C (3 channels) 0x3C (4 channels) 0xCC (4 channels) 0xDC (5 channels) 0xFC (6 channels) 0x40C (3 channels) 0x41C (4 channels) 0x4FC (7 channels) ] channel counts: [1, 2, 3, 3, 4, 4, 4, 5, 6, 7] channel index masks: [] } ] active display mode: {width=1920, height=1080, fps=59.94006, supportedHdrTypes=[]} supported display modes: [ {width=1920, height=1080, fps=60.000004, supportedHdrTypes=[]} {width=1920, height=1080, fps=59.94006, supportedHdrTypes=[]} {width=1920, height=1080, fps=50.0, supportedHdrTypes=[]} {width=1920, height=1080, fps=24.000002, supportedHdrTypes=[]} {width=1920, height=1080, fps=23.976025, supportedHdrTypes=[]} {width=1280, height=720, fps=60.000004, supportedHdrTypes=[]} {width=1280, height=720, fps=59.94006, supportedHdrTypes=[]} {width=1280, height=720, fps=50.0, supportedHdrTypes=[]} {width=720, height=576, fps=50.0, supportedHdrTypes=[]} {width=720, height=480, fps=60.000004, supportedHdrTypes=[]} {width=720, height=480, fps=59.94006, supportedHdrTypes=[]} ] supported HDR types: [] mHotPlugFail: null comment: From device test: hotplug count: 2 } Device capabilities: { mSupports4K: true mHdrTypes: [HDR10, HLG, HDR10+] mSurroundAudioFormats: [ENCODING_E_AC3_JOC, ENCODING_AAC_LC, ENCODING_AC3, ENCODING_E_AC3, ENCODING_DTS] mSystemPreferredDisplayMode: null } Capabilities from the EDID : { device product info: { product name: Panasonic-TV manufacturer name: MEI manufacture week: -1 manufacture year: 2011 model year: -1 } real size: Point(1920, 1080) real metrics: EdidDisplayMetrics{density=0.0, width=1920, height=1080, scaledDensity=0.0, xdpi=69.868195, ydpi=69.97959} audio profiles: [ { Encoding format: ENCODING_PCM_16BIT (2) sampling rates: [32000, 44100, 48000, 88200, 96000, 176400, 192000] channel masks: null channel counts: [2] channel index masks: null } { Encoding format: ENCODING_PCM_16BIT (2) sampling rates: [32000, 44100, 48000, 88200, 96000, 176400, 192000] channel masks: null channel counts: [8] channel index masks: null } { Encoding format: ENCODING_AC3 (5) sampling rates: [32000, 44100, 48000] channel masks: null channel counts: [6] channel index masks: null } { Encoding format: ENCODING_E_AC3 (6) sampling rates: [44100, 48000] channel masks: null channel counts: [8] channel index masks: null } { Encoding format: ENCODING_DTS (7) sampling rates: [32000, 44100, 48000, 88200, 96000] channel masks: null channel counts: [7] channel index masks: null } { Encoding format: ENCODING_DTS_HD (8) sampling rates: [48000, 96000, 192000] channel masks: null channel counts: [8] channel index masks: null } { Encoding format: ENCODING_DOLBY_TRUEHD (14) sampling rates: [48000, 96000, 192000] channel masks: null channel counts: [8] channel index masks: null } { Encoding format: ENCODING_DOLBY_MAT (19) sampling rates: [48000, 96000, 192000] channel masks: null channel counts: [8] channel index masks: null } ] active display mode: null supported display modes: [ {width=1920, height=1080, fps=60.0, supportedHdrTypes=[]} {width=1920, height=1080, fps=59.94006, supportedHdrTypes=[]} {width=1920, height=1080, fps=50.0, supportedHdrTypes=[]} {width=1920, height=1080, fps=24.0, supportedHdrTypes=[]} {width=1920, height=1080, fps=23.98, supportedHdrTypes=[]} {width=1280, height=720, fps=60.0, supportedHdrTypes=[]} {width=1280, height=720, fps=59.94, supportedHdrTypes=[]} {width=1280, height=720, fps=50.0, supportedHdrTypes=[]} {width=720, height=576, fps=50.0, supportedHdrTypes=[]} {width=720, height=480, fps=60.0, supportedHdrTypes=[]} {width=720, height=480, fps=59.94, supportedHdrTypes=[]} {width=640, height=480, fps=60.0, supportedHdrTypes=[]} {width=640, height=480, fps=59.94, supportedHdrTypes=[]} ] supported HDR types: [] mHotPlugFail: null comment: /home/xts/tools/android-tvts/./tools/../../android-tvts/testcases/res/EDID/shortlist/0399697E7ADE.bin } at org.junit.Assert.fail(Assert.java:89) at com.google.android.tvts.hdmi.HdmiEdidHostTest.writeResultToDbFailIfMessageSet(HdmiEdidHostTest.java:824) at com.google.android.tvts.hdmi.HdmiEdidHostTest.testDpiMatch(HdmiEdidHostTest.java:1238) at java.base/jdk.internal.reflect.NativeMethodAccessorImpl.invoke0(Native Method) at java.base/jdk.internal.reflect.NativeMethodAccessorImpl.invoke(NativeMethodAccessorImpl.java:62) at java.base/jdk.internal.reflect.DelegatingMethodAccessorImpl.invoke(DelegatingMethodAccessorImpl.java:43) at java.base/java.lang.reflect.Method.invoke(Method.java:566) at org.junit.runners.model.FrameworkMethod$1.runReflectiveCall(FrameworkMethod.java:59) at org.junit.internal.runners.model.ReflectiveCallable.run(ReflectiveCallable.java:12) at org.junit.runners.model.FrameworkMethod.invokeExplosively(FrameworkMethod.java:61) at org.junit.internal.runners.statements.InvokeMethod.evaluate(InvokeMethod.java:17) at org.junit.internal.runners.statements.RunBefores.evaluate(RunBefores.java:26) at org.junit.internal.runners.statements.RunAfters.evaluate(RunAfters.java:27) at org.junit.rules.ExternalResource$1.evaluate(ExternalResource.java:54) at org.junit.rules.TestWatcher$1.evaluate(TestWatcher.java:61) at org.junit.runners.ParentRunner$3.evaluate(ParentRunner.java:306) at org.junit.runners.BlockJUnit4ClassRunner$1.evaluate(BlockJUnit4ClassRunner.java:100) at org.junit.runners.ParentRunner.runLeaf(ParentRunner.java:366) at org.junit.runners.BlockJUnit4ClassRunner.runChild(BlockJUnit4ClassRunner.java:103) at org.junit.runners.BlockJUnit4ClassRunner.runChild(BlockJUnit4ClassRunner.java:63) at org.junit.runners.ParentRunner$4.run(ParentRunner.java:331) at org.junit.runners.ParentRunner$1.schedule(ParentRunner.java:79) at org.junit.runners.ParentRunner.runChildren(ParentRunner.java:329) at org.junit.runners.ParentRunner$2.evaluate(ParentRunner.java:293) at org.junit.runners.ParentRunner.run(ParentRunner.java:413) at org.junit.runners.Suite.runChild(Suite.java:128) at org.junit.runners.Suite.runChild(Suite.java:27) at org.junit.runners.ParentRunner$4.run(ParentRunner.java:331) at org.junit.runners.ParentRunner$1.schedule(ParentRunner.java:79) at org.junit.runners.ParentRunner.runChildren(ParentRunner.java:329) at org.junit.runners.ParentRunner$2.evaluate(ParentRunner.java:293) at org.junit.internal.runners.statements.RunAfters.evaluate(RunAfters.java:27) at org.junit.runners.ParentRunner$3.evaluate(ParentRunner.java:306) at org.junit.runners.ParentRunner.run(ParentRunner.java:413) at com.android.tradefed.testtype.junit4.ExceptionThrowingRunnerWrapper.run(ExceptionThrowingRunnerWrapper.java:43) at org.junit.runner.JUnitCore.run(JUnitCore.java:137) at com.android.tradefed.testtype.HostTest.runJUnit4Tests(HostTest.java:736) at com.android.tradefed.testtype.HostTest.runTestClasses(HostTest.java:616) at com.android.tradefed.testtype.HostTest.run(HostTest.java:564) at com.android.compatibility.common.tradefed.testtype.JarHostTest.run(JarHostTest.java:56) at com.android.tradefed.testtype.suite.GranularRetriableTestWrapper.intraModuleRun(GranularRetriableTestWrapper.java:366) at com.android.tradefed.testtype.suite.GranularRetriableTestWrapper.run(GranularRetriableTestWrapper.java:277) at com.android.tradefed.testtype.suite.ModuleDefinition.run(ModuleDefinition.java:582) at com.android.tradefed.testtype.suite.ITestSuite.runSingleModule(ITestSuite.java:926) at com.android.tradefed.testtype.suite.ITestSuite.run(ITestSuite.java:806) at com.android.tradefed.invoker.InvocationExecution.runTest(InvocationExecution.java:1335) at com.android.tradefed.invoker.InvocationExecution.runTests(InvocationExecution.java:1114) at com.android.tradefed.invoker.TestInvocation.prepareAndRun(TestInvocation.java:604) at com.android.tradefed.invoker.TestInvocation.performInvocation(TestInvocation.java:274) at com.android.tradefed.invoker.TestInvocation.invoke(TestInvocation.java:1322) at com.android.tradefed.command.CommandScheduler$InvocationThread.run(CommandScheduler.java:646)
com.google.android.tvts.hdmi.HdmiEdidHostTest#testDpiMatch[/home/xts/tools/android-tvts/./tools/../../android-tvts/testcases/res/EDID/shortlist/02A540FCEE15.bin : 3]
fail
java.lang.AssertionError: DPI does not match: device reported DPI: 160.0, 160.0 is expected to match EDID DPI calculated from DTD: 60.96, 60.959995 (screen size = 80.0cm x 45.0cm) or EDID DPI calculated from basic display info: 43.935135, 44.245163 (screen size = 111cm x 62cm) Capabilities according to Android APIs: { device product info: { product name: 49S405 manufacturer name: TCL manufacture week: -1 manufacture year: 2019 model year: -1 } real size: Point(1920, 1080) real metrics: EdidDisplayMetrics{density=2.0, width=1920, height=1080, scaledDensity=2.0, xdpi=160.0, ydpi=160.0} audio profiles: [ { Encoding format: ENCODING_PCM_16BIT (2) sampling rates: [32000, 44100, 48000] channel masks: [ 0xC (2 channels) ] channel counts: [2] channel index masks: [] } { Encoding format: ENCODING_AC3 (5) sampling rates: [32000, 44100, 48000] channel masks: [ 0x4 (1 channels) 0xC (2 channels) 0x1C (3 channels) 0x3C (4 channels) 0xCC (4 channels) 0xDC (5 channels) 0xFC (6 channels) 0x40C (3 channels) 0x41C (4 channels) ] channel counts: [1, 2, 3, 3, 4, 4, 4, 5, 6] channel index masks: [] } { Encoding format: ENCODING_E_AC3 (6) sampling rates: [32000, 44100, 48000] channel masks: [ 0x4 (1 channels) 0xC (2 channels) 0x1C (3 channels) 0x3C (4 channels) 0xCC (4 channels) 0xDC (5 channels) 0xFC (6 channels) 0x40C (3 channels) 0x41C (4 channels) 0x4FC (7 channels) 0x18FC (8 channels) ] channel counts: [1, 2, 3, 3, 4, 4, 4, 5, 6, 7, 8] channel index masks: [] } ] active display mode: {width=3840, height=2160, fps=59.94006, supportedHdrTypes=[]} supported display modes: [ {width=4096, height=2160, fps=60.000004, supportedHdrTypes=[]} {width=4096, height=2160, fps=59.94006, supportedHdrTypes=[]} {width=4096, height=2160, fps=30.000002, supportedHdrTypes=[]} {width=4096, height=2160, fps=29.97003, supportedHdrTypes=[]} {width=4096, height=2160, fps=24.000002, supportedHdrTypes=[]} {width=4096, height=2160, fps=23.976025, supportedHdrTypes=[]} {width=3840, height=2160, fps=60.000004, supportedHdrTypes=[]} {width=3840, height=2160, fps=59.94006, supportedHdrTypes=[]} {width=3840, height=2160, fps=30.000002, supportedHdrTypes=[]} {width=3840, height=2160, fps=29.97003, supportedHdrTypes=[]} {width=3840, height=2160, fps=24.000002, supportedHdrTypes=[]} {width=3840, height=2160, fps=23.976025, supportedHdrTypes=[]} {width=1920, height=1080, fps=60.000004, supportedHdrTypes=[]} {width=1920, height=1080, fps=59.94006, supportedHdrTypes=[]} {width=1920, height=1080, fps=30.000002, supportedHdrTypes=[]} {width=1920, height=1080, fps=29.97003, supportedHdrTypes=[]} {width=1920, height=1080, fps=24.000002, supportedHdrTypes=[]} {width=1920, height=1080, fps=23.976025, supportedHdrTypes=[]} {width=1280, height=720, fps=60.000004, supportedHdrTypes=[]} {width=1280, height=720, fps=59.94006, supportedHdrTypes=[]} {width=720, height=480, fps=60.000004, supportedHdrTypes=[]} {width=720, height=480, fps=59.94006, supportedHdrTypes=[]} ] supported HDR types: [] mHotPlugFail: null comment: From device test: hotplug count: 3 } Device capabilities: { mSupports4K: true mHdrTypes: [HDR10, HLG, HDR10+] mSurroundAudioFormats: [ENCODING_E_AC3_JOC, ENCODING_AAC_LC, ENCODING_AC3, ENCODING_E_AC3, ENCODING_DTS] mSystemPreferredDisplayMode: null } Capabilities from the EDID : { device product info: { product name: 49S405 manufacturer name: TCL manufacture week: -1 manufacture year: 2019 model year: -1 } real size: Point(3840, 2160) real metrics: EdidDisplayMetrics{density=0.0, width=3840, height=2160, scaledDensity=0.0, xdpi=121.92, ydpi=121.92} audio profiles: [ { Encoding format: ENCODING_PCM_16BIT (2) sampling rates: [32000, 44100, 48000] channel masks: null channel counts: [2] channel index masks: null } { Encoding format: ENCODING_AC3 (5) sampling rates: [32000, 44100, 48000] channel masks: null channel counts: [6] channel index masks: null } { Encoding format: ENCODING_E_AC3 (6) sampling rates: [32000, 44100, 48000] channel masks: null channel counts: [8] channel index masks: null } ] active display mode: null supported display modes: [ {width=4096, height=2160, fps=60.0, supportedHdrTypes=[]} {width=4096, height=2160, fps=59.94, supportedHdrTypes=[]} {width=4096, height=2160, fps=30.0, supportedHdrTypes=[]} {width=4096, height=2160, fps=29.97, supportedHdrTypes=[]} {width=4096, height=2160, fps=24.0, supportedHdrTypes=[]} {width=4096, height=2160, fps=23.98, supportedHdrTypes=[]} {width=3840, height=2160, fps=60.0, supportedHdrTypes=[]} {width=3840, height=2160, fps=59.94, supportedHdrTypes=[]} {width=3840, height=2160, fps=30.0, supportedHdrTypes=[]} {width=3840, height=2160, fps=29.97003, supportedHdrTypes=[]} {width=3840, height=2160, fps=24.0, supportedHdrTypes=[]} {width=3840, height=2160, fps=23.98, supportedHdrTypes=[]} {width=1920, height=1080, fps=60.0, supportedHdrTypes=[]} {width=1920, height=1080, fps=59.94006, supportedHdrTypes=[]} {width=1920, height=1080, fps=30.0, supportedHdrTypes=[]} {width=1920, height=1080, fps=29.97, supportedHdrTypes=[]} {width=1920, height=1080, fps=24.0, supportedHdrTypes=[]} {width=1920, height=1080, fps=23.98, supportedHdrTypes=[]} {width=1680, height=1050, fps=60.0, supportedHdrTypes=[]} {width=1680, height=1050, fps=59.94006, supportedHdrTypes=[]} {width=1280, height=1024, fps=60.0, supportedHdrTypes=[]} {width=1280, height=1024, fps=59.94006, supportedHdrTypes=[]} {width=1280, height=960, fps=60.0, supportedHdrTypes=[]} {width=1280, height=960, fps=59.94006, supportedHdrTypes=[]} {width=1440, height=900, fps=60.0, supportedHdrTypes=[]} {width=1440, height=900, fps=59.94006, supportedHdrTypes=[]} {width=1152, height=864, fps=75.0, supportedHdrTypes=[]} {width=1280, height=800, fps=60.0, supportedHdrTypes=[]} {width=1280, height=800, fps=59.94006, supportedHdrTypes=[]} {width=1360, height=768, fps=60.015163, supportedHdrTypes=[]} {width=1280, height=720, fps=60.0, supportedHdrTypes=[]} {width=1280, height=720, fps=59.94006, supportedHdrTypes=[]} {width=1280, height=720, fps=30.0, supportedHdrTypes=[]} {width=1280, height=720, fps=29.97, supportedHdrTypes=[]} {width=1280, height=720, fps=24.0, supportedHdrTypes=[]} {width=1280, height=720, fps=23.98, supportedHdrTypes=[]} {width=720, height=480, fps=60.0, supportedHdrTypes=[]} {width=720, height=480, fps=59.94, supportedHdrTypes=[]} {width=640, height=480, fps=60.0, supportedHdrTypes=[]} {width=640, height=480, fps=59.94, supportedHdrTypes=[]} ] supported HDR types: [] mHotPlugFail: null comment: /home/xts/tools/android-tvts/./tools/../../android-tvts/testcases/res/EDID/shortlist/02A540FCEE15.bin } at org.junit.Assert.fail(Assert.java:89) at com.google.android.tvts.hdmi.HdmiEdidHostTest.writeResultToDbFailIfMessageSet(HdmiEdidHostTest.java:824) at com.google.android.tvts.hdmi.HdmiEdidHostTest.testDpiMatch(HdmiEdidHostTest.java:1238) at java.base/jdk.internal.reflect.NativeMethodAccessorImpl.invoke0(Native Method) at java.base/jdk.internal.reflect.NativeMethodAccessorImpl.invoke(NativeMethodAccessorImpl.java:62) at java.base/jdk.internal.reflect.DelegatingMethodAccessorImpl.invoke(DelegatingMethodAccessorImpl.java:43) at java.base/java.lang.reflect.Method.invoke(Method.java:566) at org.junit.runners.model.FrameworkMethod$1.runReflectiveCall(FrameworkMethod.java:59) at org.junit.internal.runners.model.ReflectiveCallable.run(ReflectiveCallable.java:12) at org.junit.runners.model.FrameworkMethod.invokeExplosively(FrameworkMethod.java:61) at org.junit.internal.runners.statements.InvokeMethod.evaluate(InvokeMethod.java:17) at org.junit.internal.runners.statements.RunBefores.evaluate(RunBefores.java:26) at org.junit.internal.runners.statements.RunAfters.evaluate(RunAfters.java:27) at org.junit.rules.ExternalResource$1.evaluate(ExternalResource.java:54) at org.junit.rules.TestWatcher$1.evaluate(TestWatcher.java:61) at org.junit.runners.ParentRunner$3.evaluate(ParentRunner.java:306) at org.junit.runners.BlockJUnit4ClassRunner$1.evaluate(BlockJUnit4ClassRunner.java:100) at org.junit.runners.ParentRunner.runLeaf(ParentRunner.java:366) at org.junit.runners.BlockJUnit4ClassRunner.runChild(BlockJUnit4ClassRunner.java:103) at org.junit.runners.BlockJUnit4ClassRunner.runChild(BlockJUnit4ClassRunner.java:63) at org.junit.runners.ParentRunner$4.run(ParentRunner.java:331) at org.junit.runners.ParentRunner$1.schedule(ParentRunner.java:79) at org.junit.runners.ParentRunner.runChildren(ParentRunner.java:329) at org.junit.runners.ParentRunner$2.evaluate(ParentRunner.java:293) at org.junit.runners.ParentRunner.run(ParentRunner.java:413) at org.junit.runners.Suite.runChild(Suite.java:128) at org.junit.runners.Suite.runChild(Suite.java:27) at org.junit.runners.ParentRunner$4.run(ParentRunner.java:331) at org.junit.runners.ParentRunner$1.schedule(ParentRunner.java:79) at org.junit.runners.ParentRunner.runChildren(ParentRunner.java:329) at org.junit.runners.ParentRunner$2.evaluate(ParentRunner.java:293) at org.junit.internal.runners.statements.RunAfters.evaluate(RunAfters.java:27) at org.junit.runners.ParentRunner$3.evaluate(ParentRunner.java:306) at org.junit.runners.ParentRunner.run(ParentRunner.java:413) at com.android.tradefed.testtype.junit4.ExceptionThrowingRunnerWrapper.run(ExceptionThrowingRunnerWrapper.java:43) at org.junit.runner.JUnitCore.run(JUnitCore.java:137) at com.android.tradefed.testtype.HostTest.runJUnit4Tests(HostTest.java:736) at com.android.tradefed.testtype.HostTest.runTestClasses(HostTest.java:616) at com.android.tradefed.testtype.HostTest.run(HostTest.java:564) at com.android.compatibility.common.tradefed.testtype.JarHostTest.run(JarHostTest.java:56) at com.android.tradefed.testtype.suite.GranularRetriableTestWrapper.intraModuleRun(GranularRetriableTestWrapper.java:366) at com.android.tradefed.testtype.suite.GranularRetriableTestWrapper.run(GranularRetriableTestWrapper.java:277) at com.android.tradefed.testtype.suite.ModuleDefinition.run(ModuleDefinition.java:582) at com.android.tradefed.testtype.suite.ITestSuite.runSingleModule(ITestSuite.java:926) at com.android.tradefed.testtype.suite.ITestSuite.run(ITestSuite.java:806) at com.android.tradefed.invoker.InvocationExecution.runTest(InvocationExecution.java:1335) at com.android.tradefed.invoker.InvocationExecution.runTests(InvocationExecution.java:1114) at com.android.tradefed.invoker.TestInvocation.prepareAndRun(TestInvocation.java:604) at com.android.tradefed.invoker.TestInvocation.performInvocation(TestInvocation.java:274) at com.android.tradefed.invoker.TestInvocation.invoke(TestInvocation.java:1322) at com.android.tradefed.command.CommandScheduler$InvocationThread.run(CommandScheduler.java:646)
com.google.android.tvts.hdmi.HdmiEdidHostTest#testDpiMatch[/home/xts/tools/android-tvts/./tools/../../android-tvts/testcases/res/EDID/shortlist/bootTestOrderC_defaultMode1920x1080p60Hz.bin : 4]
fail
java.lang.AssertionError: DPI does not match: device reported DPI: 160.0, 160.0 is expected to match EDID DPI calculated from DTD: 102.23899, 102.35821 (screen size = 47.7cm x 26.8cm) or EDID DPI calculated from basic display info: 101.6, 101.600006 (screen size = 48cm x 27cm) Capabilities according to Android APIs: { device product info: { product name: 22EA63 manufacturer name: GSM manufacture week: 5 manufacture year: 2012 model year: -1 } real size: Point(1920, 1080) real metrics: EdidDisplayMetrics{density=2.0, width=1920, height=1080, scaledDensity=2.0, xdpi=160.0, ydpi=160.0} audio profiles: [ { Encoding format: ENCODING_PCM_16BIT (2) sampling rates: [32000, 44100, 48000] channel masks: [ 0xC (2 channels) ] channel counts: [2] channel index masks: [] } ] active display mode: {width=1920, height=1080, fps=59.94006, supportedHdrTypes=[]} supported display modes: [ {width=1920, height=1080, fps=60.000004, supportedHdrTypes=[]} {width=1920, height=1080, fps=59.94006, supportedHdrTypes=[]} {width=1920, height=1080, fps=50.0, supportedHdrTypes=[]} {width=1280, height=720, fps=60.000004, supportedHdrTypes=[]} {width=1280, height=720, fps=59.94006, supportedHdrTypes=[]} {width=1280, height=720, fps=50.0, supportedHdrTypes=[]} {width=720, height=576, fps=50.0, supportedHdrTypes=[]} {width=720, height=480, fps=60.000004, supportedHdrTypes=[]} {width=720, height=480, fps=59.94006, supportedHdrTypes=[]} ] supported HDR types: [] mHotPlugFail: null comment: From device test: hotplug count: 4 } Device capabilities: { mSupports4K: true mHdrTypes: [HDR10, HLG, HDR10+] mSurroundAudioFormats: [ENCODING_E_AC3_JOC, ENCODING_AAC_LC, ENCODING_AC3, ENCODING_E_AC3, ENCODING_DTS] mSystemPreferredDisplayMode: null } Capabilities from the EDID : { device product info: { product name: 22EA63 manufacturer name: GSM manufacture week: 5 manufacture year: 2012 model year: -1 } real size: Point(1920, 1080) real metrics: EdidDisplayMetrics{density=0.0, width=1920, height=1080, scaledDensity=0.0, xdpi=102.23899, ydpi=102.35821} audio profiles: [ { Encoding format: ENCODING_PCM_16BIT (2) sampling rates: [32000, 44100, 48000] channel masks: null channel counts: [2] channel index masks: null } ] active display mode: null supported display modes: [ {width=1920, height=1080, fps=60.0, supportedHdrTypes=[]} {width=1920, height=1080, fps=59.94006, supportedHdrTypes=[]} {width=1920, height=1080, fps=50.0, supportedHdrTypes=[]} {width=1680, height=1050, fps=60.0, supportedHdrTypes=[]} {width=1680, height=1050, fps=59.94006, supportedHdrTypes=[]} {width=1400, height=1050, fps=60.0, supportedHdrTypes=[]} {width=1400, height=1050, fps=59.94006, supportedHdrTypes=[]} {width=1280, height=1024, fps=60.0, supportedHdrTypes=[]} {width=1280, height=1024, fps=59.94006, supportedHdrTypes=[]} {width=1600, height=900, fps=60.0, supportedHdrTypes=[]} {width=1600, height=900, fps=59.94006, supportedHdrTypes=[]} {width=1440, height=900, fps=60.0, supportedHdrTypes=[]} {width=1440, height=900, fps=59.94006, supportedHdrTypes=[]} {width=1152, height=864, fps=60.0, supportedHdrTypes=[]} {width=1152, height=864, fps=59.94006, supportedHdrTypes=[]} {width=1280, height=800, fps=60.0, supportedHdrTypes=[]} {width=1280, height=800, fps=59.94006, supportedHdrTypes=[]} {width=1280, height=720, fps=60.0, supportedHdrTypes=[]} {width=1280, height=720, fps=59.94006, supportedHdrTypes=[]} {width=1280, height=720, fps=50.0, supportedHdrTypes=[]} {width=720, height=576, fps=50.0, supportedHdrTypes=[]} {width=720, height=480, fps=60.0, supportedHdrTypes=[]} {width=720, height=480, fps=59.94006, supportedHdrTypes=[]} {width=640, height=480, fps=60.0, supportedHdrTypes=[]} {width=640, height=480, fps=59.94, supportedHdrTypes=[]} ] supported HDR types: [] mHotPlugFail: null comment: /home/xts/tools/android-tvts/./tools/../../android-tvts/testcases/res/EDID/shortlist/bootTestOrderC_defaultMode1920x1080p60Hz.bin } at org.junit.Assert.fail(Assert.java:89) at com.google.android.tvts.hdmi.HdmiEdidHostTest.writeResultToDbFailIfMessageSet(HdmiEdidHostTest.java:824) at com.google.android.tvts.hdmi.HdmiEdidHostTest.testDpiMatch(HdmiEdidHostTest.java:1238) at java.base/jdk.internal.reflect.NativeMethodAccessorImpl.invoke0(Native Method) at java.base/jdk.internal.reflect.NativeMethodAccessorImpl.invoke(NativeMethodAccessorImpl.java:62) at java.base/jdk.internal.reflect.DelegatingMethodAccessorImpl.invoke(DelegatingMethodAccessorImpl.java:43) at java.base/java.lang.reflect.Method.invoke(Method.java:566) at org.junit.runners.model.FrameworkMethod$1.runReflectiveCall(FrameworkMethod.java:59) at org.junit.internal.runners.model.ReflectiveCallable.run(ReflectiveCallable.java:12) at org.junit.runners.model.FrameworkMethod.invokeExplosively(FrameworkMethod.java:61) at org.junit.internal.runners.statements.InvokeMethod.evaluate(InvokeMethod.java:17) at org.junit.internal.runners.statements.RunBefores.evaluate(RunBefores.java:26) at org.junit.internal.runners.statements.RunAfters.evaluate(RunAfters.java:27) at org.junit.rules.ExternalResource$1.evaluate(ExternalResource.java:54) at org.junit.rules.TestWatcher$1.evaluate(TestWatcher.java:61) at org.junit.runners.ParentRunner$3.evaluate(ParentRunner.java:306) at org.junit.runners.BlockJUnit4ClassRunner$1.evaluate(BlockJUnit4ClassRunner.java:100) at org.junit.runners.ParentRunner.runLeaf(ParentRunner.java:366) at org.junit.runners.BlockJUnit4ClassRunner.runChild(BlockJUnit4ClassRunner.java:103) at org.junit.runners.BlockJUnit4ClassRunner.runChild(BlockJUnit4ClassRunner.java:63) at org.junit.runners.ParentRunner$4.run(ParentRunner.java:331) at org.junit.runners.ParentRunner$1.schedule(ParentRunner.java:79) at org.junit.runners.ParentRunner.runChildren(ParentRunner.java:329) at org.junit.runners.ParentRunner$2.evaluate(ParentRunner.java:293) at org.junit.runners.ParentRunner.run(ParentRunner.java:413) at org.junit.runners.Suite.runChild(Suite.java:128) at org.junit.runners.Suite.runChild(Suite.java:27) at org.junit.runners.ParentRunner$4.run(ParentRunner.java:331) at org.junit.runners.ParentRunner$1.schedule(ParentRunner.java:79) at org.junit.runners.ParentRunner.runChildren(ParentRunner.java:329) at org.junit.runners.ParentRunner$2.evaluate(ParentRunner.java:293) at org.junit.internal.runners.statements.RunAfters.evaluate(RunAfters.java:27) at org.junit.runners.ParentRunner$3.evaluate(ParentRunner.java:306) at org.junit.runners.ParentRunner.run(ParentRunner.java:413) at com.android.tradefed.testtype.junit4.ExceptionThrowingRunnerWrapper.run(ExceptionThrowingRunnerWrapper.java:43) at org.junit.runner.JUnitCore.run(JUnitCore.java:137) at com.android.tradefed.testtype.HostTest.runJUnit4Tests(HostTest.java:736) at com.android.tradefed.testtype.HostTest.runTestClasses(HostTest.java:616) at com.android.tradefed.testtype.HostTest.run(HostTest.java:564) at com.android.compatibility.common.tradefed.testtype.JarHostTest.run(JarHostTest.java:56) at com.android.tradefed.testtype.suite.GranularRetriableTestWrapper.intraModuleRun(GranularRetriableTestWrapper.java:366) at com.android.tradefed.testtype.suite.GranularRetriableTestWrapper.run(GranularRetriableTestWrapper.java:277) at com.android.tradefed.testtype.suite.ModuleDefinition.run(ModuleDefinition.java:582) at com.android.tradefed.testtype.suite.ITestSuite.runSingleModule(ITestSuite.java:926) at com.android.tradefed.testtype.suite.ITestSuite.run(ITestSuite.java:806) at com.android.tradefed.invoker.InvocationExecution.runTest(InvocationExecution.java:1335) at com.android.tradefed.invoker.InvocationExecution.runTests(InvocationExecution.java:1114) at com.android.tradefed.invoker.TestInvocation.prepareAndRun(TestInvocation.java:604) at com.android.tradefed.invoker.TestInvocation.performInvocation(TestInvocation.java:274) at com.android.tradefed.invoker.TestInvocation.invoke(TestInvocation.java:1322) at com.android.tradefed.command.CommandScheduler$InvocationThread.run(CommandScheduler.java:646)
com.google.android.tvts.hdmi.HdmiEdidHostTest#testDpiMatch[/home/xts/tools/android-tvts/./tools/../../android-tvts/testcases/res/EDID/shortlist/1723FF2DC6D1.bin : 5]
fail
java.lang.AssertionError: DPI does not match: device reported DPI: 160.0, 160.0 is expected to match EDID DPI calculated from DTD: 60.96, 60.959995 (screen size = 80.0cm x 45.0cm) or EDID DPI calculated from basic display info: 40.304134, 40.341175 (screen size = 121cm x 68cm) Capabilities according to Android APIs: { device product info: { product name: TCL SMART TV manufacturer name: TCL manufacture week: 20 manufacture year: 2015 model year: -1 } real size: Point(1920, 1080) real metrics: EdidDisplayMetrics{density=2.0, width=1920, height=1080, scaledDensity=2.0, xdpi=160.0, ydpi=160.0} audio profiles: [ { Encoding format: ENCODING_PCM_16BIT (2) sampling rates: [32000, 44100, 48000] channel masks: [ 0xC (2 channels) ] channel counts: [2] channel index masks: [] } { Encoding format: ENCODING_AC3 (5) sampling rates: [32000, 44100, 48000] channel masks: [ 0x4 (1 channels) 0xC (2 channels) 0x1C (3 channels) 0x3C (4 channels) 0xCC (4 channels) 0xDC (5 channels) 0xFC (6 channels) 0x40C (3 channels) 0x41C (4 channels) ] channel counts: [1, 2, 3, 3, 4, 4, 4, 5, 6] channel index masks: [] } { Encoding format: ENCODING_E_AC3 (6) sampling rates: [32000, 44100, 48000] channel masks: [ 0x4 (1 channels) 0xC (2 channels) 0x1C (3 channels) 0x3C (4 channels) 0xCC (4 channels) 0xDC (5 channels) 0xFC (6 channels) 0x40C (3 channels) 0x41C (4 channels) 0x4FC (7 channels) 0x18FC (8 channels) ] channel counts: [1, 2, 3, 3, 4, 4, 4, 5, 6, 7, 8] channel index masks: [] } { Encoding format: ENCODING_E_AC3_JOC (18) sampling rates: [32000, 44100, 48000] channel masks: [ 0x4 (1 channels) 0xC (2 channels) 0x1C (3 channels) 0x3C (4 channels) 0xCC (4 channels) 0xDC (5 channels) 0xFC (6 channels) 0x40C (3 channels) 0x41C (4 channels) 0x4FC (7 channels) 0x18FC (8 channels) ] channel counts: [1, 2, 3, 3, 4, 4, 4, 5, 6, 7, 8] channel index masks: [] } ] active display mode: {width=1920, height=1080, fps=59.94006, supportedHdrTypes=[]} supported display modes: [ {width=1920, height=1080, fps=60.000004, supportedHdrTypes=[]} {width=1920, height=1080, fps=59.94006, supportedHdrTypes=[]} {width=1920, height=1080, fps=50.0, supportedHdrTypes=[]} {width=1920, height=1080, fps=30.000002, supportedHdrTypes=[]} {width=1920, height=1080, fps=29.97003, supportedHdrTypes=[]} {width=1920, height=1080, fps=25.0, supportedHdrTypes=[]} {width=1920, height=1080, fps=24.000002, supportedHdrTypes=[]} {width=1920, height=1080, fps=23.976025, supportedHdrTypes=[]} {width=1280, height=720, fps=60.000004, supportedHdrTypes=[]} {width=1280, height=720, fps=59.94006, supportedHdrTypes=[]} {width=1280, height=720, fps=50.0, supportedHdrTypes=[]} {width=720, height=576, fps=50.0, supportedHdrTypes=[]} {width=720, height=480, fps=60.000004, supportedHdrTypes=[]} {width=720, height=480, fps=59.94006, supportedHdrTypes=[]} ] supported HDR types: [] mHotPlugFail: null comment: From device test: hotplug count: 5 } Device capabilities: { mSupports4K: true mHdrTypes: [HDR10, HLG, HDR10+] mSurroundAudioFormats: [ENCODING_E_AC3_JOC, ENCODING_AAC_LC, ENCODING_AC3, ENCODING_E_AC3, ENCODING_DTS] mSystemPreferredDisplayMode: null } Capabilities from the EDID : { device product info: { product name: TCL SMART TV manufacturer name: TCL manufacture week: 20 manufacture year: 2015 model year: -1 } real size: Point(1920, 1080) real metrics: EdidDisplayMetrics{density=0.0, width=1920, height=1080, scaledDensity=0.0, xdpi=60.96, ydpi=60.96} audio profiles: [ { Encoding format: ENCODING_PCM_16BIT (2) sampling rates: [32000, 44100, 48000] channel masks: null channel counts: [2] channel index masks: null } { Encoding format: ENCODING_AC3 (5) sampling rates: [32000, 44100, 48000, 96000] channel masks: null channel counts: [6] channel index masks: null } { Encoding format: ENCODING_E_AC3 (6) sampling rates: [32000, 44100, 48000, 96000] channel masks: null channel counts: [8] channel index masks: null } { Encoding format: ENCODING_E_AC3_JOC (18) sampling rates: [32000, 44100, 48000, 96000] channel masks: null channel counts: [8] channel index masks: null } ] active display mode: null supported display modes: [ {width=1600, height=1200, fps=60.0, supportedHdrTypes=[]} {width=1600, height=1200, fps=59.94006, supportedHdrTypes=[]} {width=1920, height=1080, fps=60.0, supportedHdrTypes=[]} {width=1920, height=1080, fps=59.94006, supportedHdrTypes=[]} {width=1920, height=1080, fps=50.0, supportedHdrTypes=[]} {width=1920, height=1080, fps=30.0, supportedHdrTypes=[]} {width=1920, height=1080, fps=29.97, supportedHdrTypes=[]} {width=1920, height=1080, fps=25.0, supportedHdrTypes=[]} {width=1920, height=1080, fps=24.0, supportedHdrTypes=[]} {width=1920, height=1080, fps=23.98, supportedHdrTypes=[]} {width=1280, height=1024, fps=60.0, supportedHdrTypes=[]} {width=1280, height=1024, fps=59.94006, supportedHdrTypes=[]} {width=1280, height=960, fps=60.0, supportedHdrTypes=[]} {width=1280, height=960, fps=59.94006, supportedHdrTypes=[]} {width=1600, height=900, fps=60.0, supportedHdrTypes=[]} {width=1600, height=900, fps=59.94006, supportedHdrTypes=[]} {width=1366, height=768, fps=59.78954, supportedHdrTypes=[]} {width=1024, height=768, fps=60.0, supportedHdrTypes=[]} {width=1024, height=768, fps=59.94006, supportedHdrTypes=[]} {width=1360, height=765, fps=60.0, supportedHdrTypes=[]} {width=1360, height=765, fps=59.94006, supportedHdrTypes=[]} {width=1280, height=720, fps=60.0, supportedHdrTypes=[]} {width=1280, height=720, fps=59.94006, supportedHdrTypes=[]} {width=1280, height=720, fps=50.0, supportedHdrTypes=[]} {width=800, height=600, fps=60.0, supportedHdrTypes=[]} {width=800, height=600, fps=59.94006, supportedHdrTypes=[]} {width=720, height=576, fps=50.0, supportedHdrTypes=[]} {width=720, height=480, fps=60.0, supportedHdrTypes=[]} {width=720, height=480, fps=59.94, supportedHdrTypes=[]} {width=640, height=480, fps=60.0, supportedHdrTypes=[]} {width=640, height=480, fps=59.94, supportedHdrTypes=[]} ] supported HDR types: [] mHotPlugFail: null comment: /home/xts/tools/android-tvts/./tools/../../android-tvts/testcases/res/EDID/shortlist/1723FF2DC6D1.bin } at org.junit.Assert.fail(Assert.java:89) at com.google.android.tvts.hdmi.HdmiEdidHostTest.writeResultToDbFailIfMessageSet(HdmiEdidHostTest.java:824) at com.google.android.tvts.hdmi.HdmiEdidHostTest.testDpiMatch(HdmiEdidHostTest.java:1238) at java.base/jdk.internal.reflect.NativeMethodAccessorImpl.invoke0(Native Method) at java.base/jdk.internal.reflect.NativeMethodAccessorImpl.invoke(NativeMethodAccessorImpl.java:62) at java.base/jdk.internal.reflect.DelegatingMethodAccessorImpl.invoke(DelegatingMethodAccessorImpl.java:43) at java.base/java.lang.reflect.Method.invoke(Method.java:566) at org.junit.runners.model.FrameworkMethod$1.runReflectiveCall(FrameworkMethod.java:59) at org.junit.internal.runners.model.ReflectiveCallable.run(ReflectiveCallable.java:12) at org.junit.runners.model.FrameworkMethod.invokeExplosively(FrameworkMethod.java:61) at org.junit.internal.runners.statements.InvokeMethod.evaluate(InvokeMethod.java:17) at org.junit.internal.runners.statements.RunBefores.evaluate(RunBefores.java:26) at org.junit.internal.runners.statements.RunAfters.evaluate(RunAfters.java:27) at org.junit.rules.ExternalResource$1.evaluate(ExternalResource.java:54) at org.junit.rules.TestWatcher$1.evaluate(TestWatcher.java:61) at org.junit.runners.ParentRunner$3.evaluate(ParentRunner.java:306) at org.junit.runners.BlockJUnit4ClassRunner$1.evaluate(BlockJUnit4ClassRunner.java:100) at org.junit.runners.ParentRunner.runLeaf(ParentRunner.java:366) at org.junit.runners.BlockJUnit4ClassRunner.runChild(BlockJUnit4ClassRunner.java:103) at org.junit.runners.BlockJUnit4ClassRunner.runChild(BlockJUnit4ClassRunner.java:63) at org.junit.runners.ParentRunner$4.run(ParentRunner.java:331) at org.junit.runners.ParentRunner$1.schedule(ParentRunner.java:79) at org.junit.runners.ParentRunner.runChildren(ParentRunner.java:329) at org.junit.runners.ParentRunner$2.evaluate(ParentRunner.java:293) at org.junit.runners.ParentRunner.run(ParentRunner.java:413) at org.junit.runners.Suite.runChild(Suite.java:128) at org.junit.runners.Suite.runChild(Suite.java:27) at org.junit.runners.ParentRunner$4.run(ParentRunner.java:331) at org.junit.runners.ParentRunner$1.schedule(ParentRunner.java:79) at org.junit.runners.ParentRunner.runChildren(ParentRunner.java:329) at org.junit.runners.ParentRunner$2.evaluate(ParentRunner.java:293) at org.junit.internal.runners.statements.RunAfters.evaluate(RunAfters.java:27) at org.junit.runners.ParentRunner$3.evaluate(ParentRunner.java:306) at org.junit.runners.ParentRunner.run(ParentRunner.java:413) at com.android.tradefed.testtype.junit4.ExceptionThrowingRunnerWrapper.run(ExceptionThrowingRunnerWrapper.java:43) at org.junit.runner.JUnitCore.run(JUnitCore.java:137) at com.android.tradefed.testtype.HostTest.runJUnit4Tests(HostTest.java:736) at com.android.tradefed.testtype.HostTest.runTestClasses(HostTest.java:616) at com.android.tradefed.testtype.HostTest.run(HostTest.java:564) at com.android.compatibility.common.tradefed.testtype.JarHostTest.run(JarHostTest.java:56) at com.android.tradefed.testtype.suite.GranularRetriableTestWrapper.intraModuleRun(GranularRetriableTestWrapper.java:366) at com.android.tradefed.testtype.suite.GranularRetriableTestWrapper.run(GranularRetriableTestWrapper.java:277) at com.android.tradefed.testtype.suite.ModuleDefinition.run(ModuleDefinition.java:582) at com.android.tradefed.testtype.suite.ITestSuite.runSingleModule(ITestSuite.java:926) at com.android.tradefed.testtype.suite.ITestSuite.run(ITestSuite.java:806) at com.android.tradefed.invoker.InvocationExecution.runTest(InvocationExecution.java:1335) at com.android.tradefed.invoker.InvocationExecution.runTests(InvocationExecution.java:1114) at com.android.tradefed.invoker.TestInvocation.prepareAndRun(TestInvocation.java:604) at com.android.tradefed.invoker.TestInvocation.performInvocation(TestInvocation.java:274) at com.android.tradefed.invoker.TestInvocation.invoke(TestInvocation.java:1322) at com.android.tradefed.command.CommandScheduler$InvocationThread.run(CommandScheduler.java:646)
com.google.android.tvts.hdmi.HdmiEdidHostTest#testDpiMatch[/home/xts/tools/android-tvts/./tools/../../android-tvts/testcases/res/EDID/shortlist/43S405.bin : 6]
fail
java.lang.AssertionError: DPI does not match: device reported DPI: 160.0, 160.0 is expected to match EDID DPI calculated from DTD: 60.96, 60.959995 (screen size = 80.0cm x 45.0cm) or EDID DPI calculated from basic display info: 51.88085, 51.758488 (screen size = 94cm x 53cm) Capabilities according to Android APIs: { device product info: { product name: 43S405 manufacturer name: TCL manufacture week: -1 manufacture year: 2018 model year: -1 } real size: Point(1920, 1080) real metrics: EdidDisplayMetrics{density=2.0, width=1920, height=1080, scaledDensity=2.0, xdpi=160.0, ydpi=160.0} audio profiles: [ { Encoding format: ENCODING_PCM_16BIT (2) sampling rates: [32000, 44100, 48000] channel masks: [ 0xC (2 channels) ] channel counts: [2] channel index masks: [] } { Encoding format: ENCODING_AC3 (5) sampling rates: [32000, 44100, 48000] channel masks: [ 0x4 (1 channels) 0xC (2 channels) 0x1C (3 channels) 0x3C (4 channels) 0xCC (4 channels) 0xDC (5 channels) 0xFC (6 channels) 0x40C (3 channels) 0x41C (4 channels) ] channel counts: [1, 2, 3, 3, 4, 4, 4, 5, 6] channel index masks: [] } { Encoding format: ENCODING_E_AC3 (6) sampling rates: [32000, 44100, 48000] channel masks: [ 0x4 (1 channels) 0xC (2 channels) 0x1C (3 channels) 0x3C (4 channels) 0xCC (4 channels) 0xDC (5 channels) 0xFC (6 channels) 0x40C (3 channels) 0x41C (4 channels) 0x4FC (7 channels) 0x18FC (8 channels) ] channel counts: [1, 2, 3, 3, 4, 4, 4, 5, 6, 7, 8] channel index masks: [] } ] active display mode: {width=3840, height=2160, fps=59.94006, supportedHdrTypes=[]} supported display modes: [ {width=4096, height=2160, fps=60.000004, supportedHdrTypes=[]} {width=4096, height=2160, fps=59.94006, supportedHdrTypes=[]} {width=4096, height=2160, fps=30.000002, supportedHdrTypes=[]} {width=4096, height=2160, fps=29.97003, supportedHdrTypes=[]} {width=4096, height=2160, fps=24.000002, supportedHdrTypes=[]} {width=4096, height=2160, fps=23.976025, supportedHdrTypes=[]} {width=3840, height=2160, fps=60.000004, supportedHdrTypes=[]} {width=3840, height=2160, fps=59.94006, supportedHdrTypes=[]} {width=3840, height=2160, fps=30.000002, supportedHdrTypes=[]} {width=3840, height=2160, fps=29.97003, supportedHdrTypes=[]} {width=3840, height=2160, fps=24.000002, supportedHdrTypes=[]} {width=3840, height=2160, fps=23.976025, supportedHdrTypes=[]} {width=1920, height=1080, fps=60.000004, supportedHdrTypes=[]} {width=1920, height=1080, fps=59.94006, supportedHdrTypes=[]} {width=1920, height=1080, fps=30.000002, supportedHdrTypes=[]} {width=1920, height=1080, fps=29.97003, supportedHdrTypes=[]} {width=1920, height=1080, fps=24.000002, supportedHdrTypes=[]} {width=1920, height=1080, fps=23.976025, supportedHdrTypes=[]} {width=1280, height=720, fps=60.000004, supportedHdrTypes=[]} {width=1280, height=720, fps=59.94006, supportedHdrTypes=[]} {width=720, height=480, fps=60.000004, supportedHdrTypes=[]} {width=720, height=480, fps=59.94006, supportedHdrTypes=[]} ] supported HDR types: [] mHotPlugFail: null comment: From device test: hotplug count: 6 } Device capabilities: { mSupports4K: true mHdrTypes: [HDR10, HLG, HDR10+] mSurroundAudioFormats: [ENCODING_E_AC3_JOC, ENCODING_AAC_LC, ENCODING_AC3, ENCODING_E_AC3, ENCODING_DTS] mSystemPreferredDisplayMode: null } Capabilities from the EDID : { device product info: { product name: 43S405 manufacturer name: TCL manufacture week: -1 manufacture year: 2018 model year: -1 } real size: Point(3840, 2160) real metrics: EdidDisplayMetrics{density=0.0, width=3840, height=2160, scaledDensity=0.0, xdpi=121.92, ydpi=121.92} audio profiles: [ { Encoding format: ENCODING_PCM_16BIT (2) sampling rates: [32000, 44100, 48000] channel masks: null channel counts: [2] channel index masks: null } { Encoding format: ENCODING_AC3 (5) sampling rates: [32000, 44100, 48000] channel masks: null channel counts: [6] channel index masks: null } { Encoding format: ENCODING_E_AC3 (6) sampling rates: [32000, 44100, 48000] channel masks: null channel counts: [8] channel index masks: null } ] active display mode: null supported display modes: [ {width=4096, height=2160, fps=60.0, supportedHdrTypes=[]} {width=4096, height=2160, fps=59.94, supportedHdrTypes=[]} {width=4096, height=2160, fps=30.0, supportedHdrTypes=[]} {width=4096, height=2160, fps=29.97, supportedHdrTypes=[]} {width=4096, height=2160, fps=24.0, supportedHdrTypes=[]} {width=4096, height=2160, fps=23.98, supportedHdrTypes=[]} {width=3840, height=2160, fps=60.0, supportedHdrTypes=[]} {width=3840, height=2160, fps=59.94006, supportedHdrTypes=[]} {width=3840, height=2160, fps=30.0, supportedHdrTypes=[]} {width=3840, height=2160, fps=29.97003, supportedHdrTypes=[]} {width=3840, height=2160, fps=24.0, supportedHdrTypes=[]} {width=3840, height=2160, fps=23.98, supportedHdrTypes=[]} {width=1920, height=1080, fps=60.0, supportedHdrTypes=[]} {width=1920, height=1080, fps=59.94006, supportedHdrTypes=[]} {width=1920, height=1080, fps=30.0, supportedHdrTypes=[]} {width=1920, height=1080, fps=29.97, supportedHdrTypes=[]} {width=1920, height=1080, fps=24.0, supportedHdrTypes=[]} {width=1920, height=1080, fps=23.98, supportedHdrTypes=[]} {width=1680, height=1050, fps=60.0, supportedHdrTypes=[]} {width=1680, height=1050, fps=59.94006, supportedHdrTypes=[]} {width=1280, height=1024, fps=60.0, supportedHdrTypes=[]} {width=1280, height=1024, fps=59.94006, supportedHdrTypes=[]} {width=1280, height=960, fps=60.0, supportedHdrTypes=[]} {width=1280, height=960, fps=59.94006, supportedHdrTypes=[]} {width=1440, height=900, fps=60.0, supportedHdrTypes=[]} {width=1440, height=900, fps=59.94006, supportedHdrTypes=[]} {width=1152, height=864, fps=75.0, supportedHdrTypes=[]} {width=1280, height=800, fps=60.0, supportedHdrTypes=[]} {width=1280, height=800, fps=59.94006, supportedHdrTypes=[]} {width=1360, height=768, fps=60.015163, supportedHdrTypes=[]} {width=1280, height=720, fps=60.0, supportedHdrTypes=[]} {width=1280, height=720, fps=59.94006, supportedHdrTypes=[]} {width=1280, height=720, fps=30.0, supportedHdrTypes=[]} {width=1280, height=720, fps=29.97, supportedHdrTypes=[]} {width=1280, height=720, fps=24.0, supportedHdrTypes=[]} {width=1280, height=720, fps=23.98, supportedHdrTypes=[]} {width=720, height=480, fps=60.0, supportedHdrTypes=[]} {width=720, height=480, fps=59.94, supportedHdrTypes=[]} {width=640, height=480, fps=60.0, supportedHdrTypes=[]} {width=640, height=480, fps=59.94, supportedHdrTypes=[]} ] supported HDR types: [] mHotPlugFail: null comment: /home/xts/tools/android-tvts/./tools/../../android-tvts/testcases/res/EDID/shortlist/43S405.bin } at org.junit.Assert.fail(Assert.java:89) at com.google.android.tvts.hdmi.HdmiEdidHostTest.writeResultToDbFailIfMessageSet(HdmiEdidHostTest.java:824) at com.google.android.tvts.hdmi.HdmiEdidHostTest.testDpiMatch(HdmiEdidHostTest.java:1238) at java.base/jdk.internal.reflect.NativeMethodAccessorImpl.invoke0(Native Method) at java.base/jdk.internal.reflect.NativeMethodAccessorImpl.invoke(NativeMethodAccessorImpl.java:62) at java.base/jdk.internal.reflect.DelegatingMethodAccessorImpl.invoke(DelegatingMethodAccessorImpl.java:43) at java.base/java.lang.reflect.Method.invoke(Method.java:566) at org.junit.runners.model.FrameworkMethod$1.runReflectiveCall(FrameworkMethod.java:59) at org.junit.internal.runners.model.ReflectiveCallable.run(ReflectiveCallable.java:12) at org.junit.runners.model.FrameworkMethod.invokeExplosively(FrameworkMethod.java:61) at org.junit.internal.runners.statements.InvokeMethod.evaluate(InvokeMethod.java:17) at org.junit.internal.runners.statements.RunBefores.evaluate(RunBefores.java:26) at org.junit.internal.runners.statements.RunAfters.evaluate(RunAfters.java:27) at org.junit.rules.ExternalResource$1.evaluate(ExternalResource.java:54) at org.junit.rules.TestWatcher$1.evaluate(TestWatcher.java:61) at org.junit.runners.ParentRunner$3.evaluate(ParentRunner.java:306) at org.junit.runners.BlockJUnit4ClassRunner$1.evaluate(BlockJUnit4ClassRunner.java:100) at org.junit.runners.ParentRunner.runLeaf(ParentRunner.java:366) at org.junit.runners.BlockJUnit4ClassRunner.runChild(BlockJUnit4ClassRunner.java:103) at org.junit.runners.BlockJUnit4ClassRunner.runChild(BlockJUnit4ClassRunner.java:63) at org.junit.runners.ParentRunner$4.run(ParentRunner.java:331) at org.junit.runners.ParentRunner$1.schedule(ParentRunner.java:79) at org.junit.runners.ParentRunner.runChildren(ParentRunner.java:329) at org.junit.runners.ParentRunner$2.evaluate(ParentRunner.java:293) at org.junit.runners.ParentRunner.run(ParentRunner.java:413) at org.junit.runners.Suite.runChild(Suite.java:128) at org.junit.runners.Suite.runChild(Suite.java:27) at org.junit.runners.ParentRunner$4.run(ParentRunner.java:331) at org.junit.runners.ParentRunner$1.schedule(ParentRunner.java:79) at org.junit.runners.ParentRunner.runChildren(ParentRunner.java:329) at org.junit.runners.ParentRunner$2.evaluate(ParentRunner.java:293) at org.junit.internal.runners.statements.RunAfters.evaluate(RunAfters.java:27) at org.junit.runners.ParentRunner$3.evaluate(ParentRunner.java:306) at org.junit.runners.ParentRunner.run(ParentRunner.java:413) at com.android.tradefed.testtype.junit4.ExceptionThrowingRunnerWrapper.run(ExceptionThrowingRunnerWrapper.java:43) at org.junit.runner.JUnitCore.run(JUnitCore.java:137) at com.android.tradefed.testtype.HostTest.runJUnit4Tests(HostTest.java:736) at com.android.tradefed.testtype.HostTest.runTestClasses(HostTest.java:616) at com.android.tradefed.testtype.HostTest.run(HostTest.java:564) at com.android.compatibility.common.tradefed.testtype.JarHostTest.run(JarHostTest.java:56) at com.android.tradefed.testtype.suite.GranularRetriableTestWrapper.intraModuleRun(GranularRetriableTestWrapper.java:366) at com.android.tradefed.testtype.suite.GranularRetriableTestWrapper.run(GranularRetriableTestWrapper.java:277) at com.android.tradefed.testtype.suite.ModuleDefinition.run(ModuleDefinition.java:582) at com.android.tradefed.testtype.suite.ITestSuite.runSingleModule(ITestSuite.java:926) at com.android.tradefed.testtype.suite.ITestSuite.run(ITestSuite.java:806) at com.android.tradefed.invoker.InvocationExecution.runTest(InvocationExecution.java:1335) at com.android.tradefed.invoker.InvocationExecution.runTests(InvocationExecution.java:1114) at com.android.tradefed.invoker.TestInvocation.prepareAndRun(TestInvocation.java:604) at com.android.tradefed.invoker.TestInvocation.performInvocation(TestInvocation.java:274) at com.android.tradefed.invoker.TestInvocation.invoke(TestInvocation.java:1322) at com.android.tradefed.command.CommandScheduler$InvocationThread.run(CommandScheduler.java:646)
com.google.android.tvts.hdmi.HdmiEdidHostTest#testDpiMatch[/home/xts/tools/android-tvts/./tools/../../android-tvts/testcases/res/EDID/shortlist/67DBD3E84099.bin : 7]
fail
java.lang.AssertionError: DPI does not match: device reported DPI: 160.0, 160.0 is expected to match EDID DPI calculated from DTD: 60.96, 60.959995 (screen size = 80.0cm x 45.0cm) or EDID DPI calculated from basic display info: 54.7955, 54.864 (screen size = 89cm x 50cm) Capabilities according to Android APIs: { device product info: { product name: TCL manufacturer name: TCL manufacture week: 4 manufacture year: 2013 model year: -1 } real size: Point(1920, 1080) real metrics: EdidDisplayMetrics{density=2.0, width=1920, height=1080, scaledDensity=2.0, xdpi=160.0, ydpi=160.0} audio profiles: [ { Encoding format: ENCODING_PCM_16BIT (2) sampling rates: [32000, 44100, 48000, 88200, 96000, 176400, 192000] channel masks: [ 0xC (2 channels) ] channel counts: [2] channel index masks: [] } { Encoding format: ENCODING_AC3 (5) sampling rates: [32000, 44100, 48000] channel masks: [ 0x4 (1 channels) 0xC (2 channels) 0x1C (3 channels) 0x3C (4 channels) 0xCC (4 channels) 0xDC (5 channels) 0xFC (6 channels) 0x40C (3 channels) 0x41C (4 channels) ] channel counts: [1, 2, 3, 3, 4, 4, 4, 5, 6] channel index masks: [] } { Encoding format: ENCODING_E_AC3 (6) sampling rates: [32000, 44100, 48000] channel masks: [ 0x4 (1 channels) 0xC (2 channels) 0x1C (3 channels) 0x3C (4 channels) 0xCC (4 channels) 0xDC (5 channels) 0xFC (6 channels) 0x40C (3 channels) 0x41C (4 channels) 0x4FC (7 channels) 0x18FC (8 channels) ] channel counts: [1, 2, 3, 3, 4, 4, 4, 5, 6, 7, 8] channel index masks: [] } { Encoding format: ENCODING_DTS (7) sampling rates: [32000, 44100, 48000] channel masks: [ 0x4 (1 channels) 0xC (2 channels) 0x1C (3 channels) 0x3C (4 channels) 0xCC (4 channels) 0xDC (5 channels) 0xFC (6 channels) 0x40C (3 channels) 0x41C (4 channels) ] channel counts: [1, 2, 3, 3, 4, 4, 4, 5, 6] channel index masks: [] } ] active display mode: {width=1920, height=1080, fps=59.94006, supportedHdrTypes=[]} supported display modes: [ {width=1920, height=1080, fps=60.000004, supportedHdrTypes=[]} {width=1920, height=1080, fps=59.94006, supportedHdrTypes=[]} {width=1920, height=1080, fps=50.0, supportedHdrTypes=[]} {width=1920, height=1080, fps=30.000002, supportedHdrTypes=[]} {width=1920, height=1080, fps=29.97003, supportedHdrTypes=[]} {width=1920, height=1080, fps=25.0, supportedHdrTypes=[]} {width=1920, height=1080, fps=24.000002, supportedHdrTypes=[]} {width=1920, height=1080, fps=23.976025, supportedHdrTypes=[]} {width=1280, height=720, fps=60.000004, supportedHdrTypes=[]} {width=1280, height=720, fps=59.94006, supportedHdrTypes=[]} {width=1280, height=720, fps=50.0, supportedHdrTypes=[]} {width=720, height=576, fps=50.0, supportedHdrTypes=[]} {width=720, height=480, fps=60.000004, supportedHdrTypes=[]} {width=720, height=480, fps=59.94006, supportedHdrTypes=[]} ] supported HDR types: [] mHotPlugFail: null comment: From device test: hotplug count: 7 } Device capabilities: { mSupports4K: true mHdrTypes: [HDR10, HLG, HDR10+] mSurroundAudioFormats: [ENCODING_E_AC3_JOC, ENCODING_AAC_LC, ENCODING_AC3, ENCODING_E_AC3, ENCODING_DTS] mSystemPreferredDisplayMode: null } Capabilities from the EDID : { device product info: { product name: TCL manufacturer name: TCL manufacture week: 4 manufacture year: 2013 model year: -1 } real size: Point(1920, 1080) real metrics: EdidDisplayMetrics{density=0.0, width=1920, height=1080, scaledDensity=0.0, xdpi=60.96, ydpi=60.96} audio profiles: [ { Encoding format: ENCODING_PCM_16BIT (2) sampling rates: [32000, 44100, 48000, 88200, 96000, 176400, 192000] channel masks: null channel counts: [2] channel index masks: null } { Encoding format: ENCODING_AC3 (5) sampling rates: [32000, 44100, 48000, 88200, 96000, 176400, 192000] channel masks: null channel counts: [6] channel index masks: null } { Encoding format: ENCODING_E_AC3 (6) sampling rates: [32000, 44100, 48000] channel masks: null channel counts: [8] channel index masks: null } { Encoding format: ENCODING_DTS (7) sampling rates: [32000, 44100, 48000] channel masks: null channel counts: [6] channel index masks: null } ] active display mode: null supported display modes: [ {width=1920, height=1080, fps=60.0, supportedHdrTypes=[]} {width=1920, height=1080, fps=59.94006, supportedHdrTypes=[]} {width=1920, height=1080, fps=50.0, supportedHdrTypes=[]} {width=1920, height=1080, fps=30.0, supportedHdrTypes=[]} {width=1920, height=1080, fps=29.97, supportedHdrTypes=[]} {width=1920, height=1080, fps=25.0, supportedHdrTypes=[]} {width=1920, height=1080, fps=24.0, supportedHdrTypes=[]} {width=1920, height=1080, fps=23.98, supportedHdrTypes=[]} {width=1280, height=1024, fps=60.0, supportedHdrTypes=[]} {width=1280, height=1024, fps=59.94006, supportedHdrTypes=[]} {width=1280, height=720, fps=60.0, supportedHdrTypes=[]} {width=1280, height=720, fps=59.94006, supportedHdrTypes=[]} {width=1280, height=720, fps=50.0, supportedHdrTypes=[]} {width=960, height=600, fps=75.0, supportedHdrTypes=[]} {width=720, height=576, fps=50.0, supportedHdrTypes=[]} {width=720, height=480, fps=60.0, supportedHdrTypes=[]} {width=720, height=480, fps=59.94, supportedHdrTypes=[]} {width=640, height=480, fps=60.0, supportedHdrTypes=[]} {width=640, height=480, fps=59.94, supportedHdrTypes=[]} ] supported HDR types: [] mHotPlugFail: null comment: /home/xts/tools/android-tvts/./tools/../../android-tvts/testcases/res/EDID/shortlist/67DBD3E84099.bin } at org.junit.Assert.fail(Assert.java:89) at com.google.android.tvts.hdmi.HdmiEdidHostTest.writeResultToDbFailIfMessageSet(HdmiEdidHostTest.java:824) at com.google.android.tvts.hdmi.HdmiEdidHostTest.testDpiMatch(HdmiEdidHostTest.java:1238) at java.base/jdk.internal.reflect.NativeMethodAccessorImpl.invoke0(Native Method) at java.base/jdk.internal.reflect.NativeMethodAccessorImpl.invoke(NativeMethodAccessorImpl.java:62) at java.base/jdk.internal.reflect.DelegatingMethodAccessorImpl.invoke(DelegatingMethodAccessorImpl.java:43) at java.base/java.lang.reflect.Method.invoke(Method.java:566) at org.junit.runners.model.FrameworkMethod$1.runReflectiveCall(FrameworkMethod.java:59) at org.junit.internal.runners.model.ReflectiveCallable.run(ReflectiveCallable.java:12) at org.junit.runners.model.FrameworkMethod.invokeExplosively(FrameworkMethod.java:61) at org.junit.internal.runners.statements.InvokeMethod.evaluate(InvokeMethod.java:17) at org.junit.internal.runners.statements.RunBefores.evaluate(RunBefores.java:26) at org.junit.internal.runners.statements.RunAfters.evaluate(RunAfters.java:27) at org.junit.rules.ExternalResource$1.evaluate(ExternalResource.java:54) at org.junit.rules.TestWatcher$1.evaluate(TestWatcher.java:61) at org.junit.runners.ParentRunner$3.evaluate(ParentRunner.java:306) at org.junit.runners.BlockJUnit4ClassRunner$1.evaluate(BlockJUnit4ClassRunner.java:100) at org.junit.runners.ParentRunner.runLeaf(ParentRunner.java:366) at org.junit.runners.BlockJUnit4ClassRunner.runChild(BlockJUnit4ClassRunner.java:103) at org.junit.runners.BlockJUnit4ClassRunner.runChild(BlockJUnit4ClassRunner.java:63) at org.junit.runners.ParentRunner$4.run(ParentRunner.java:331) at org.junit.runners.ParentRunner$1.schedule(ParentRunner.java:79) at org.junit.runners.ParentRunner.runChildren(ParentRunner.java:329) at org.junit.runners.ParentRunner$2.evaluate(ParentRunner.java:293) at org.junit.runners.ParentRunner.run(ParentRunner.java:413) at org.junit.runners.Suite.runChild(Suite.java:128) at org.junit.runners.Suite.runChild(Suite.java:27) at org.junit.runners.ParentRunner$4.run(ParentRunner.java:331) at org.junit.runners.ParentRunner$1.schedule(ParentRunner.java:79) at org.junit.runners.ParentRunner.runChildren(ParentRunner.java:329) at org.junit.runners.ParentRunner$2.evaluate(ParentRunner.java:293) at org.junit.internal.runners.statements.RunAfters.evaluate(RunAfters.java:27) at org.junit.runners.ParentRunner$3.evaluate(ParentRunner.java:306) at org.junit.runners.ParentRunner.run(ParentRunner.java:413) at com.android.tradefed.testtype.junit4.ExceptionThrowingRunnerWrapper.run(ExceptionThrowingRunnerWrapper.java:43) at org.junit.runner.JUnitCore.run(JUnitCore.java:137) at com.android.tradefed.testtype.HostTest.runJUnit4Tests(HostTest.java:736) at com.android.tradefed.testtype.HostTest.runTestClasses(HostTest.java:616) at com.android.tradefed.testtype.HostTest.run(HostTest.java:564) at com.android.compatibility.common.tradefed.testtype.JarHostTest.run(JarHostTest.java:56) at com.android.tradefed.testtype.suite.GranularRetriableTestWrapper.intraModuleRun(GranularRetriableTestWrapper.java:366) at com.android.tradefed.testtype.suite.GranularRetriableTestWrapper.run(GranularRetriableTestWrapper.java:277) at com.android.tradefed.testtype.suite.ModuleDefinition.run(ModuleDefinition.java:582) at com.android.tradefed.testtype.suite.ITestSuite.runSingleModule(ITestSuite.java:926) at com.android.tradefed.testtype.suite.ITestSuite.run(ITestSuite.java:806) at com.android.tradefed.invoker.InvocationExecution.runTest(InvocationExecution.java:1335) at com.android.tradefed.invoker.InvocationExecution.runTests(InvocationExecution.java:1114) at com.android.tradefed.invoker.TestInvocation.prepareAndRun(TestInvocation.java:604) at com.android.tradefed.invoker.TestInvocation.performInvocation(TestInvocation.java:274) at com.android.tradefed.invoker.TestInvocation.invoke(TestInvocation.java:1322) at com.android.tradefed.command.CommandScheduler$InvocationThread.run(CommandScheduler.java:646)
com.google.android.tvts.hdmi.HdmiEdidHostTest#testDpiMatch[/home/xts/tools/android-tvts/./tools/../../android-tvts/testcases/res/EDID/shortlist/bootTestOrderA_defaultMode3840x2160p60Hz.bin : 8]
fail
java.lang.AssertionError: DPI does not match: device reported DPI: 160.0, 160.0 is expected to match EDID DPI calculated from DTD: 81.28, 80.68235 (screen size = 60.0cm x 34.0cm) or EDID DPI calculated from basic display info: 81.28, 80.68235 (screen size = 60cm x 34cm) Capabilities according to Android APIs: { device product info: { product name: LG HDR 4K manufacturer name: GSM manufacture week: 2 manufacture year: 2021 model year: -1 } real size: Point(1920, 1080) real metrics: EdidDisplayMetrics{density=2.0, width=1920, height=1080, scaledDensity=2.0, xdpi=160.0, ydpi=160.0} audio profiles: [ { Encoding format: ENCODING_PCM_16BIT (2) sampling rates: [32000, 44100, 48000] channel masks: [ 0xC (2 channels) ] channel counts: [2] channel index masks: [] } ] active display mode: {width=3840, height=2160, fps=59.94006, supportedHdrTypes=[]} supported display modes: [ {width=3840, height=2160, fps=60.000004, supportedHdrTypes=[]} {width=3840, height=2160, fps=59.94006, supportedHdrTypes=[]} {width=3840, height=2160, fps=50.0, supportedHdrTypes=[]} {width=3840, height=2160, fps=30.000002, supportedHdrTypes=[]} {width=3840, height=2160, fps=29.97003, supportedHdrTypes=[]} {width=3840, height=2160, fps=25.0, supportedHdrTypes=[]} {width=3840, height=2160, fps=24.000002, supportedHdrTypes=[]} {width=3840, height=2160, fps=23.976025, supportedHdrTypes=[]} {width=1920, height=1080, fps=60.000004, supportedHdrTypes=[]} {width=1920, height=1080, fps=59.94006, supportedHdrTypes=[]} {width=1920, height=1080, fps=50.0, supportedHdrTypes=[]} {width=1920, height=1080, fps=30.000002, supportedHdrTypes=[]} {width=1920, height=1080, fps=29.97003, supportedHdrTypes=[]} {width=1920, height=1080, fps=24.000002, supportedHdrTypes=[]} {width=1920, height=1080, fps=23.976025, supportedHdrTypes=[]} {width=1280, height=720, fps=60.000004, supportedHdrTypes=[]} {width=1280, height=720, fps=59.94006, supportedHdrTypes=[]} {width=720, height=576, fps=50.0, supportedHdrTypes=[]} {width=720, height=480, fps=60.000004, supportedHdrTypes=[]} {width=720, height=480, fps=59.94006, supportedHdrTypes=[]} ] supported HDR types: [HDR10] mHotPlugFail: null comment: From device test: hotplug count: 8 } Device capabilities: { mSupports4K: true mHdrTypes: [HDR10, HLG, HDR10+] mSurroundAudioFormats: [ENCODING_E_AC3_JOC, ENCODING_AAC_LC, ENCODING_AC3, ENCODING_E_AC3, ENCODING_DTS] mSystemPreferredDisplayMode: null } Capabilities from the EDID : { device product info: { product name: LG HDR 4K manufacturer name: GSM manufacture week: 2 manufacture year: 2021 model year: -1 } real size: Point(3840, 2160) real metrics: EdidDisplayMetrics{density=0.0, width=3840, height=2160, scaledDensity=0.0, xdpi=162.56, ydpi=161.3647} audio profiles: [ { Encoding format: ENCODING_PCM_16BIT (2) sampling rates: [32000, 44100, 48000] channel masks: null channel counts: [2] channel index masks: null } ] active display mode: null supported display modes: [ {width=3840, height=2160, fps=60.0, supportedHdrTypes=[]} {width=3840, height=2160, fps=59.94006, supportedHdrTypes=[]} {width=3840, height=2160, fps=50.0, supportedHdrTypes=[]} {width=3840, height=2160, fps=30.0, supportedHdrTypes=[]} {width=3840, height=2160, fps=29.97003, supportedHdrTypes=[]} {width=3840, height=2160, fps=25.0, supportedHdrTypes=[]} {width=3840, height=2160, fps=24.0, supportedHdrTypes=[]} {width=3840, height=2160, fps=23.98, supportedHdrTypes=[]} {width=2560, height=1440, fps=59.95055, supportedHdrTypes=[]} {width=1920, height=1080, fps=60.0, supportedHdrTypes=[]} {width=1920, height=1080, fps=59.94006, supportedHdrTypes=[]} {width=1920, height=1080, fps=50.0, supportedHdrTypes=[]} {width=1920, height=1080, fps=30.0, supportedHdrTypes=[]} {width=1920, height=1080, fps=29.97, supportedHdrTypes=[]} {width=1920, height=1080, fps=24.0, supportedHdrTypes=[]} {width=1920, height=1080, fps=23.98, supportedHdrTypes=[]} {width=1280, height=1024, fps=60.0, supportedHdrTypes=[]} {width=1280, height=1024, fps=59.94006, supportedHdrTypes=[]} {width=1600, height=900, fps=60.0, supportedHdrTypes=[]} {width=1600, height=900, fps=59.94006, supportedHdrTypes=[]} {width=1152, height=864, fps=60.0, supportedHdrTypes=[]} {width=1152, height=864, fps=59.94006, supportedHdrTypes=[]} {width=1280, height=800, fps=60.0, supportedHdrTypes=[]} {width=1280, height=800, fps=59.94006, supportedHdrTypes=[]} {width=1280, height=720, fps=60.0, supportedHdrTypes=[]} {width=1280, height=720, fps=59.94006, supportedHdrTypes=[]} {width=720, height=576, fps=50.0, supportedHdrTypes=[]} {width=720, height=480, fps=60.0, supportedHdrTypes=[]} {width=720, height=480, fps=59.94, supportedHdrTypes=[]} {width=640, height=480, fps=60.0, supportedHdrTypes=[]} {width=640, height=480, fps=59.94, supportedHdrTypes=[]} ] supported HDR types: [HDR10] mHotPlugFail: null comment: /home/xts/tools/android-tvts/./tools/../../android-tvts/testcases/res/EDID/shortlist/bootTestOrderA_defaultMode3840x2160p60Hz.bin } at org.junit.Assert.fail(Assert.java:89) at com.google.android.tvts.hdmi.HdmiEdidHostTest.writeResultToDbFailIfMessageSet(HdmiEdidHostTest.java:824) at com.google.android.tvts.hdmi.HdmiEdidHostTest.testDpiMatch(HdmiEdidHostTest.java:1238) at java.base/jdk.internal.reflect.NativeMethodAccessorImpl.invoke0(Native Method) at java.base/jdk.internal.reflect.NativeMethodAccessorImpl.invoke(NativeMethodAccessorImpl.java:62) at java.base/jdk.internal.reflect.DelegatingMethodAccessorImpl.invoke(DelegatingMethodAccessorImpl.java:43) at java.base/java.lang.reflect.Method.invoke(Method.java:566) at org.junit.runners.model.FrameworkMethod$1.runReflectiveCall(FrameworkMethod.java:59) at org.junit.internal.runners.model.ReflectiveCallable.run(ReflectiveCallable.java:12) at org.junit.runners.model.FrameworkMethod.invokeExplosively(FrameworkMethod.java:61) at org.junit.internal.runners.statements.InvokeMethod.evaluate(InvokeMethod.java:17) at org.junit.internal.runners.statements.RunBefores.evaluate(RunBefores.java:26) at org.junit.internal.runners.statements.RunAfters.evaluate(RunAfters.java:27) at org.junit.rules.ExternalResource$1.evaluate(ExternalResource.java:54) at org.junit.rules.TestWatcher$1.evaluate(TestWatcher.java:61) at org.junit.runners.ParentRunner$3.evaluate(ParentRunner.java:306) at org.junit.runners.BlockJUnit4ClassRunner$1.evaluate(BlockJUnit4ClassRunner.java:100) at org.junit.runners.ParentRunner.runLeaf(ParentRunner.java:366) at org.junit.runners.BlockJUnit4ClassRunner.runChild(BlockJUnit4ClassRunner.java:103) at org.junit.runners.BlockJUnit4ClassRunner.runChild(BlockJUnit4ClassRunner.java:63) at org.junit.runners.ParentRunner$4.run(ParentRunner.java:331) at org.junit.runners.ParentRunner$1.schedule(ParentRunner.java:79) at org.junit.runners.ParentRunner.runChildren(ParentRunner.java:329) at org.junit.runners.ParentRunner$2.evaluate(ParentRunner.java:293) at org.junit.runners.ParentRunner.run(ParentRunner.java:413) at org.junit.runners.Suite.runChild(Suite.java:128) at org.junit.runners.Suite.runChild(Suite.java:27) at org.junit.runners.ParentRunner$4.run(ParentRunner.java:331) at org.junit.runners.ParentRunner$1.schedule(ParentRunner.java:79) at org.junit.runners.ParentRunner.runChildren(ParentRunner.java:329) at org.junit.runners.ParentRunner$2.evaluate(ParentRunner.java:293) at org.junit.internal.runners.statements.RunAfters.evaluate(RunAfters.java:27) at org.junit.runners.ParentRunner$3.evaluate(ParentRunner.java:306) at org.junit.runners.ParentRunner.run(ParentRunner.java:413) at com.android.tradefed.testtype.junit4.ExceptionThrowingRunnerWrapper.run(ExceptionThrowingRunnerWrapper.java:43) at org.junit.runner.JUnitCore.run(JUnitCore.java:137) at com.android.tradefed.testtype.HostTest.runJUnit4Tests(HostTest.java:736) at com.android.tradefed.testtype.HostTest.runTestClasses(HostTest.java:616) at com.android.tradefed.testtype.HostTest.run(HostTest.java:564) at com.android.compatibility.common.tradefed.testtype.JarHostTest.run(JarHostTest.java:56) at com.android.tradefed.testtype.suite.GranularRetriableTestWrapper.intraModuleRun(GranularRetriableTestWrapper.java:366) at com.android.tradefed.testtype.suite.GranularRetriableTestWrapper.run(GranularRetriableTestWrapper.java:277) at com.android.tradefed.testtype.suite.ModuleDefinition.run(ModuleDefinition.java:582) at com.android.tradefed.testtype.suite.ITestSuite.runSingleModule(ITestSuite.java:926) at com.android.tradefed.testtype.suite.ITestSuite.run(ITestSuite.java:806) at com.android.tradefed.invoker.InvocationExecution.runTest(InvocationExecution.java:1335) at com.android.tradefed.invoker.InvocationExecution.runTests(InvocationExecution.java:1114) at com.android.tradefed.invoker.TestInvocation.prepareAndRun(TestInvocation.java:604) at com.android.tradefed.invoker.TestInvocation.performInvocation(TestInvocation.java:274) at com.android.tradefed.invoker.TestInvocation.invoke(TestInvocation.java:1322) at com.android.tradefed.command.CommandScheduler$InvocationThread.run(CommandScheduler.java:646)
com.google.android.tvts.hdmi.HdmiEdidHostTest#testDpiMatch[/home/xts/tools/android-tvts/./tools/../../android-tvts/testcases/res/EDID/shortlist/19DF6A5AE0BC.bin : 9]
fail
java.lang.AssertionError: DPI does not match: device reported DPI: 160.0, 160.0 is expected to match EDID DPI calculated from DTD: 68.881355, 68.92462 (screen size = 70.799995cm x 39.8cm) or EDID DPI calculated from basic display info: 69.66857, 70.33846 (screen size = 70cm x 39cm) Capabilities according to Android APIs: { device product info: { product name: SGD FRCX manufacturer name: SGD manufacture week: 49 manufacture year: 2013 model year: -1 } real size: Point(1920, 1080) real metrics: EdidDisplayMetrics{density=2.0, width=1920, height=1080, scaledDensity=2.0, xdpi=160.0, ydpi=160.0} audio profiles: [ { Encoding format: ENCODING_PCM_16BIT (2) sampling rates: [32000, 44100, 48000, 88200, 96000, 176400, 192000] channel masks: [ 0xC (2 channels) ] channel counts: [2] channel index masks: [] } { Encoding format: ENCODING_AC3 (5) sampling rates: [32000, 44100, 48000] channel masks: [ 0x4 (1 channels) 0xC (2 channels) 0x1C (3 channels) 0x3C (4 channels) 0xCC (4 channels) 0xDC (5 channels) 0xFC (6 channels) 0x40C (3 channels) 0x41C (4 channels) ] channel counts: [1, 2, 3, 3, 4, 4, 4, 5, 6] channel index masks: [] } { Encoding format: ENCODING_E_AC3 (6) sampling rates: [32000, 44100, 48000] channel masks: [ 0x4 (1 channels) 0xC (2 channels) 0x1C (3 channels) 0x3C (4 channels) 0xCC (4 channels) 0xDC (5 channels) 0xFC (6 channels) 0x40C (3 channels) 0x41C (4 channels) ] channel counts: [1, 2, 3, 3, 4, 4, 4, 5, 6] channel index masks: [] } { Encoding format: ENCODING_DTS (7) sampling rates: [32000, 44100, 48000] channel masks: [ 0x4 (1 channels) 0xC (2 channels) 0x1C (3 channels) 0x3C (4 channels) 0xCC (4 channels) 0xDC (5 channels) 0xFC (6 channels) 0x40C (3 channels) 0x41C (4 channels) 0x4FC (7 channels) 0x18FC (8 channels) ] channel counts: [1, 2, 3, 3, 4, 4, 4, 5, 6, 7, 8] channel index masks: [] } ] active display mode: {width=1920, height=1080, fps=59.94006, supportedHdrTypes=[]} supported display modes: [ {width=4096, height=2160, fps=24.000002, supportedHdrTypes=[]} {width=4096, height=2160, fps=23.976025, supportedHdrTypes=[]} {width=3840, height=2160, fps=30.000002, supportedHdrTypes=[]} {width=3840, height=2160, fps=29.97003, supportedHdrTypes=[]} {width=3840, height=2160, fps=25.0, supportedHdrTypes=[]} {width=3840, height=2160, fps=24.000002, supportedHdrTypes=[]} {width=3840, height=2160, fps=23.976025, supportedHdrTypes=[]} {width=1920, height=1080, fps=60.000004, supportedHdrTypes=[]} {width=1920, height=1080, fps=59.94006, supportedHdrTypes=[]} {width=1920, height=1080, fps=50.0, supportedHdrTypes=[]} {width=1920, height=1080, fps=30.000002, supportedHdrTypes=[]} {width=1920, height=1080, fps=29.97003, supportedHdrTypes=[]} {width=1920, height=1080, fps=25.0, supportedHdrTypes=[]} {width=1920, height=1080, fps=24.000002, supportedHdrTypes=[]} {width=1920, height=1080, fps=23.976025, supportedHdrTypes=[]} {width=1280, height=720, fps=60.000004, supportedHdrTypes=[]} {width=1280, height=720, fps=59.94006, supportedHdrTypes=[]} {width=1280, height=720, fps=50.0, supportedHdrTypes=[]} {width=720, height=480, fps=60.000004, supportedHdrTypes=[]} {width=720, height=480, fps=59.94006, supportedHdrTypes=[]} ] supported HDR types: [] mHotPlugFail: null comment: From device test: hotplug count: 9 } Device capabilities: { mSupports4K: true mHdrTypes: [HDR10, HLG, HDR10+] mSurroundAudioFormats: [ENCODING_E_AC3_JOC, ENCODING_AAC_LC, ENCODING_AC3, ENCODING_E_AC3, ENCODING_DTS] mSystemPreferredDisplayMode: null } Capabilities from the EDID : { device product info: { product name: SGD FRCX manufacturer name: SGD manufacture week: 49 manufacture year: 2013 model year: -1 } real size: Point(1920, 1080) real metrics: EdidDisplayMetrics{density=0.0, width=1920, height=1080, scaledDensity=0.0, xdpi=68.881355, ydpi=68.92462} audio profiles: [ { Encoding format: ENCODING_PCM_16BIT (2) sampling rates: [32000, 44100, 48000, 88200, 96000, 176400, 192000] channel masks: null channel counts: [2] channel index masks: null } { Encoding format: ENCODING_AC3 (5) sampling rates: [32000, 44100, 48000] channel masks: null channel counts: [6] channel index masks: null } { Encoding format: ENCODING_DTS (7) sampling rates: [32000, 44100, 48000] channel masks: null channel counts: [8] channel index masks: null } ] active display mode: null supported display modes: [ {width=4096, height=2160, fps=24.0, supportedHdrTypes=[]} {width=4096, height=2160, fps=23.98, supportedHdrTypes=[]} {width=3840, height=2160, fps=30.0, supportedHdrTypes=[]} {width=3840, height=2160, fps=29.97, supportedHdrTypes=[]} {width=3840, height=2160, fps=25.0, supportedHdrTypes=[]} {width=3840, height=2160, fps=24.0, supportedHdrTypes=[]} {width=3840, height=2160, fps=23.98, supportedHdrTypes=[]} {width=1600, height=1200, fps=60.0, supportedHdrTypes=[]} {width=1600, height=1200, fps=59.94006, supportedHdrTypes=[]} {width=1920, height=1080, fps=60.0, supportedHdrTypes=[]} {width=1920, height=1080, fps=59.94006, supportedHdrTypes=[]} {width=1920, height=1080, fps=50.0, supportedHdrTypes=[]} {width=1920, height=1080, fps=30.0, supportedHdrTypes=[]} {width=1920, height=1080, fps=29.97, supportedHdrTypes=[]} {width=1920, height=1080, fps=25.0, supportedHdrTypes=[]} {width=1920, height=1080, fps=24.0, supportedHdrTypes=[]} {width=1920, height=1080, fps=23.98, supportedHdrTypes=[]} {width=1280, height=1024, fps=60.0, supportedHdrTypes=[]} {width=1280, height=1024, fps=59.94006, supportedHdrTypes=[]} {width=1280, height=960, fps=85.0, supportedHdrTypes=[]} {width=1024, height=768, fps=85.0, supportedHdrTypes=[]} {width=1280, height=720, fps=60.321716, supportedHdrTypes=[]} {width=1280, height=720, fps=60.0, supportedHdrTypes=[]} {width=1280, height=720, fps=59.94, supportedHdrTypes=[]} {width=1280, height=720, fps=50.0, supportedHdrTypes=[]} {width=800, height=600, fps=85.0, supportedHdrTypes=[]} {width=1440, height=480, fps=60.0, supportedHdrTypes=[]} {width=1440, height=480, fps=59.94, supportedHdrTypes=[]} {width=720, height=480, fps=60.0, supportedHdrTypes=[]} {width=720, height=480, fps=59.94, supportedHdrTypes=[]} {width=640, height=480, fps=85.0, supportedHdrTypes=[]} {width=640, height=480, fps=60.0, supportedHdrTypes=[]} {width=640, height=480, fps=59.94, supportedHdrTypes=[]} {width=640, height=400, fps=85.0, supportedHdrTypes=[]} {width=640, height=360, fps=85.0, supportedHdrTypes=[]} ] supported HDR types: [] mHotPlugFail: null comment: /home/xts/tools/android-tvts/./tools/../../android-tvts/testcases/res/EDID/shortlist/19DF6A5AE0BC.bin } at org.junit.Assert.fail(Assert.java:89) at com.google.android.tvts.hdmi.HdmiEdidHostTest.writeResultToDbFailIfMessageSet(HdmiEdidHostTest.java:824) at com.google.android.tvts.hdmi.HdmiEdidHostTest.testDpiMatch(HdmiEdidHostTest.java:1238) at java.base/jdk.internal.reflect.NativeMethodAccessorImpl.invoke0(Native Method) at java.base/jdk.internal.reflect.NativeMethodAccessorImpl.invoke(NativeMethodAccessorImpl.java:62) at java.base/jdk.internal.reflect.DelegatingMethodAccessorImpl.invoke(DelegatingMethodAccessorImpl.java:43) at java.base/java.lang.reflect.Method.invoke(Method.java:566) at org.junit.runners.model.FrameworkMethod$1.runReflectiveCall(FrameworkMethod.java:59) at org.junit.internal.runners.model.ReflectiveCallable.run(ReflectiveCallable.java:12) at org.junit.runners.model.FrameworkMethod.invokeExplosively(FrameworkMethod.java:61) at org.junit.internal.runners.statements.InvokeMethod.evaluate(InvokeMethod.java:17) at org.junit.internal.runners.statements.RunBefores.evaluate(RunBefores.java:26) at org.junit.internal.runners.statements.RunAfters.evaluate(RunAfters.java:27) at org.junit.rules.ExternalResource$1.evaluate(ExternalResource.java:54) at org.junit.rules.TestWatcher$1.evaluate(TestWatcher.java:61) at org.junit.runners.ParentRunner$3.evaluate(ParentRunner.java:306) at org.junit.runners.BlockJUnit4ClassRunner$1.evaluate(BlockJUnit4ClassRunner.java:100) at org.junit.runners.ParentRunner.runLeaf(ParentRunner.java:366) at org.junit.runners.BlockJUnit4ClassRunner.runChild(BlockJUnit4ClassRunner.java:103) at org.junit.runners.BlockJUnit4ClassRunner.runChild(BlockJUnit4ClassRunner.java:63) at org.junit.runners.ParentRunner$4.run(ParentRunner.java:331) at org.junit.runners.ParentRunner$1.schedule(ParentRunner.java:79) at org.junit.runners.ParentRunner.runChildren(ParentRunner.java:329) at org.junit.runners.ParentRunner$2.evaluate(ParentRunner.java:293) at org.junit.runners.ParentRunner.run(ParentRunner.java:413) at org.junit.runners.Suite.runChild(Suite.java:128) at org.junit.runners.Suite.runChild(Suite.java:27) at org.junit.runners.ParentRunner$4.run(ParentRunner.java:331) at org.junit.runners.ParentRunner$1.schedule(ParentRunner.java:79) at org.junit.runners.ParentRunner.runChildren(ParentRunner.java:329) at org.junit.runners.ParentRunner$2.evaluate(ParentRunner.java:293) at org.junit.internal.runners.statements.RunAfters.evaluate(RunAfters.java:27) at org.junit.runners.ParentRunner$3.evaluate(ParentRunner.java:306) at org.junit.runners.ParentRunner.run(ParentRunner.java:413) at com.android.tradefed.testtype.junit4.ExceptionThrowingRunnerWrapper.run(ExceptionThrowingRunnerWrapper.java:43) at org.junit.runner.JUnitCore.run(JUnitCore.java:137) at com.android.tradefed.testtype.HostTest.runJUnit4Tests(HostTest.java:736) at com.android.tradefed.testtype.HostTest.runTestClasses(HostTest.java:616) at com.android.tradefed.testtype.HostTest.run(HostTest.java:564) at com.android.compatibility.common.tradefed.testtype.JarHostTest.run(JarHostTest.java:56) at com.android.tradefed.testtype.suite.GranularRetriableTestWrapper.intraModuleRun(GranularRetriableTestWrapper.java:366) at com.android.tradefed.testtype.suite.GranularRetriableTestWrapper.run(GranularRetriableTestWrapper.java:277) at com.android.tradefed.testtype.suite.ModuleDefinition.run(ModuleDefinition.java:582) at com.android.tradefed.testtype.suite.ITestSuite.runSingleModule(ITestSuite.java:926) at com.android.tradefed.testtype.suite.ITestSuite.run(ITestSuite.java:806) at com.android.tradefed.invoker.InvocationExecution.runTest(InvocationExecution.java:1335) at com.android.tradefed.invoker.InvocationExecution.runTests(InvocationExecution.java:1114) at com.android.tradefed.invoker.TestInvocation.prepareAndRun(TestInvocation.java:604) at com.android.tradefed.invoker.TestInvocation.performInvocation(TestInvocation.java:274) at com.android.tradefed.invoker.TestInvocation.invoke(TestInvocation.java:1322) at com.android.tradefed.command.CommandScheduler$InvocationThread.run(CommandScheduler.java:646)
com.google.android.tvts.hdmi.HdmiEdidHostTest#testDpiMatch[/home/xts/tools/android-tvts/./tools/../../android-tvts/testcases/res/EDID/shortlist/AC4B172CF004.bin : 10]
fail
java.lang.AssertionError: DPI does not match: device reported DPI: 160.0, 160.0 is expected to match EDID DPI calculated from DTD: 60.96, 60.959995 (screen size = 80.0cm x 45.0cm) or EDID DPI calculated from basic display info: 51.334732, 50.800003 (screen size = 95cm x 54cm) Capabilities according to Android APIs: { device product info: { product name: 43S425 manufacturer name: TCL manufacture week: 18 manufacture year: 2020 model year: -1 } real size: Point(1920, 1080) real metrics: EdidDisplayMetrics{density=2.0, width=1920, height=1080, scaledDensity=2.0, xdpi=160.0, ydpi=160.0} audio profiles: [ { Encoding format: ENCODING_PCM_16BIT (2) sampling rates: [32000, 44100, 48000] channel masks: [ 0xC (2 channels) ] channel counts: [2] channel index masks: [] } { Encoding format: ENCODING_AC3 (5) sampling rates: [32000, 44100, 48000] channel masks: [ 0x4 (1 channels) 0xC (2 channels) 0x1C (3 channels) 0x3C (4 channels) 0xCC (4 channels) 0xDC (5 channels) 0xFC (6 channels) 0x40C (3 channels) 0x41C (4 channels) ] channel counts: [1, 2, 3, 3, 4, 4, 4, 5, 6] channel index masks: [] } { Encoding format: ENCODING_E_AC3 (6) sampling rates: [32000, 44100, 48000] channel masks: [ 0x4 (1 channels) 0xC (2 channels) 0x1C (3 channels) 0x3C (4 channels) 0xCC (4 channels) 0xDC (5 channels) 0xFC (6 channels) 0x40C (3 channels) 0x41C (4 channels) 0x4FC (7 channels) 0x18FC (8 channels) ] channel counts: [1, 2, 3, 3, 4, 4, 4, 5, 6, 7, 8] channel index masks: [] } ] active display mode: {width=3840, height=2160, fps=59.94006, supportedHdrTypes=[]} supported display modes: [ {width=4096, height=2160, fps=60.000004, supportedHdrTypes=[]} {width=4096, height=2160, fps=59.94006, supportedHdrTypes=[]} {width=4096, height=2160, fps=30.000002, supportedHdrTypes=[]} {width=4096, height=2160, fps=29.97003, supportedHdrTypes=[]} {width=4096, height=2160, fps=24.000002, supportedHdrTypes=[]} {width=4096, height=2160, fps=23.976025, supportedHdrTypes=[]} {width=3840, height=2160, fps=60.000004, supportedHdrTypes=[]} {width=3840, height=2160, fps=59.94006, supportedHdrTypes=[]} {width=3840, height=2160, fps=30.000002, supportedHdrTypes=[]} {width=3840, height=2160, fps=29.97003, supportedHdrTypes=[]} {width=3840, height=2160, fps=24.000002, supportedHdrTypes=[]} {width=3840, height=2160, fps=23.976025, supportedHdrTypes=[]} {width=1920, height=1080, fps=60.000004, supportedHdrTypes=[]} {width=1920, height=1080, fps=59.94006, supportedHdrTypes=[]} {width=1920, height=1080, fps=30.000002, supportedHdrTypes=[]} {width=1920, height=1080, fps=29.97003, supportedHdrTypes=[]} {width=1920, height=1080, fps=24.000002, supportedHdrTypes=[]} {width=1920, height=1080, fps=23.976025, supportedHdrTypes=[]} {width=1280, height=720, fps=60.000004, supportedHdrTypes=[]} {width=1280, height=720, fps=59.94006, supportedHdrTypes=[]} {width=720, height=480, fps=60.000004, supportedHdrTypes=[]} {width=720, height=480, fps=59.94006, supportedHdrTypes=[]} ] supported HDR types: [HDR10, HLG] mHotPlugFail: null comment: From device test: hotplug count: 10 } Device capabilities: { mSupports4K: true mHdrTypes: [HDR10, HLG, HDR10+] mSurroundAudioFormats: [ENCODING_E_AC3_JOC, ENCODING_AAC_LC, ENCODING_AC3, ENCODING_E_AC3, ENCODING_DTS] mSystemPreferredDisplayMode: null } Capabilities from the EDID : { device product info: { product name: 43S425 manufacturer name: TCL manufacture week: 18 manufacture year: 2020 model year: -1 } real size: Point(3840, 2160) real metrics: EdidDisplayMetrics{density=0.0, width=3840, height=2160, scaledDensity=0.0, xdpi=121.92, ydpi=121.92} audio profiles: [ { Encoding format: ENCODING_PCM_16BIT (2) sampling rates: [32000, 44100, 48000] channel masks: null channel counts: [2] channel index masks: null } { Encoding format: ENCODING_AC3 (5) sampling rates: [32000, 44100, 48000] channel masks: null channel counts: [6] channel index masks: null } { Encoding format: ENCODING_E_AC3 (6) sampling rates: [32000, 44100, 48000] channel masks: null channel counts: [8] channel index masks: null } { Encoding format: ENCODING_DOLBY_TRUEHD (14) sampling rates: [48000] channel masks: null channel counts: [8] channel index masks: null } { Encoding format: ENCODING_DOLBY_MAT (19) sampling rates: [48000] channel masks: null channel counts: [8] channel index masks: null } ] active display mode: null supported display modes: [ {width=4096, height=2160, fps=60.0, supportedHdrTypes=[]} {width=4096, height=2160, fps=59.94, supportedHdrTypes=[]} {width=4096, height=2160, fps=30.0, supportedHdrTypes=[]} {width=4096, height=2160, fps=29.97, supportedHdrTypes=[]} {width=4096, height=2160, fps=24.0, supportedHdrTypes=[]} {width=4096, height=2160, fps=23.98, supportedHdrTypes=[]} {width=3840, height=2160, fps=60.0, supportedHdrTypes=[]} {width=3840, height=2160, fps=59.94006, supportedHdrTypes=[]} {width=3840, height=2160, fps=30.0, supportedHdrTypes=[]} {width=3840, height=2160, fps=29.97003, supportedHdrTypes=[]} {width=3840, height=2160, fps=24.0, supportedHdrTypes=[]} {width=3840, height=2160, fps=23.98, supportedHdrTypes=[]} {width=1920, height=1080, fps=60.0, supportedHdrTypes=[]} {width=1920, height=1080, fps=59.94006, supportedHdrTypes=[]} {width=1920, height=1080, fps=30.0, supportedHdrTypes=[]} {width=1920, height=1080, fps=29.97, supportedHdrTypes=[]} {width=1920, height=1080, fps=24.0, supportedHdrTypes=[]} {width=1920, height=1080, fps=23.98, supportedHdrTypes=[]} {width=1680, height=1050, fps=60.0, supportedHdrTypes=[]} {width=1680, height=1050, fps=59.94006, supportedHdrTypes=[]} {width=1280, height=1024, fps=60.0, supportedHdrTypes=[]} {width=1280, height=1024, fps=59.94006, supportedHdrTypes=[]} {width=1280, height=960, fps=60.0, supportedHdrTypes=[]} {width=1280, height=960, fps=59.94006, supportedHdrTypes=[]} {width=1440, height=900, fps=60.0, supportedHdrTypes=[]} {width=1440, height=900, fps=59.94006, supportedHdrTypes=[]} {width=1152, height=864, fps=75.0, supportedHdrTypes=[]} {width=1280, height=800, fps=60.0, supportedHdrTypes=[]} {width=1280, height=800, fps=59.94006, supportedHdrTypes=[]} {width=1280, height=720, fps=60.0, supportedHdrTypes=[]} {width=1280, height=720, fps=59.94006, supportedHdrTypes=[]} {width=1280, height=720, fps=30.0, supportedHdrTypes=[]} {width=1280, height=720, fps=29.97, supportedHdrTypes=[]} {width=1280, height=720, fps=24.0, supportedHdrTypes=[]} {width=1280, height=720, fps=23.98, supportedHdrTypes=[]} {width=720, height=480, fps=60.0, supportedHdrTypes=[]} {width=720, height=480, fps=59.94, supportedHdrTypes=[]} {width=640, height=480, fps=60.0, supportedHdrTypes=[]} {width=640, height=480, fps=59.94, supportedHdrTypes=[]} ] supported HDR types: [HDR10, HLG] mHotPlugFail: null comment: /home/xts/tools/android-tvts/./tools/../../android-tvts/testcases/res/EDID/shortlist/AC4B172CF004.bin } at org.junit.Assert.fail(Assert.java:89) at com.google.android.tvts.hdmi.HdmiEdidHostTest.writeResultToDbFailIfMessageSet(HdmiEdidHostTest.java:824) at com.google.android.tvts.hdmi.HdmiEdidHostTest.testDpiMatch(HdmiEdidHostTest.java:1238) at java.base/jdk.internal.reflect.NativeMethodAccessorImpl.invoke0(Native Method) at java.base/jdk.internal.reflect.NativeMethodAccessorImpl.invoke(NativeMethodAccessorImpl.java:62) at java.base/jdk.internal.reflect.DelegatingMethodAccessorImpl.invoke(DelegatingMethodAccessorImpl.java:43) at java.base/java.lang.reflect.Method.invoke(Method.java:566) at org.junit.runners.model.FrameworkMethod$1.runReflectiveCall(FrameworkMethod.java:59) at org.junit.internal.runners.model.ReflectiveCallable.run(ReflectiveCallable.java:12) at org.junit.runners.model.FrameworkMethod.invokeExplosively(FrameworkMethod.java:61) at org.junit.internal.runners.statements.InvokeMethod.evaluate(InvokeMethod.java:17) at org.junit.internal.runners.statements.RunBefores.evaluate(RunBefores.java:26) at org.junit.internal.runners.statements.RunAfters.evaluate(RunAfters.java:27) at org.junit.rules.ExternalResource$1.evaluate(ExternalResource.java:54) at org.junit.rules.TestWatcher$1.evaluate(TestWatcher.java:61) at org.junit.runners.ParentRunner$3.evaluate(ParentRunner.java:306) at org.junit.runners.BlockJUnit4ClassRunner$1.evaluate(BlockJUnit4ClassRunner.java:100) at org.junit.runners.ParentRunner.runLeaf(ParentRunner.java:366) at org.junit.runners.BlockJUnit4ClassRunner.runChild(BlockJUnit4ClassRunner.java:103) at org.junit.runners.BlockJUnit4ClassRunner.runChild(BlockJUnit4ClassRunner.java:63) at org.junit.runners.ParentRunner$4.run(ParentRunner.java:331) at org.junit.runners.ParentRunner$1.schedule(ParentRunner.java:79) at org.junit.runners.ParentRunner.runChildren(ParentRunner.java:329) at org.junit.runners.ParentRunner$2.evaluate(ParentRunner.java:293) at org.junit.runners.ParentRunner.run(ParentRunner.java:413) at org.junit.runners.Suite.runChild(Suite.java:128) at org.junit.runners.Suite.runChild(Suite.java:27) at org.junit.runners.ParentRunner$4.run(ParentRunner.java:331) at org.junit.runners.ParentRunner$1.schedule(ParentRunner.java:79) at org.junit.runners.ParentRunner.runChildren(ParentRunner.java:329) at org.junit.runners.ParentRunner$2.evaluate(ParentRunner.java:293) at org.junit.internal.runners.statements.RunAfters.evaluate(RunAfters.java:27) at org.junit.runners.ParentRunner$3.evaluate(ParentRunner.java:306) at org.junit.runners.ParentRunner.run(ParentRunner.java:413) at com.android.tradefed.testtype.junit4.ExceptionThrowingRunnerWrapper.run(ExceptionThrowingRunnerWrapper.java:43) at org.junit.runner.JUnitCore.run(JUnitCore.java:137) at com.android.tradefed.testtype.HostTest.runJUnit4Tests(HostTest.java:736) at com.android.tradefed.testtype.HostTest.runTestClasses(HostTest.java:616) at com.android.tradefed.testtype.HostTest.run(HostTest.java:564) at com.android.compatibility.common.tradefed.testtype.JarHostTest.run(JarHostTest.java:56) at com.android.tradefed.testtype.suite.GranularRetriableTestWrapper.intraModuleRun(GranularRetriableTestWrapper.java:366) at com.android.tradefed.testtype.suite.GranularRetriableTestWrapper.run(GranularRetriableTestWrapper.java:277) at com.android.tradefed.testtype.suite.ModuleDefinition.run(ModuleDefinition.java:582) at com.android.tradefed.testtype.suite.ITestSuite.runSingleModule(ITestSuite.java:926) at com.android.tradefed.testtype.suite.ITestSuite.run(ITestSuite.java:806) at com.android.tradefed.invoker.InvocationExecution.runTest(InvocationExecution.java:1335) at com.android.tradefed.invoker.InvocationExecution.runTests(InvocationExecution.java:1114) at com.android.tradefed.invoker.TestInvocation.prepareAndRun(TestInvocation.java:604) at com.android.tradefed.invoker.TestInvocation.performInvocation(TestInvocation.java:274) at com.android.tradefed.invoker.TestInvocation.invoke(TestInvocation.java:1322) at com.android.tradefed.command.CommandScheduler$InvocationThread.run(CommandScheduler.java:646)
com.google.android.tvts.hdmi.HdmiEdidHostTest#testDpiMatch[/home/xts/tools/android-tvts/./tools/../../android-tvts/testcases/res/EDID/shortlist/4E56E2A27C3A.bin : 11]
fail
java.lang.AssertionError: DPI does not match: device reported DPI: 160.0, 160.0 is expected to match EDID DPI calculated from DTD: 69.868195, 69.80153 (screen size = 69.799995cm x 39.3cm) or EDID DPI calculated from basic display info: 69.66857, 70.33846 (screen size = 70cm x 39cm) Capabilities according to Android APIs: { device product info: { product name: BenQ EW3270U manufacturer name: BNQ manufacture week: 30 manufacture year: 2019 model year: -1 } real size: Point(1920, 1080) real metrics: EdidDisplayMetrics{density=2.0, width=1920, height=1080, scaledDensity=2.0, xdpi=160.0, ydpi=160.0} audio profiles: [ { Encoding format: ENCODING_PCM_16BIT (2) sampling rates: [32000, 44100, 48000] channel masks: [ 0xC (2 channels) ] channel counts: [2] channel index masks: [] } ] active display mode: {width=3840, height=2160, fps=59.94006, supportedHdrTypes=[]} supported display modes: [ {width=3840, height=2160, fps=60.000004, supportedHdrTypes=[]} {width=3840, height=2160, fps=59.94006, supportedHdrTypes=[]} {width=3840, height=2160, fps=50.0, supportedHdrTypes=[]} {width=3840, height=2160, fps=30.000002, supportedHdrTypes=[]} {width=3840, height=2160, fps=29.97003, supportedHdrTypes=[]} {width=3840, height=2160, fps=25.0, supportedHdrTypes=[]} {width=3840, height=2160, fps=24.000002, supportedHdrTypes=[]} {width=3840, height=2160, fps=23.976025, supportedHdrTypes=[]} {width=1920, height=1080, fps=60.000004, supportedHdrTypes=[]} {width=1920, height=1080, fps=59.94006, supportedHdrTypes=[]} {width=1920, height=1080, fps=50.0, supportedHdrTypes=[]} {width=1920, height=1080, fps=30.000002, supportedHdrTypes=[]} {width=1920, height=1080, fps=29.97003, supportedHdrTypes=[]} {width=1920, height=1080, fps=25.0, supportedHdrTypes=[]} {width=1920, height=1080, fps=24.000002, supportedHdrTypes=[]} {width=1920, height=1080, fps=23.976025, supportedHdrTypes=[]} {width=1280, height=720, fps=60.000004, supportedHdrTypes=[]} {width=1280, height=720, fps=59.94006, supportedHdrTypes=[]} {width=1280, height=720, fps=50.0, supportedHdrTypes=[]} {width=720, height=576, fps=50.0, supportedHdrTypes=[]} {width=720, height=480, fps=60.000004, supportedHdrTypes=[]} {width=720, height=480, fps=59.94006, supportedHdrTypes=[]} ] supported HDR types: [HDR10] mHotPlugFail: null comment: From device test: hotplug count: 11 } Device capabilities: { mSupports4K: true mHdrTypes: [HDR10, HLG, HDR10+] mSurroundAudioFormats: [ENCODING_E_AC3_JOC, ENCODING_AAC_LC, ENCODING_AC3, ENCODING_E_AC3, ENCODING_DTS] mSystemPreferredDisplayMode: null } Capabilities from the EDID : { device product info: { product name: BenQ EW3270U manufacturer name: BNQ manufacture week: 30 manufacture year: 2019 model year: -1 } real size: Point(3840, 2160) real metrics: EdidDisplayMetrics{density=0.0, width=3840, height=2160, scaledDensity=0.0, xdpi=139.73639, ydpi=139.60306} audio profiles: [ { Encoding format: ENCODING_PCM_16BIT (2) sampling rates: [32000, 44100, 48000] channel masks: null channel counts: [2] channel index masks: null } ] active display mode: null supported display modes: [ {width=3840, height=2160, fps=60.0, supportedHdrTypes=[]} {width=3840, height=2160, fps=59.94006, supportedHdrTypes=[]} {width=3840, height=2160, fps=50.0, supportedHdrTypes=[]} {width=3840, height=2160, fps=30.0, supportedHdrTypes=[]} {width=3840, height=2160, fps=29.97, supportedHdrTypes=[]} {width=3840, height=2160, fps=25.0, supportedHdrTypes=[]} {width=3840, height=2160, fps=24.0, supportedHdrTypes=[]} {width=3840, height=2160, fps=23.98, supportedHdrTypes=[]} {width=2560, height=1600, fps=60.0, supportedHdrTypes=[]} {width=2560, height=1600, fps=59.940994, supportedHdrTypes=[]} {width=2560, height=1440, fps=59.95055, supportedHdrTypes=[]} {width=1920, height=1080, fps=60.0, supportedHdrTypes=[]} {width=1920, height=1080, fps=59.94006, supportedHdrTypes=[]} {width=1920, height=1080, fps=50.0, supportedHdrTypes=[]} {width=1920, height=1080, fps=30.0, supportedHdrTypes=[]} {width=1920, height=1080, fps=29.97, supportedHdrTypes=[]} {width=1920, height=1080, fps=25.0, supportedHdrTypes=[]} {width=1920, height=1080, fps=24.0, supportedHdrTypes=[]} {width=1920, height=1080, fps=23.98, supportedHdrTypes=[]} {width=1680, height=1050, fps=60.0, supportedHdrTypes=[]} {width=1680, height=1050, fps=59.94006, supportedHdrTypes=[]} {width=1280, height=1024, fps=60.0, supportedHdrTypes=[]} {width=1280, height=1024, fps=59.94006, supportedHdrTypes=[]} {width=1600, height=900, fps=60.0, supportedHdrTypes=[]} {width=1600, height=900, fps=59.94006, supportedHdrTypes=[]} {width=1280, height=800, fps=60.0, supportedHdrTypes=[]} {width=1280, height=800, fps=59.94006, supportedHdrTypes=[]} {width=1280, height=720, fps=60.0, supportedHdrTypes=[]} {width=1280, height=720, fps=59.94006, supportedHdrTypes=[]} {width=1280, height=720, fps=50.0, supportedHdrTypes=[]} {width=720, height=576, fps=50.0, supportedHdrTypes=[]} {width=720, height=480, fps=60.0, supportedHdrTypes=[]} {width=720, height=480, fps=59.94, supportedHdrTypes=[]} {width=640, height=480, fps=60.0, supportedHdrTypes=[]} {width=640, height=480, fps=59.94, supportedHdrTypes=[]} ] supported HDR types: [HDR10] mHotPlugFail: null comment: /home/xts/tools/android-tvts/./tools/../../android-tvts/testcases/res/EDID/shortlist/4E56E2A27C3A.bin } at org.junit.Assert.fail(Assert.java:89) at com.google.android.tvts.hdmi.HdmiEdidHostTest.writeResultToDbFailIfMessageSet(HdmiEdidHostTest.java:824) at com.google.android.tvts.hdmi.HdmiEdidHostTest.testDpiMatch(HdmiEdidHostTest.java:1238) at java.base/jdk.internal.reflect.NativeMethodAccessorImpl.invoke0(Native Method) at java.base/jdk.internal.reflect.NativeMethodAccessorImpl.invoke(NativeMethodAccessorImpl.java:62) at java.base/jdk.internal.reflect.DelegatingMethodAccessorImpl.invoke(DelegatingMethodAccessorImpl.java:43) at java.base/java.lang.reflect.Method.invoke(Method.java:566) at org.junit.runners.model.FrameworkMethod$1.runReflectiveCall(FrameworkMethod.java:59) at org.junit.internal.runners.model.ReflectiveCallable.run(ReflectiveCallable.java:12) at org.junit.runners.model.FrameworkMethod.invokeExplosively(FrameworkMethod.java:61) at org.junit.internal.runners.statements.InvokeMethod.evaluate(InvokeMethod.java:17) at org.junit.internal.runners.statements.RunBefores.evaluate(RunBefores.java:26) at org.junit.internal.runners.statements.RunAfters.evaluate(RunAfters.java:27) at org.junit.rules.ExternalResource$1.evaluate(ExternalResource.java:54) at org.junit.rules.TestWatcher$1.evaluate(TestWatcher.java:61) at org.junit.runners.ParentRunner$3.evaluate(ParentRunner.java:306) at org.junit.runners.BlockJUnit4ClassRunner$1.evaluate(BlockJUnit4ClassRunner.java:100) at org.junit.runners.ParentRunner.runLeaf(ParentRunner.java:366) at org.junit.runners.BlockJUnit4ClassRunner.runChild(BlockJUnit4ClassRunner.java:103) at org.junit.runners.BlockJUnit4ClassRunner.runChild(BlockJUnit4ClassRunner.java:63) at org.junit.runners.ParentRunner$4.run(ParentRunner.java:331) at org.junit.runners.ParentRunner$1.schedule(ParentRunner.java:79) at org.junit.runners.ParentRunner.runChildren(ParentRunner.java:329) at org.junit.runners.ParentRunner$2.evaluate(ParentRunner.java:293) at org.junit.runners.ParentRunner.run(ParentRunner.java:413) at org.junit.runners.Suite.runChild(Suite.java:128) at org.junit.runners.Suite.runChild(Suite.java:27) at org.junit.runners.ParentRunner$4.run(ParentRunner.java:331) at org.junit.runners.ParentRunner$1.schedule(ParentRunner.java:79) at org.junit.runners.ParentRunner.runChildren(ParentRunner.java:329) at org.junit.runners.ParentRunner$2.evaluate(ParentRunner.java:293) at org.junit.internal.runners.statements.RunAfters.evaluate(RunAfters.java:27) at org.junit.runners.ParentRunner$3.evaluate(ParentRunner.java:306) at org.junit.runners.ParentRunner.run(ParentRunner.java:413) at com.android.tradefed.testtype.junit4.ExceptionThrowingRunnerWrapper.run(ExceptionThrowingRunnerWrapper.java:43) at org.junit.runner.JUnitCore.run(JUnitCore.java:137) at com.android.tradefed.testtype.HostTest.runJUnit4Tests(HostTest.java:736) at com.android.tradefed.testtype.HostTest.runTestClasses(HostTest.java:616) at com.android.tradefed.testtype.HostTest.run(HostTest.java:564) at com.android.compatibility.common.tradefed.testtype.JarHostTest.run(JarHostTest.java:56) at com.android.tradefed.testtype.suite.GranularRetriableTestWrapper.intraModuleRun(GranularRetriableTestWrapper.java:366) at com.android.tradefed.testtype.suite.GranularRetriableTestWrapper.run(GranularRetriableTestWrapper.java:277) at com.android.tradefed.testtype.suite.ModuleDefinition.run(ModuleDefinition.java:582) at com.android.tradefed.testtype.suite.ITestSuite.runSingleModule(ITestSuite.java:926) at com.android.tradefed.testtype.suite.ITestSuite.run(ITestSuite.java:806) at com.android.tradefed.invoker.InvocationExecution.runTest(InvocationExecution.java:1335) at com.android.tradefed.invoker.InvocationExecution.runTests(InvocationExecution.java:1114) at com.android.tradefed.invoker.TestInvocation.prepareAndRun(TestInvocation.java:604) at com.android.tradefed.invoker.TestInvocation.performInvocation(TestInvocation.java:274) at com.android.tradefed.invoker.TestInvocation.invoke(TestInvocation.java:1322) at com.android.tradefed.command.CommandScheduler$InvocationThread.run(CommandScheduler.java:646)
com.google.android.tvts.hdmi.HdmiEdidHostTest#testDpiMatch[/home/xts/tools/android-tvts/./tools/../../android-tvts/testcases/res/EDID/shortlist/LG16843009.bin : 12]
fail
java.lang.AssertionError: DPI does not match: device reported DPI: 160.0, 160.0 is expected to match EDID DPI calculated from DTD: 30.48, 30.479998 (screen size = 160.0cm x 90.0cm) or EDID DPI calculated from basic display info: 30.48, 30.48 (screen size = 160cm x 90cm) Capabilities according to Android APIs: { device product info: { product name: LG TV manufacturer name: GSM manufacture week: 1 manufacture year: 2019 model year: -1 } real size: Point(1920, 1080) real metrics: EdidDisplayMetrics{density=2.0, width=1920, height=1080, scaledDensity=2.0, xdpi=160.0, ydpi=160.0} audio profiles: [ { Encoding format: ENCODING_PCM_16BIT (2) sampling rates: [32000, 44100, 48000, 96000, 192000] channel masks: [ 0xC (2 channels) ] channel counts: [2] channel index masks: [] } { Encoding format: ENCODING_AC3 (5) sampling rates: [32000, 44100, 48000] channel masks: [ 0x4 (1 channels) 0xC (2 channels) 0x1C (3 channels) 0x3C (4 channels) 0xCC (4 channels) 0xDC (5 channels) 0xFC (6 channels) 0x40C (3 channels) 0x41C (4 channels) ] channel counts: [1, 2, 3, 3, 4, 4, 4, 5, 6] channel index masks: [] } { Encoding format: ENCODING_E_AC3 (6) sampling rates: [32000, 44100, 48000] channel masks: [ 0x4 (1 channels) 0xC (2 channels) 0x1C (3 channels) 0x3C (4 channels) 0xCC (4 channels) 0xDC (5 channels) 0xFC (6 channels) 0x40C (3 channels) 0x41C (4 channels) 0x4FC (7 channels) 0x18FC (8 channels) ] channel counts: [1, 2, 3, 3, 4, 4, 4, 5, 6, 7, 8] channel index masks: [] } { Encoding format: ENCODING_DTS (7) sampling rates: [44100, 48000, 88200, 96000] channel masks: [ 0x4 (1 channels) 0xC (2 channels) 0x1C (3 channels) 0x3C (4 channels) 0xCC (4 channels) 0xDC (5 channels) 0xFC (6 channels) 0x40C (3 channels) 0x41C (4 channels) ] channel counts: [1, 2, 3, 3, 4, 4, 4, 5, 6] channel index masks: [] } { Encoding format: ENCODING_E_AC3_JOC (18) sampling rates: [32000, 44100, 48000] channel masks: [ 0x4 (1 channels) 0xC (2 channels) 0x1C (3 channels) 0x3C (4 channels) 0xCC (4 channels) 0xDC (5 channels) 0xFC (6 channels) 0x40C (3 channels) 0x41C (4 channels) 0x4FC (7 channels) 0x18FC (8 channels) ] channel counts: [1, 2, 3, 3, 4, 4, 4, 5, 6, 7, 8] channel index masks: [] } ] active display mode: {width=3840, height=2160, fps=59.94006, supportedHdrTypes=[]} supported display modes: [ {width=4096, height=2160, fps=60.000004, supportedHdrTypes=[]} {width=4096, height=2160, fps=59.94006, supportedHdrTypes=[]} {width=4096, height=2160, fps=50.0, supportedHdrTypes=[]} {width=4096, height=2160, fps=30.000002, supportedHdrTypes=[]} {width=4096, height=2160, fps=29.97003, supportedHdrTypes=[]} {width=4096, height=2160, fps=24.000002, supportedHdrTypes=[]} {width=4096, height=2160, fps=23.976025, supportedHdrTypes=[]} {width=3840, height=2160, fps=60.000004, supportedHdrTypes=[]} {width=3840, height=2160, fps=59.94006, supportedHdrTypes=[]} {width=3840, height=2160, fps=50.0, supportedHdrTypes=[]} {width=3840, height=2160, fps=30.000002, supportedHdrTypes=[]} {width=3840, height=2160, fps=29.97003, supportedHdrTypes=[]} {width=3840, height=2160, fps=25.0, supportedHdrTypes=[]} {width=3840, height=2160, fps=24.000002, supportedHdrTypes=[]} {width=3840, height=2160, fps=23.976025, supportedHdrTypes=[]} {width=1920, height=1080, fps=60.000004, supportedHdrTypes=[]} {width=1920, height=1080, fps=59.94006, supportedHdrTypes=[]} {width=1920, height=1080, fps=50.0, supportedHdrTypes=[]} {width=1920, height=1080, fps=30.000002, supportedHdrTypes=[]} {width=1920, height=1080, fps=29.97003, supportedHdrTypes=[]} {width=1920, height=1080, fps=25.0, supportedHdrTypes=[]} {width=1920, height=1080, fps=24.000002, supportedHdrTypes=[]} {width=1920, height=1080, fps=23.976025, supportedHdrTypes=[]} {width=1280, height=720, fps=60.000004, supportedHdrTypes=[]} {width=1280, height=720, fps=59.94006, supportedHdrTypes=[]} {width=1280, height=720, fps=50.0, supportedHdrTypes=[]} {width=720, height=576, fps=50.0, supportedHdrTypes=[]} {width=720, height=480, fps=60.000004, supportedHdrTypes=[]} {width=720, height=480, fps=59.94006, supportedHdrTypes=[]} ] supported HDR types: [HDR10, HLG] mHotPlugFail: null comment: From device test: hotplug count: 12 } Device capabilities: { mSupports4K: true mHdrTypes: [HDR10, HLG, HDR10+] mSurroundAudioFormats: [ENCODING_E_AC3_JOC, ENCODING_AAC_LC, ENCODING_AC3, ENCODING_E_AC3, ENCODING_DTS] mSystemPreferredDisplayMode: null } Capabilities from the EDID : { device product info: { product name: LG TV manufacturer name: GSM manufacture week: 1 manufacture year: 2019 model year: -1 } real size: Point(3840, 2160) real metrics: EdidDisplayMetrics{density=0.0, width=3840, height=2160, scaledDensity=0.0, xdpi=60.96, ydpi=60.96} audio profiles: [ { Encoding format: ENCODING_PCM_16BIT (2) sampling rates: [32000, 44100, 48000, 96000, 192000] channel masks: null channel counts: [2] channel index masks: null } { Encoding format: ENCODING_AC3 (5) sampling rates: [32000, 44100, 48000] channel masks: null channel counts: [6] channel index masks: null } { Encoding format: ENCODING_E_AC3 (6) sampling rates: [32000, 44100, 48000] channel masks: null channel counts: [8] channel index masks: null } { Encoding format: ENCODING_DTS (7) sampling rates: [44100, 48000, 88200, 96000] channel masks: null channel counts: [6] channel index masks: null } { Encoding format: ENCODING_DTS_HD (8) sampling rates: [44100, 48000, 88200, 96000, 176400, 192000] channel masks: null channel counts: [8] channel index masks: null } { Encoding format: ENCODING_DOLBY_TRUEHD (14) sampling rates: [48000] channel masks: null channel counts: [8] channel index masks: null } { Encoding format: ENCODING_E_AC3_JOC (18) sampling rates: [32000, 44100, 48000] channel masks: null channel counts: [8] channel index masks: null } { Encoding format: ENCODING_DOLBY_MAT (19) sampling rates: [48000] channel masks: null channel counts: [8] channel index masks: null } ] active display mode: null supported display modes: [ {width=4096, height=2160, fps=60.0, supportedHdrTypes=[]} {width=4096, height=2160, fps=59.94, supportedHdrTypes=[]} {width=4096, height=2160, fps=50.0, supportedHdrTypes=[]} {width=4096, height=2160, fps=30.0, supportedHdrTypes=[]} {width=4096, height=2160, fps=29.97, supportedHdrTypes=[]} {width=4096, height=2160, fps=25.0, supportedHdrTypes=[]} {width=4096, height=2160, fps=24.0, supportedHdrTypes=[]} {width=4096, height=2160, fps=23.98, supportedHdrTypes=[]} {width=3840, height=2160, fps=60.0, supportedHdrTypes=[]} {width=3840, height=2160, fps=59.94006, supportedHdrTypes=[]} {width=3840, height=2160, fps=50.0, supportedHdrTypes=[]} {width=3840, height=2160, fps=30.0, supportedHdrTypes=[]} {width=3840, height=2160, fps=29.97, supportedHdrTypes=[]} {width=3840, height=2160, fps=25.0, supportedHdrTypes=[]} {width=3840, height=2160, fps=24.0, supportedHdrTypes=[]} {width=3840, height=2160, fps=23.98, supportedHdrTypes=[]} {width=2560, height=1440, fps=119.99759, supportedHdrTypes=[]} {width=2560, height=1440, fps=119.88012, supportedHdrTypes=[]} {width=1920, height=1080, fps=120.0, supportedHdrTypes=[]} {width=1920, height=1080, fps=119.88, supportedHdrTypes=[]} {width=1920, height=1080, fps=100.0, supportedHdrTypes=[]} {width=1920, height=1080, fps=60.0, supportedHdrTypes=[]} {width=1920, height=1080, fps=59.94006, supportedHdrTypes=[]} {width=1920, height=1080, fps=50.0, supportedHdrTypes=[]} {width=1920, height=1080, fps=30.0, supportedHdrTypes=[]} {width=1920, height=1080, fps=29.97, supportedHdrTypes=[]} {width=1920, height=1080, fps=25.0, supportedHdrTypes=[]} {width=1920, height=1080, fps=24.0, supportedHdrTypes=[]} {width=1920, height=1080, fps=23.98, supportedHdrTypes=[]} {width=1280, height=1024, fps=60.0, supportedHdrTypes=[]} {width=1280, height=1024, fps=59.94006, supportedHdrTypes=[]} {width=1152, height=864, fps=60.0, supportedHdrTypes=[]} {width=1152, height=864, fps=59.94006, supportedHdrTypes=[]} {width=1360, height=768, fps=60.015163, supportedHdrTypes=[]} {width=1024, height=768, fps=60.0, supportedHdrTypes=[]} {width=1024, height=768, fps=59.94006, supportedHdrTypes=[]} {width=1280, height=720, fps=60.0, supportedHdrTypes=[]} {width=1280, height=720, fps=59.94, supportedHdrTypes=[]} {width=1280, height=720, fps=50.0, supportedHdrTypes=[]} {width=800, height=600, fps=60.0, supportedHdrTypes=[]} {width=800, height=600, fps=59.94006, supportedHdrTypes=[]} {width=720, height=576, fps=50.0, supportedHdrTypes=[]} {width=720, height=480, fps=60.0, supportedHdrTypes=[]} {width=720, height=480, fps=59.94, supportedHdrTypes=[]} {width=640, height=480, fps=60.0, supportedHdrTypes=[]} {width=640, height=480, fps=59.94006, supportedHdrTypes=[]} ] supported HDR types: [Dolby-Vision, HDR10, HLG] mHotPlugFail: null comment: /home/xts/tools/android-tvts/./tools/../../android-tvts/testcases/res/EDID/shortlist/LG16843009.bin } at org.junit.Assert.fail(Assert.java:89) at com.google.android.tvts.hdmi.HdmiEdidHostTest.writeResultToDbFailIfMessageSet(HdmiEdidHostTest.java:824) at com.google.android.tvts.hdmi.HdmiEdidHostTest.testDpiMatch(HdmiEdidHostTest.java:1238) at java.base/jdk.internal.reflect.NativeMethodAccessorImpl.invoke0(Native Method) at java.base/jdk.internal.reflect.NativeMethodAccessorImpl.invoke(NativeMethodAccessorImpl.java:62) at java.base/jdk.internal.reflect.DelegatingMethodAccessorImpl.invoke(DelegatingMethodAccessorImpl.java:43) at java.base/java.lang.reflect.Method.invoke(Method.java:566) at org.junit.runners.model.FrameworkMethod$1.runReflectiveCall(FrameworkMethod.java:59) at org.junit.internal.runners.model.ReflectiveCallable.run(ReflectiveCallable.java:12) at org.junit.runners.model.FrameworkMethod.invokeExplosively(FrameworkMethod.java:61) at org.junit.internal.runners.statements.InvokeMethod.evaluate(InvokeMethod.java:17) at org.junit.internal.runners.statements.RunBefores.evaluate(RunBefores.java:26) at org.junit.internal.runners.statements.RunAfters.evaluate(RunAfters.java:27) at org.junit.rules.ExternalResource$1.evaluate(ExternalResource.java:54) at org.junit.rules.TestWatcher$1.evaluate(TestWatcher.java:61) at org.junit.runners.ParentRunner$3.evaluate(ParentRunner.java:306) at org.junit.runners.BlockJUnit4ClassRunner$1.evaluate(BlockJUnit4ClassRunner.java:100) at org.junit.runners.ParentRunner.runLeaf(ParentRunner.java:366) at org.junit.runners.BlockJUnit4ClassRunner.runChild(BlockJUnit4ClassRunner.java:103) at org.junit.runners.BlockJUnit4ClassRunner.runChild(BlockJUnit4ClassRunner.java:63) at org.junit.runners.ParentRunner$4.run(ParentRunner.java:331) at org.junit.runners.ParentRunner$1.schedule(ParentRunner.java:79) at org.junit.runners.ParentRunner.runChildren(ParentRunner.java:329) at org.junit.runners.ParentRunner$2.evaluate(ParentRunner.java:293) at org.junit.runners.ParentRunner.run(ParentRunner.java:413) at org.junit.runners.Suite.runChild(Suite.java:128) at org.junit.runners.Suite.runChild(Suite.java:27) at org.junit.runners.ParentRunner$4.run(ParentRunner.java:331) at org.junit.runners.ParentRunner$1.schedule(ParentRunner.java:79) at org.junit.runners.ParentRunner.runChildren(ParentRunner.java:329) at org.junit.runners.ParentRunner$2.evaluate(ParentRunner.java:293) at org.junit.internal.runners.statements.RunAfters.evaluate(RunAfters.java:27) at org.junit.runners.ParentRunner$3.evaluate(ParentRunner.java:306) at org.junit.runners.ParentRunner.run(ParentRunner.java:413) at com.android.tradefed.testtype.junit4.ExceptionThrowingRunnerWrapper.run(ExceptionThrowingRunnerWrapper.java:43) at org.junit.runner.JUnitCore.run(JUnitCore.java:137) at com.android.tradefed.testtype.HostTest.runJUnit4Tests(HostTest.java:736) at com.android.tradefed.testtype.HostTest.runTestClasses(HostTest.java:616) at com.android.tradefed.testtype.HostTest.run(HostTest.java:564) at com.android.compatibility.common.tradefed.testtype.JarHostTest.run(JarHostTest.java:56) at com.android.tradefed.testtype.suite.GranularRetriableTestWrapper.intraModuleRun(GranularRetriableTestWrapper.java:366) at com.android.tradefed.testtype.suite.GranularRetriableTestWrapper.run(GranularRetriableTestWrapper.java:277) at com.android.tradefed.testtype.suite.ModuleDefinition.run(ModuleDefinition.java:582) at com.android.tradefed.testtype.suite.ITestSuite.runSingleModule(ITestSuite.java:926) at com.android.tradefed.testtype.suite.ITestSuite.run(ITestSuite.java:806) at com.android.tradefed.invoker.InvocationExecution.runTest(InvocationExecution.java:1335) at com.android.tradefed.invoker.InvocationExecution.runTests(InvocationExecution.java:1114) at com.android.tradefed.invoker.TestInvocation.prepareAndRun(TestInvocation.java:604) at com.android.tradefed.invoker.TestInvocation.performInvocation(TestInvocation.java:274) at com.android.tradefed.invoker.TestInvocation.invoke(TestInvocation.java:1322) at com.android.tradefed.command.CommandScheduler$InvocationThread.run(CommandScheduler.java:646)
com.google.android.tvts.hdmi.HdmiEdidHostTest#testDpiMatch[/home/xts/tools/android-tvts/./tools/../../android-tvts/testcases/res/EDID/shortlist/bootTestOrderB_defaultMode1440x900p60Hz.bin : 14]
fail
java.lang.AssertionError: DPI does not match: device reported DPI: 160.0, 160.0 is expected to match EDID DPI calculated from DTD: 116.3914, 104.70229 (screen size = 41.9cm x 26.199999cm) or EDID DPI calculated from basic display info: 116.11429, 105.50769 (screen size = 42cm x 26cm) Capabilities according to Android APIs: { device product info: { product name: LG IPS WSXGA manufacturer name: GSM manufacture week: 1 manufacture year: 2015 model year: -1 } real size: Point(1920, 1080) real metrics: EdidDisplayMetrics{density=1.3312501, width=1920, height=1080, scaledDensity=1.3312501, xdpi=160.0, ydpi=160.0} audio profiles: [ { Encoding format: ENCODING_PCM_16BIT (2) sampling rates: [32000, 44100, 48000] channel masks: [ 0xC (2 channels) ] channel counts: [2] channel index masks: [] } ] active display mode: {width=1280, height=720, fps=59.94006, supportedHdrTypes=[]} supported display modes: [ {width=1280, height=720, fps=60.000004, supportedHdrTypes=[]} {width=1280, height=720, fps=59.94006, supportedHdrTypes=[]} {width=1280, height=720, fps=50.0, supportedHdrTypes=[]} {width=720, height=576, fps=50.0, supportedHdrTypes=[]} {width=720, height=480, fps=60.000004, supportedHdrTypes=[]} {width=720, height=480, fps=59.94006, supportedHdrTypes=[]} ] supported HDR types: [] mHotPlugFail: null comment: From device test: hotplug count: 14 } Device capabilities: { mSupports4K: true mHdrTypes: [HDR10, HLG, HDR10+] mSurroundAudioFormats: [ENCODING_E_AC3_JOC, ENCODING_AAC_LC, ENCODING_AC3, ENCODING_E_AC3, ENCODING_DTS] mSystemPreferredDisplayMode: null } Capabilities from the EDID : { device product info: { product name: LG IPS WSXGA manufacturer name: GSM manufacture week: 1 manufacture year: 2015 model year: -1 } real size: Point(1440, 900) real metrics: EdidDisplayMetrics{density=0.0, width=1440, height=900, scaledDensity=0.0, xdpi=87.29356, ydpi=87.25191} audio profiles: [ { Encoding format: ENCODING_PCM_16BIT (2) sampling rates: [32000, 44100, 48000] channel masks: null channel counts: [2] channel index masks: null } ] active display mode: null supported display modes: [ {width=1280, height=1024, fps=60.0, supportedHdrTypes=[]} {width=1280, height=1024, fps=59.94006, supportedHdrTypes=[]} {width=1440, height=900, fps=60.0, supportedHdrTypes=[]} {width=1440, height=900, fps=59.94006, supportedHdrTypes=[]} {width=1440, height=900, fps=59.90146, supportedHdrTypes=[]} {width=1152, height=864, fps=75.0, supportedHdrTypes=[]} {width=1280, height=800, fps=60.0, supportedHdrTypes=[]} {width=1280, height=800, fps=59.94006, supportedHdrTypes=[]} {width=1280, height=720, fps=60.0, supportedHdrTypes=[]} {width=1280, height=720, fps=59.94006, supportedHdrTypes=[]} {width=1280, height=720, fps=50.0, supportedHdrTypes=[]} {width=720, height=576, fps=50.0, supportedHdrTypes=[]} {width=720, height=480, fps=60.0, supportedHdrTypes=[]} {width=720, height=480, fps=59.94006, supportedHdrTypes=[]} {width=640, height=480, fps=60.0, supportedHdrTypes=[]} {width=640, height=480, fps=59.94, supportedHdrTypes=[]} ] supported HDR types: [] mHotPlugFail: null comment: /home/xts/tools/android-tvts/./tools/../../android-tvts/testcases/res/EDID/shortlist/bootTestOrderB_defaultMode1440x900p60Hz.bin } at org.junit.Assert.fail(Assert.java:89) at com.google.android.tvts.hdmi.HdmiEdidHostTest.writeResultToDbFailIfMessageSet(HdmiEdidHostTest.java:824) at com.google.android.tvts.hdmi.HdmiEdidHostTest.testDpiMatch(HdmiEdidHostTest.java:1238) at java.base/jdk.internal.reflect.NativeMethodAccessorImpl.invoke0(Native Method) at java.base/jdk.internal.reflect.NativeMethodAccessorImpl.invoke(NativeMethodAccessorImpl.java:62) at java.base/jdk.internal.reflect.DelegatingMethodAccessorImpl.invoke(DelegatingMethodAccessorImpl.java:43) at java.base/java.lang.reflect.Method.invoke(Method.java:566) at org.junit.runners.model.FrameworkMethod$1.runReflectiveCall(FrameworkMethod.java:59) at org.junit.internal.runners.model.ReflectiveCallable.run(ReflectiveCallable.java:12) at org.junit.runners.model.FrameworkMethod.invokeExplosively(FrameworkMethod.java:61) at org.junit.internal.runners.statements.InvokeMethod.evaluate(InvokeMethod.java:17) at org.junit.internal.runners.statements.RunBefores.evaluate(RunBefores.java:26) at org.junit.internal.runners.statements.RunAfters.evaluate(RunAfters.java:27) at org.junit.rules.ExternalResource$1.evaluate(ExternalResource.java:54) at org.junit.rules.TestWatcher$1.evaluate(TestWatcher.java:61) at org.junit.runners.ParentRunner$3.evaluate(ParentRunner.java:306) at org.junit.runners.BlockJUnit4ClassRunner$1.evaluate(BlockJUnit4ClassRunner.java:100) at org.junit.runners.ParentRunner.runLeaf(ParentRunner.java:366) at org.junit.runners.BlockJUnit4ClassRunner.runChild(BlockJUnit4ClassRunner.java:103) at org.junit.runners.BlockJUnit4ClassRunner.runChild(BlockJUnit4ClassRunner.java:63) at org.junit.runners.ParentRunner$4.run(ParentRunner.java:331) at org.junit.runners.ParentRunner$1.schedule(ParentRunner.java:79) at org.junit.runners.ParentRunner.runChildren(ParentRunner.java:329) at org.junit.runners.ParentRunner$2.evaluate(ParentRunner.java:293) at org.junit.runners.ParentRunner.run(ParentRunner.java:413) at org.junit.runners.Suite.runChild(Suite.java:128) at org.junit.runners.Suite.runChild(Suite.java:27) at org.junit.runners.ParentRunner$4.run(ParentRunner.java:331) at org.junit.runners.ParentRunner$1.schedule(ParentRunner.java:79) at org.junit.runners.ParentRunner.runChildren(ParentRunner.java:329) at org.junit.runners.ParentRunner$2.evaluate(ParentRunner.java:293) at org.junit.internal.runners.statements.RunAfters.evaluate(RunAfters.java:27) at org.junit.runners.ParentRunner$3.evaluate(ParentRunner.java:306) at org.junit.runners.ParentRunner.run(ParentRunner.java:413) at com.android.tradefed.testtype.junit4.ExceptionThrowingRunnerWrapper.run(ExceptionThrowingRunnerWrapper.java:43) at org.junit.runner.JUnitCore.run(JUnitCore.java:137) at com.android.tradefed.testtype.HostTest.runJUnit4Tests(HostTest.java:736) at com.android.tradefed.testtype.HostTest.runTestClasses(HostTest.java:616) at com.android.tradefed.testtype.HostTest.run(HostTest.java:564) at com.android.compatibility.common.tradefed.testtype.JarHostTest.run(JarHostTest.java:56) at com.android.tradefed.testtype.suite.GranularRetriableTestWrapper.intraModuleRun(GranularRetriableTestWrapper.java:366) at com.android.tradefed.testtype.suite.GranularRetriableTestWrapper.run(GranularRetriableTestWrapper.java:277) at com.android.tradefed.testtype.suite.ModuleDefinition.run(ModuleDefinition.java:582) at com.android.tradefed.testtype.suite.ITestSuite.runSingleModule(ITestSuite.java:926) at com.android.tradefed.testtype.suite.ITestSuite.run(ITestSuite.java:806) at com.android.tradefed.invoker.InvocationExecution.runTest(InvocationExecution.java:1335) at com.android.tradefed.invoker.InvocationExecution.runTests(InvocationExecution.java:1114) at com.android.tradefed.invoker.TestInvocation.prepareAndRun(TestInvocation.java:604) at com.android.tradefed.invoker.TestInvocation.performInvocation(TestInvocation.java:274) at com.android.tradefed.invoker.TestInvocation.invoke(TestInvocation.java:1322) at com.android.tradefed.command.CommandScheduler$InvocationThread.run(CommandScheduler.java:646)

armeabi-v7a TvtsHdmiHostTestCases
TestResultDetails
com.google.android.tvts.hdmi.HdmiEdidHostTest#testDpiMatch[/home/xts/tools/android-tvts/./tools/../../android-tvts/testcases/res/EDID/shortlist/invalid_all_zeros_edid.bin : 0]
pass
com.google.android.tvts.hdmi.HdmiEdidHostTest#testHdrModesMatch[/home/xts/tools/android-tvts/./tools/../../android-tvts/testcases/res/EDID/shortlist/invalid_all_zeros_edid.bin : 0]
pass
com.google.android.tvts.hdmi.HdmiEdidHostTest#testVideoFailsafeModeSetForInvalidEdid[/home/xts/tools/android-tvts/./tools/../../android-tvts/testcases/res/EDID/shortlist/invalid_all_zeros_edid.bin : 0]
pass
com.google.android.tvts.hdmi.HdmiEdidHostTest#testAudioSamplingRatesMatch[/home/xts/tools/android-tvts/./tools/../../android-tvts/testcases/res/EDID/shortlist/invalid_all_zeros_edid.bin : 0]
pass
com.google.android.tvts.hdmi.HdmiEdidHostTest#testCompareTvDisplayModes[/home/xts/tools/android-tvts/./tools/../../android-tvts/testcases/res/EDID/shortlist/invalid_all_zeros_edid.bin : 0]
pass
com.google.android.tvts.hdmi.HdmiEdidHostTest#test6_1AudioChannelMaskSupport[/home/xts/tools/android-tvts/./tools/../../android-tvts/testcases/res/EDID/shortlist/invalid_all_zeros_edid.bin : 0]
pass
com.google.android.tvts.hdmi.HdmiEdidHostTest#testIfRebootNeeded[/home/xts/tools/android-tvts/./tools/../../android-tvts/testcases/res/EDID/shortlist/invalid_all_zeros_edid.bin : 0]
pass
com.google.android.tvts.hdmi.HdmiEdidHostTest#testBootDisplayMode[/home/xts/tools/android-tvts/./tools/../../android-tvts/testcases/res/EDID/shortlist/invalid_all_zeros_edid.bin : 0]
ASSUMPTION_FAILURE
org.junit.AssumptionViolatedException: This test is applicable only to devices which run Android T or later.
com.google.android.tvts.hdmi.HdmiEdidHostTest#testModeSpecificHdrTypesMatchSupportedHdrTypes[/home/xts/tools/android-tvts/./tools/../../android-tvts/testcases/res/EDID/shortlist/invalid_all_zeros_edid.bin : 0]
ASSUMPTION_FAILURE
org.junit.AssumptionViolatedException: This test is applicable only to devices which run Android U or later.
com.google.android.tvts.hdmi.HdmiEdidHostTest#testNoRepetitionsInDisplayModes[/home/xts/tools/android-tvts/./tools/../../android-tvts/testcases/res/EDID/shortlist/invalid_all_zeros_edid.bin : 0]
pass
com.google.android.tvts.hdmi.HdmiEdidHostTest#testHdmiOutputMatchesMaxRes[/home/xts/tools/android-tvts/./tools/../../android-tvts/testcases/res/EDID/shortlist/invalid_all_zeros_edid.bin : 0]
pass
com.google.android.tvts.hdmi.HdmiEdidHostTest#testIfHotplugEventMissed[/home/xts/tools/android-tvts/./tools/../../android-tvts/testcases/res/EDID/shortlist/invalid_all_zeros_edid.bin : 0]
pass
com.google.android.tvts.hdmi.HdmiEdidHostTest#test4k30DolbyVision[/home/xts/tools/android-tvts/./tools/../../android-tvts/testcases/res/EDID/shortlist/invalid_all_zeros_edid.bin : 0]
ASSUMPTION_FAILURE
org.junit.AssumptionViolatedException: This test is applicable only to devices which run Android U or later.
com.google.android.tvts.hdmi.HdmiEdidHostTest#testAudioEncodingsMatch[/home/xts/tools/android-tvts/./tools/../../android-tvts/testcases/res/EDID/shortlist/invalid_all_zeros_edid.bin : 0]
pass
com.google.android.tvts.hdmi.HdmiEdidHostTest#testAudioChannelCountMatch[/home/xts/tools/android-tvts/./tools/../../android-tvts/testcases/res/EDID/shortlist/invalid_all_zeros_edid.bin : 0]
pass
com.google.android.tvts.hdmi.HdmiEdidHostTest#testIfCommunicationIssueWithDut[/home/xts/tools/android-tvts/./tools/../../android-tvts/testcases/res/EDID/shortlist/invalid_all_zeros_edid.bin : 0]
pass
com.google.android.tvts.hdmi.HdmiEdidHostTest#testDeviceDisplayModesAreInEdid[/home/xts/tools/android-tvts/./tools/../../android-tvts/testcases/res/EDID/shortlist/invalid_all_zeros_edid.bin : 0]
pass
com.google.android.tvts.hdmi.HdmiEdidHostTest#testDeviceProductInfo[/home/xts/tools/android-tvts/./tools/../../android-tvts/testcases/res/EDID/shortlist/invalid_all_zeros_edid.bin : 0]
pass
com.google.android.tvts.hdmi.HdmiEdidHostTest#testHdmiOutputInEdid[/home/xts/tools/android-tvts/./tools/../../android-tvts/testcases/res/EDID/shortlist/invalid_all_zeros_edid.bin : 0]
pass
com.google.android.tvts.hdmi.HdmiEdidHostTest#testDpiMatch[/home/xts/tools/android-tvts/./tools/../../android-tvts/testcases/res/EDID/shortlist/invalid_corrupted_edid.bin : 1]
pass
com.google.android.tvts.hdmi.HdmiEdidHostTest#testHdrModesMatch[/home/xts/tools/android-tvts/./tools/../../android-tvts/testcases/res/EDID/shortlist/invalid_corrupted_edid.bin : 1]
pass
com.google.android.tvts.hdmi.HdmiEdidHostTest#testVideoFailsafeModeSetForInvalidEdid[/home/xts/tools/android-tvts/./tools/../../android-tvts/testcases/res/EDID/shortlist/invalid_corrupted_edid.bin : 1]
pass
com.google.android.tvts.hdmi.HdmiEdidHostTest#testAudioSamplingRatesMatch[/home/xts/tools/android-tvts/./tools/../../android-tvts/testcases/res/EDID/shortlist/invalid_corrupted_edid.bin : 1]
pass
com.google.android.tvts.hdmi.HdmiEdidHostTest#testCompareTvDisplayModes[/home/xts/tools/android-tvts/./tools/../../android-tvts/testcases/res/EDID/shortlist/invalid_corrupted_edid.bin : 1]
pass
com.google.android.tvts.hdmi.HdmiEdidHostTest#test6_1AudioChannelMaskSupport[/home/xts/tools/android-tvts/./tools/../../android-tvts/testcases/res/EDID/shortlist/invalid_corrupted_edid.bin : 1]
pass
com.google.android.tvts.hdmi.HdmiEdidHostTest#testIfRebootNeeded[/home/xts/tools/android-tvts/./tools/../../android-tvts/testcases/res/EDID/shortlist/invalid_corrupted_edid.bin : 1]
pass
com.google.android.tvts.hdmi.HdmiEdidHostTest#testBootDisplayMode[/home/xts/tools/android-tvts/./tools/../../android-tvts/testcases/res/EDID/shortlist/invalid_corrupted_edid.bin : 1]
ASSUMPTION_FAILURE
org.junit.AssumptionViolatedException: This test is applicable only to devices which run Android T or later.
com.google.android.tvts.hdmi.HdmiEdidHostTest#testModeSpecificHdrTypesMatchSupportedHdrTypes[/home/xts/tools/android-tvts/./tools/../../android-tvts/testcases/res/EDID/shortlist/invalid_corrupted_edid.bin : 1]
ASSUMPTION_FAILURE
org.junit.AssumptionViolatedException: This test is applicable only to devices which run Android U or later.
com.google.android.tvts.hdmi.HdmiEdidHostTest#testNoRepetitionsInDisplayModes[/home/xts/tools/android-tvts/./tools/../../android-tvts/testcases/res/EDID/shortlist/invalid_corrupted_edid.bin : 1]
pass
com.google.android.tvts.hdmi.HdmiEdidHostTest#testHdmiOutputMatchesMaxRes[/home/xts/tools/android-tvts/./tools/../../android-tvts/testcases/res/EDID/shortlist/invalid_corrupted_edid.bin : 1]
pass
com.google.android.tvts.hdmi.HdmiEdidHostTest#testIfHotplugEventMissed[/home/xts/tools/android-tvts/./tools/../../android-tvts/testcases/res/EDID/shortlist/invalid_corrupted_edid.bin : 1]
pass
com.google.android.tvts.hdmi.HdmiEdidHostTest#test4k30DolbyVision[/home/xts/tools/android-tvts/./tools/../../android-tvts/testcases/res/EDID/shortlist/invalid_corrupted_edid.bin : 1]
ASSUMPTION_FAILURE
org.junit.AssumptionViolatedException: This test is applicable only to devices which run Android U or later.
com.google.android.tvts.hdmi.HdmiEdidHostTest#testAudioEncodingsMatch[/home/xts/tools/android-tvts/./tools/../../android-tvts/testcases/res/EDID/shortlist/invalid_corrupted_edid.bin : 1]
pass
com.google.android.tvts.hdmi.HdmiEdidHostTest#testAudioChannelCountMatch[/home/xts/tools/android-tvts/./tools/../../android-tvts/testcases/res/EDID/shortlist/invalid_corrupted_edid.bin : 1]
pass
com.google.android.tvts.hdmi.HdmiEdidHostTest#testIfCommunicationIssueWithDut[/home/xts/tools/android-tvts/./tools/../../android-tvts/testcases/res/EDID/shortlist/invalid_corrupted_edid.bin : 1]
pass
com.google.android.tvts.hdmi.HdmiEdidHostTest#testDeviceDisplayModesAreInEdid[/home/xts/tools/android-tvts/./tools/../../android-tvts/testcases/res/EDID/shortlist/invalid_corrupted_edid.bin : 1]
pass
com.google.android.tvts.hdmi.HdmiEdidHostTest#testDeviceProductInfo[/home/xts/tools/android-tvts/./tools/../../android-tvts/testcases/res/EDID/shortlist/invalid_corrupted_edid.bin : 1]
pass
com.google.android.tvts.hdmi.HdmiEdidHostTest#testHdmiOutputInEdid[/home/xts/tools/android-tvts/./tools/../../android-tvts/testcases/res/EDID/shortlist/invalid_corrupted_edid.bin : 1]
pass
com.google.android.tvts.hdmi.HdmiEdidHostTest#testDpiMatch[/home/xts/tools/android-tvts/./tools/../../android-tvts/testcases/res/EDID/shortlist/0399697E7ADE.bin : 2]
fail
java.lang.AssertionError: DPI does not match: device reported DPI: 160.0, 160.0 is expected to match EDID DPI calculated from DTD: 69.868195, 69.97959 (screen size = 69.799995cm x 39.2cm) or EDID DPI calculated from basic display info: unavailable
com.google.android.tvts.hdmi.HdmiEdidHostTest#testHdrModesMatch[/home/xts/tools/android-tvts/./tools/../../android-tvts/testcases/res/EDID/shortlist/0399697E7ADE.bin : 2]
pass
com.google.android.tvts.hdmi.HdmiEdidHostTest#testVideoFailsafeModeSetForInvalidEdid[/home/xts/tools/android-tvts/./tools/../../android-tvts/testcases/res/EDID/shortlist/0399697E7ADE.bin : 2]
pass
com.google.android.tvts.hdmi.HdmiEdidHostTest#testAudioSamplingRatesMatch[/home/xts/tools/android-tvts/./tools/../../android-tvts/testcases/res/EDID/shortlist/0399697E7ADE.bin : 2]
pass
com.google.android.tvts.hdmi.HdmiEdidHostTest#testCompareTvDisplayModes[/home/xts/tools/android-tvts/./tools/../../android-tvts/testcases/res/EDID/shortlist/0399697E7ADE.bin : 2]
pass
com.google.android.tvts.hdmi.HdmiEdidHostTest#test6_1AudioChannelMaskSupport[/home/xts/tools/android-tvts/./tools/../../android-tvts/testcases/res/EDID/shortlist/0399697E7ADE.bin : 2]
pass
com.google.android.tvts.hdmi.HdmiEdidHostTest#testIfRebootNeeded[/home/xts/tools/android-tvts/./tools/../../android-tvts/testcases/res/EDID/shortlist/0399697E7ADE.bin : 2]
pass
com.google.android.tvts.hdmi.HdmiEdidHostTest#testBootDisplayMode[/home/xts/tools/android-tvts/./tools/../../android-tvts/testcases/res/EDID/shortlist/0399697E7ADE.bin : 2]
ASSUMPTION_FAILURE
org.junit.AssumptionViolatedException: This test is applicable only to devices which run Android T or later.
com.google.android.tvts.hdmi.HdmiEdidHostTest#testModeSpecificHdrTypesMatchSupportedHdrTypes[/home/xts/tools/android-tvts/./tools/../../android-tvts/testcases/res/EDID/shortlist/0399697E7ADE.bin : 2]
ASSUMPTION_FAILURE
org.junit.AssumptionViolatedException: This test is applicable only to devices which run Android U or later.
com.google.android.tvts.hdmi.HdmiEdidHostTest#testNoRepetitionsInDisplayModes[/home/xts/tools/android-tvts/./tools/../../android-tvts/testcases/res/EDID/shortlist/0399697E7ADE.bin : 2]
pass
com.google.android.tvts.hdmi.HdmiEdidHostTest#testHdmiOutputMatchesMaxRes[/home/xts/tools/android-tvts/./tools/../../android-tvts/testcases/res/EDID/shortlist/0399697E7ADE.bin : 2]
pass
com.google.android.tvts.hdmi.HdmiEdidHostTest#testIfHotplugEventMissed[/home/xts/tools/android-tvts/./tools/../../android-tvts/testcases/res/EDID/shortlist/0399697E7ADE.bin : 2]
pass
com.google.android.tvts.hdmi.HdmiEdidHostTest#test4k30DolbyVision[/home/xts/tools/android-tvts/./tools/../../android-tvts/testcases/res/EDID/shortlist/0399697E7ADE.bin : 2]
ASSUMPTION_FAILURE
org.junit.AssumptionViolatedException: This test is applicable only to devices which run Android U or later.
com.google.android.tvts.hdmi.HdmiEdidHostTest#testAudioEncodingsMatch[/home/xts/tools/android-tvts/./tools/../../android-tvts/testcases/res/EDID/shortlist/0399697E7ADE.bin : 2]
pass
com.google.android.tvts.hdmi.HdmiEdidHostTest#testAudioChannelCountMatch[/home/xts/tools/android-tvts/./tools/../../android-tvts/testcases/res/EDID/shortlist/0399697E7ADE.bin : 2]
pass
com.google.android.tvts.hdmi.HdmiEdidHostTest#testIfCommunicationIssueWithDut[/home/xts/tools/android-tvts/./tools/../../android-tvts/testcases/res/EDID/shortlist/0399697E7ADE.bin : 2]
pass
com.google.android.tvts.hdmi.HdmiEdidHostTest#testDeviceDisplayModesAreInEdid[/home/xts/tools/android-tvts/./tools/../../android-tvts/testcases/res/EDID/shortlist/0399697E7ADE.bin : 2]
pass
com.google.android.tvts.hdmi.HdmiEdidHostTest#testDeviceProductInfo[/home/xts/tools/android-tvts/./tools/../../android-tvts/testcases/res/EDID/shortlist/0399697E7ADE.bin : 2]
pass
com.google.android.tvts.hdmi.HdmiEdidHostTest#testHdmiOutputInEdid[/home/xts/tools/android-tvts/./tools/../../android-tvts/testcases/res/EDID/shortlist/0399697E7ADE.bin : 2]
pass
com.google.android.tvts.hdmi.HdmiEdidHostTest#testDpiMatch[/home/xts/tools/android-tvts/./tools/../../android-tvts/testcases/res/EDID/shortlist/02A540FCEE15.bin : 3]
fail
java.lang.AssertionError: DPI does not match: device reported DPI: 160.0, 160.0 is expected to match EDID DPI calculated from DTD: 60.96, 60.959995 (screen size = 80.0cm x 45.0cm) or EDID DPI calculated from basic display info: 43.935135, 44.245163 (screen size = 111cm x 62cm)
com.google.android.tvts.hdmi.HdmiEdidHostTest#testHdrModesMatch[/home/xts/tools/android-tvts/./tools/../../android-tvts/testcases/res/EDID/shortlist/02A540FCEE15.bin : 3]
pass
com.google.android.tvts.hdmi.HdmiEdidHostTest#testVideoFailsafeModeSetForInvalidEdid[/home/xts/tools/android-tvts/./tools/../../android-tvts/testcases/res/EDID/shortlist/02A540FCEE15.bin : 3]
pass
com.google.android.tvts.hdmi.HdmiEdidHostTest#testAudioSamplingRatesMatch[/home/xts/tools/android-tvts/./tools/../../android-tvts/testcases/res/EDID/shortlist/02A540FCEE15.bin : 3]
pass
com.google.android.tvts.hdmi.HdmiEdidHostTest#testCompareTvDisplayModes[/home/xts/tools/android-tvts/./tools/../../android-tvts/testcases/res/EDID/shortlist/02A540FCEE15.bin : 3]
pass
com.google.android.tvts.hdmi.HdmiEdidHostTest#test6_1AudioChannelMaskSupport[/home/xts/tools/android-tvts/./tools/../../android-tvts/testcases/res/EDID/shortlist/02A540FCEE15.bin : 3]
pass
com.google.android.tvts.hdmi.HdmiEdidHostTest#testIfRebootNeeded[/home/xts/tools/android-tvts/./tools/../../android-tvts/testcases/res/EDID/shortlist/02A540FCEE15.bin : 3]
pass
com.google.android.tvts.hdmi.HdmiEdidHostTest#testBootDisplayMode[/home/xts/tools/android-tvts/./tools/../../android-tvts/testcases/res/EDID/shortlist/02A540FCEE15.bin : 3]
ASSUMPTION_FAILURE
org.junit.AssumptionViolatedException: This test is applicable only to devices which run Android T or later.
com.google.android.tvts.hdmi.HdmiEdidHostTest#testModeSpecificHdrTypesMatchSupportedHdrTypes[/home/xts/tools/android-tvts/./tools/../../android-tvts/testcases/res/EDID/shortlist/02A540FCEE15.bin : 3]
ASSUMPTION_FAILURE
org.junit.AssumptionViolatedException: This test is applicable only to devices which run Android U or later.
com.google.android.tvts.hdmi.HdmiEdidHostTest#testNoRepetitionsInDisplayModes[/home/xts/tools/android-tvts/./tools/../../android-tvts/testcases/res/EDID/shortlist/02A540FCEE15.bin : 3]
pass
com.google.android.tvts.hdmi.HdmiEdidHostTest#testHdmiOutputMatchesMaxRes[/home/xts/tools/android-tvts/./tools/../../android-tvts/testcases/res/EDID/shortlist/02A540FCEE15.bin : 3]
pass
com.google.android.tvts.hdmi.HdmiEdidHostTest#testIfHotplugEventMissed[/home/xts/tools/android-tvts/./tools/../../android-tvts/testcases/res/EDID/shortlist/02A540FCEE15.bin : 3]
pass
com.google.android.tvts.hdmi.HdmiEdidHostTest#test4k30DolbyVision[/home/xts/tools/android-tvts/./tools/../../android-tvts/testcases/res/EDID/shortlist/02A540FCEE15.bin : 3]
ASSUMPTION_FAILURE
org.junit.AssumptionViolatedException: This test is applicable only to devices which run Android U or later.
com.google.android.tvts.hdmi.HdmiEdidHostTest#testAudioEncodingsMatch[/home/xts/tools/android-tvts/./tools/../../android-tvts/testcases/res/EDID/shortlist/02A540FCEE15.bin : 3]
pass
com.google.android.tvts.hdmi.HdmiEdidHostTest#testAudioChannelCountMatch[/home/xts/tools/android-tvts/./tools/../../android-tvts/testcases/res/EDID/shortlist/02A540FCEE15.bin : 3]
pass
com.google.android.tvts.hdmi.HdmiEdidHostTest#testIfCommunicationIssueWithDut[/home/xts/tools/android-tvts/./tools/../../android-tvts/testcases/res/EDID/shortlist/02A540FCEE15.bin : 3]
pass
com.google.android.tvts.hdmi.HdmiEdidHostTest#testDeviceDisplayModesAreInEdid[/home/xts/tools/android-tvts/./tools/../../android-tvts/testcases/res/EDID/shortlist/02A540FCEE15.bin : 3]
pass
com.google.android.tvts.hdmi.HdmiEdidHostTest#testDeviceProductInfo[/home/xts/tools/android-tvts/./tools/../../android-tvts/testcases/res/EDID/shortlist/02A540FCEE15.bin : 3]
pass
com.google.android.tvts.hdmi.HdmiEdidHostTest#testHdmiOutputInEdid[/home/xts/tools/android-tvts/./tools/../../android-tvts/testcases/res/EDID/shortlist/02A540FCEE15.bin : 3]
pass
com.google.android.tvts.hdmi.HdmiEdidHostTest#testDpiMatch[/home/xts/tools/android-tvts/./tools/../../android-tvts/testcases/res/EDID/shortlist/bootTestOrderC_defaultMode1920x1080p60Hz.bin : 4]
fail
java.lang.AssertionError: DPI does not match: device reported DPI: 160.0, 160.0 is expected to match EDID DPI calculated from DTD: 102.23899, 102.35821 (screen size = 47.7cm x 26.8cm) or EDID DPI calculated from basic display info: 101.6, 101.600006 (screen size = 48cm x 27cm)
com.google.android.tvts.hdmi.HdmiEdidHostTest#testHdrModesMatch[/home/xts/tools/android-tvts/./tools/../../android-tvts/testcases/res/EDID/shortlist/bootTestOrderC_defaultMode1920x1080p60Hz.bin : 4]
pass
com.google.android.tvts.hdmi.HdmiEdidHostTest#testVideoFailsafeModeSetForInvalidEdid[/home/xts/tools/android-tvts/./tools/../../android-tvts/testcases/res/EDID/shortlist/bootTestOrderC_defaultMode1920x1080p60Hz.bin : 4]
pass
com.google.android.tvts.hdmi.HdmiEdidHostTest#testAudioSamplingRatesMatch[/home/xts/tools/android-tvts/./tools/../../android-tvts/testcases/res/EDID/shortlist/bootTestOrderC_defaultMode1920x1080p60Hz.bin : 4]
pass
com.google.android.tvts.hdmi.HdmiEdidHostTest#testCompareTvDisplayModes[/home/xts/tools/android-tvts/./tools/../../android-tvts/testcases/res/EDID/shortlist/bootTestOrderC_defaultMode1920x1080p60Hz.bin : 4]
pass
com.google.android.tvts.hdmi.HdmiEdidHostTest#test6_1AudioChannelMaskSupport[/home/xts/tools/android-tvts/./tools/../../android-tvts/testcases/res/EDID/shortlist/bootTestOrderC_defaultMode1920x1080p60Hz.bin : 4]
pass
com.google.android.tvts.hdmi.HdmiEdidHostTest#testIfRebootNeeded[/home/xts/tools/android-tvts/./tools/../../android-tvts/testcases/res/EDID/shortlist/bootTestOrderC_defaultMode1920x1080p60Hz.bin : 4]
pass
com.google.android.tvts.hdmi.HdmiEdidHostTest#testBootDisplayMode[/home/xts/tools/android-tvts/./tools/../../android-tvts/testcases/res/EDID/shortlist/bootTestOrderC_defaultMode1920x1080p60Hz.bin : 4]
ASSUMPTION_FAILURE
org.junit.AssumptionViolatedException: This test is applicable only to devices which run Android T or later.
com.google.android.tvts.hdmi.HdmiEdidHostTest#testModeSpecificHdrTypesMatchSupportedHdrTypes[/home/xts/tools/android-tvts/./tools/../../android-tvts/testcases/res/EDID/shortlist/bootTestOrderC_defaultMode1920x1080p60Hz.bin : 4]
ASSUMPTION_FAILURE
org.junit.AssumptionViolatedException: This test is applicable only to devices which run Android U or later.
com.google.android.tvts.hdmi.HdmiEdidHostTest#testNoRepetitionsInDisplayModes[/home/xts/tools/android-tvts/./tools/../../android-tvts/testcases/res/EDID/shortlist/bootTestOrderC_defaultMode1920x1080p60Hz.bin : 4]
pass
com.google.android.tvts.hdmi.HdmiEdidHostTest#testHdmiOutputMatchesMaxRes[/home/xts/tools/android-tvts/./tools/../../android-tvts/testcases/res/EDID/shortlist/bootTestOrderC_defaultMode1920x1080p60Hz.bin : 4]
pass
com.google.android.tvts.hdmi.HdmiEdidHostTest#testIfHotplugEventMissed[/home/xts/tools/android-tvts/./tools/../../android-tvts/testcases/res/EDID/shortlist/bootTestOrderC_defaultMode1920x1080p60Hz.bin : 4]
pass
com.google.android.tvts.hdmi.HdmiEdidHostTest#test4k30DolbyVision[/home/xts/tools/android-tvts/./tools/../../android-tvts/testcases/res/EDID/shortlist/bootTestOrderC_defaultMode1920x1080p60Hz.bin : 4]
ASSUMPTION_FAILURE
org.junit.AssumptionViolatedException: This test is applicable only to devices which run Android U or later.
com.google.android.tvts.hdmi.HdmiEdidHostTest#testAudioEncodingsMatch[/home/xts/tools/android-tvts/./tools/../../android-tvts/testcases/res/EDID/shortlist/bootTestOrderC_defaultMode1920x1080p60Hz.bin : 4]
pass
com.google.android.tvts.hdmi.HdmiEdidHostTest#testAudioChannelCountMatch[/home/xts/tools/android-tvts/./tools/../../android-tvts/testcases/res/EDID/shortlist/bootTestOrderC_defaultMode1920x1080p60Hz.bin : 4]
pass
com.google.android.tvts.hdmi.HdmiEdidHostTest#testIfCommunicationIssueWithDut[/home/xts/tools/android-tvts/./tools/../../android-tvts/testcases/res/EDID/shortlist/bootTestOrderC_defaultMode1920x1080p60Hz.bin : 4]
pass
com.google.android.tvts.hdmi.HdmiEdidHostTest#testDeviceDisplayModesAreInEdid[/home/xts/tools/android-tvts/./tools/../../android-tvts/testcases/res/EDID/shortlist/bootTestOrderC_defaultMode1920x1080p60Hz.bin : 4]
pass
com.google.android.tvts.hdmi.HdmiEdidHostTest#testDeviceProductInfo[/home/xts/tools/android-tvts/./tools/../../android-tvts/testcases/res/EDID/shortlist/bootTestOrderC_defaultMode1920x1080p60Hz.bin : 4]
pass
com.google.android.tvts.hdmi.HdmiEdidHostTest#testHdmiOutputInEdid[/home/xts/tools/android-tvts/./tools/../../android-tvts/testcases/res/EDID/shortlist/bootTestOrderC_defaultMode1920x1080p60Hz.bin : 4]
pass
com.google.android.tvts.hdmi.HdmiEdidHostTest#testDpiMatch[/home/xts/tools/android-tvts/./tools/../../android-tvts/testcases/res/EDID/shortlist/1723FF2DC6D1.bin : 5]
fail
java.lang.AssertionError: DPI does not match: device reported DPI: 160.0, 160.0 is expected to match EDID DPI calculated from DTD: 60.96, 60.959995 (screen size = 80.0cm x 45.0cm) or EDID DPI calculated from basic display info: 40.304134, 40.341175 (screen size = 121cm x 68cm)
com.google.android.tvts.hdmi.HdmiEdidHostTest#testHdrModesMatch[/home/xts/tools/android-tvts/./tools/../../android-tvts/testcases/res/EDID/shortlist/1723FF2DC6D1.bin : 5]
pass
com.google.android.tvts.hdmi.HdmiEdidHostTest#testVideoFailsafeModeSetForInvalidEdid[/home/xts/tools/android-tvts/./tools/../../android-tvts/testcases/res/EDID/shortlist/1723FF2DC6D1.bin : 5]
pass
com.google.android.tvts.hdmi.HdmiEdidHostTest#testAudioSamplingRatesMatch[/home/xts/tools/android-tvts/./tools/../../android-tvts/testcases/res/EDID/shortlist/1723FF2DC6D1.bin : 5]
pass
com.google.android.tvts.hdmi.HdmiEdidHostTest#testCompareTvDisplayModes[/home/xts/tools/android-tvts/./tools/../../android-tvts/testcases/res/EDID/shortlist/1723FF2DC6D1.bin : 5]
pass
com.google.android.tvts.hdmi.HdmiEdidHostTest#test6_1AudioChannelMaskSupport[/home/xts/tools/android-tvts/./tools/../../android-tvts/testcases/res/EDID/shortlist/1723FF2DC6D1.bin : 5]
pass
com.google.android.tvts.hdmi.HdmiEdidHostTest#testIfRebootNeeded[/home/xts/tools/android-tvts/./tools/../../android-tvts/testcases/res/EDID/shortlist/1723FF2DC6D1.bin : 5]
pass
com.google.android.tvts.hdmi.HdmiEdidHostTest#testBootDisplayMode[/home/xts/tools/android-tvts/./tools/../../android-tvts/testcases/res/EDID/shortlist/1723FF2DC6D1.bin : 5]
ASSUMPTION_FAILURE
org.junit.AssumptionViolatedException: This test is applicable only to devices which run Android T or later.
com.google.android.tvts.hdmi.HdmiEdidHostTest#testModeSpecificHdrTypesMatchSupportedHdrTypes[/home/xts/tools/android-tvts/./tools/../../android-tvts/testcases/res/EDID/shortlist/1723FF2DC6D1.bin : 5]
ASSUMPTION_FAILURE
org.junit.AssumptionViolatedException: This test is applicable only to devices which run Android U or later.
com.google.android.tvts.hdmi.HdmiEdidHostTest#testNoRepetitionsInDisplayModes[/home/xts/tools/android-tvts/./tools/../../android-tvts/testcases/res/EDID/shortlist/1723FF2DC6D1.bin : 5]
pass
com.google.android.tvts.hdmi.HdmiEdidHostTest#testHdmiOutputMatchesMaxRes[/home/xts/tools/android-tvts/./tools/../../android-tvts/testcases/res/EDID/shortlist/1723FF2DC6D1.bin : 5]
pass
com.google.android.tvts.hdmi.HdmiEdidHostTest#testIfHotplugEventMissed[/home/xts/tools/android-tvts/./tools/../../android-tvts/testcases/res/EDID/shortlist/1723FF2DC6D1.bin : 5]
pass
com.google.android.tvts.hdmi.HdmiEdidHostTest#test4k30DolbyVision[/home/xts/tools/android-tvts/./tools/../../android-tvts/testcases/res/EDID/shortlist/1723FF2DC6D1.bin : 5]
ASSUMPTION_FAILURE
org.junit.AssumptionViolatedException: This test is applicable only to devices which run Android U or later.
com.google.android.tvts.hdmi.HdmiEdidHostTest#testAudioEncodingsMatch[/home/xts/tools/android-tvts/./tools/../../android-tvts/testcases/res/EDID/shortlist/1723FF2DC6D1.bin : 5]
pass
com.google.android.tvts.hdmi.HdmiEdidHostTest#testAudioChannelCountMatch[/home/xts/tools/android-tvts/./tools/../../android-tvts/testcases/res/EDID/shortlist/1723FF2DC6D1.bin : 5]
pass
com.google.android.tvts.hdmi.HdmiEdidHostTest#testIfCommunicationIssueWithDut[/home/xts/tools/android-tvts/./tools/../../android-tvts/testcases/res/EDID/shortlist/1723FF2DC6D1.bin : 5]
pass
com.google.android.tvts.hdmi.HdmiEdidHostTest#testDeviceDisplayModesAreInEdid[/home/xts/tools/android-tvts/./tools/../../android-tvts/testcases/res/EDID/shortlist/1723FF2DC6D1.bin : 5]
pass
com.google.android.tvts.hdmi.HdmiEdidHostTest#testDeviceProductInfo[/home/xts/tools/android-tvts/./tools/../../android-tvts/testcases/res/EDID/shortlist/1723FF2DC6D1.bin : 5]
pass
com.google.android.tvts.hdmi.HdmiEdidHostTest#testHdmiOutputInEdid[/home/xts/tools/android-tvts/./tools/../../android-tvts/testcases/res/EDID/shortlist/1723FF2DC6D1.bin : 5]
pass
com.google.android.tvts.hdmi.HdmiEdidHostTest#testDpiMatch[/home/xts/tools/android-tvts/./tools/../../android-tvts/testcases/res/EDID/shortlist/43S405.bin : 6]
fail
java.lang.AssertionError: DPI does not match: device reported DPI: 160.0, 160.0 is expected to match EDID DPI calculated from DTD: 60.96, 60.959995 (screen size = 80.0cm x 45.0cm) or EDID DPI calculated from basic display info: 51.88085, 51.758488 (screen size = 94cm x 53cm)
com.google.android.tvts.hdmi.HdmiEdidHostTest#testHdrModesMatch[/home/xts/tools/android-tvts/./tools/../../android-tvts/testcases/res/EDID/shortlist/43S405.bin : 6]
pass
com.google.android.tvts.hdmi.HdmiEdidHostTest#testVideoFailsafeModeSetForInvalidEdid[/home/xts/tools/android-tvts/./tools/../../android-tvts/testcases/res/EDID/shortlist/43S405.bin : 6]
pass
com.google.android.tvts.hdmi.HdmiEdidHostTest#testAudioSamplingRatesMatch[/home/xts/tools/android-tvts/./tools/../../android-tvts/testcases/res/EDID/shortlist/43S405.bin : 6]
pass
com.google.android.tvts.hdmi.HdmiEdidHostTest#testCompareTvDisplayModes[/home/xts/tools/android-tvts/./tools/../../android-tvts/testcases/res/EDID/shortlist/43S405.bin : 6]
pass
com.google.android.tvts.hdmi.HdmiEdidHostTest#test6_1AudioChannelMaskSupport[/home/xts/tools/android-tvts/./tools/../../android-tvts/testcases/res/EDID/shortlist/43S405.bin : 6]
pass
com.google.android.tvts.hdmi.HdmiEdidHostTest#testIfRebootNeeded[/home/xts/tools/android-tvts/./tools/../../android-tvts/testcases/res/EDID/shortlist/43S405.bin : 6]
pass
com.google.android.tvts.hdmi.HdmiEdidHostTest#testBootDisplayMode[/home/xts/tools/android-tvts/./tools/../../android-tvts/testcases/res/EDID/shortlist/43S405.bin : 6]
ASSUMPTION_FAILURE
org.junit.AssumptionViolatedException: This test is applicable only to devices which run Android T or later.
com.google.android.tvts.hdmi.HdmiEdidHostTest#testModeSpecificHdrTypesMatchSupportedHdrTypes[/home/xts/tools/android-tvts/./tools/../../android-tvts/testcases/res/EDID/shortlist/43S405.bin : 6]
ASSUMPTION_FAILURE
org.junit.AssumptionViolatedException: This test is applicable only to devices which run Android U or later.
com.google.android.tvts.hdmi.HdmiEdidHostTest#testNoRepetitionsInDisplayModes[/home/xts/tools/android-tvts/./tools/../../android-tvts/testcases/res/EDID/shortlist/43S405.bin : 6]
pass
com.google.android.tvts.hdmi.HdmiEdidHostTest#testHdmiOutputMatchesMaxRes[/home/xts/tools/android-tvts/./tools/../../android-tvts/testcases/res/EDID/shortlist/43S405.bin : 6]
pass
com.google.android.tvts.hdmi.HdmiEdidHostTest#testIfHotplugEventMissed[/home/xts/tools/android-tvts/./tools/../../android-tvts/testcases/res/EDID/shortlist/43S405.bin : 6]
pass
com.google.android.tvts.hdmi.HdmiEdidHostTest#test4k30DolbyVision[/home/xts/tools/android-tvts/./tools/../../android-tvts/testcases/res/EDID/shortlist/43S405.bin : 6]
ASSUMPTION_FAILURE
org.junit.AssumptionViolatedException: This test is applicable only to devices which run Android U or later.
com.google.android.tvts.hdmi.HdmiEdidHostTest#testAudioEncodingsMatch[/home/xts/tools/android-tvts/./tools/../../android-tvts/testcases/res/EDID/shortlist/43S405.bin : 6]
pass
com.google.android.tvts.hdmi.HdmiEdidHostTest#testAudioChannelCountMatch[/home/xts/tools/android-tvts/./tools/../../android-tvts/testcases/res/EDID/shortlist/43S405.bin : 6]
pass
com.google.android.tvts.hdmi.HdmiEdidHostTest#testIfCommunicationIssueWithDut[/home/xts/tools/android-tvts/./tools/../../android-tvts/testcases/res/EDID/shortlist/43S405.bin : 6]
pass
com.google.android.tvts.hdmi.HdmiEdidHostTest#testDeviceDisplayModesAreInEdid[/home/xts/tools/android-tvts/./tools/../../android-tvts/testcases/res/EDID/shortlist/43S405.bin : 6]
pass
com.google.android.tvts.hdmi.HdmiEdidHostTest#testDeviceProductInfo[/home/xts/tools/android-tvts/./tools/../../android-tvts/testcases/res/EDID/shortlist/43S405.bin : 6]
pass
com.google.android.tvts.hdmi.HdmiEdidHostTest#testHdmiOutputInEdid[/home/xts/tools/android-tvts/./tools/../../android-tvts/testcases/res/EDID/shortlist/43S405.bin : 6]
pass
com.google.android.tvts.hdmi.HdmiEdidHostTest#testDpiMatch[/home/xts/tools/android-tvts/./tools/../../android-tvts/testcases/res/EDID/shortlist/67DBD3E84099.bin : 7]
fail
java.lang.AssertionError: DPI does not match: device reported DPI: 160.0, 160.0 is expected to match EDID DPI calculated from DTD: 60.96, 60.959995 (screen size = 80.0cm x 45.0cm) or EDID DPI calculated from basic display info: 54.7955, 54.864 (screen size = 89cm x 50cm)
com.google.android.tvts.hdmi.HdmiEdidHostTest#testHdrModesMatch[/home/xts/tools/android-tvts/./tools/../../android-tvts/testcases/res/EDID/shortlist/67DBD3E84099.bin : 7]
pass
com.google.android.tvts.hdmi.HdmiEdidHostTest#testVideoFailsafeModeSetForInvalidEdid[/home/xts/tools/android-tvts/./tools/../../android-tvts/testcases/res/EDID/shortlist/67DBD3E84099.bin : 7]
pass
com.google.android.tvts.hdmi.HdmiEdidHostTest#testAudioSamplingRatesMatch[/home/xts/tools/android-tvts/./tools/../../android-tvts/testcases/res/EDID/shortlist/67DBD3E84099.bin : 7]
pass
com.google.android.tvts.hdmi.HdmiEdidHostTest#testCompareTvDisplayModes[/home/xts/tools/android-tvts/./tools/../../android-tvts/testcases/res/EDID/shortlist/67DBD3E84099.bin : 7]
pass
com.google.android.tvts.hdmi.HdmiEdidHostTest#test6_1AudioChannelMaskSupport[/home/xts/tools/android-tvts/./tools/../../android-tvts/testcases/res/EDID/shortlist/67DBD3E84099.bin : 7]
pass
com.google.android.tvts.hdmi.HdmiEdidHostTest#testIfRebootNeeded[/home/xts/tools/android-tvts/./tools/../../android-tvts/testcases/res/EDID/shortlist/67DBD3E84099.bin : 7]
pass
com.google.android.tvts.hdmi.HdmiEdidHostTest#testBootDisplayMode[/home/xts/tools/android-tvts/./tools/../../android-tvts/testcases/res/EDID/shortlist/67DBD3E84099.bin : 7]
ASSUMPTION_FAILURE
org.junit.AssumptionViolatedException: This test is applicable only to devices which run Android T or later.
com.google.android.tvts.hdmi.HdmiEdidHostTest#testModeSpecificHdrTypesMatchSupportedHdrTypes[/home/xts/tools/android-tvts/./tools/../../android-tvts/testcases/res/EDID/shortlist/67DBD3E84099.bin : 7]
ASSUMPTION_FAILURE
org.junit.AssumptionViolatedException: This test is applicable only to devices which run Android U or later.
com.google.android.tvts.hdmi.HdmiEdidHostTest#testNoRepetitionsInDisplayModes[/home/xts/tools/android-tvts/./tools/../../android-tvts/testcases/res/EDID/shortlist/67DBD3E84099.bin : 7]
pass
com.google.android.tvts.hdmi.HdmiEdidHostTest#testHdmiOutputMatchesMaxRes[/home/xts/tools/android-tvts/./tools/../../android-tvts/testcases/res/EDID/shortlist/67DBD3E84099.bin : 7]
pass
com.google.android.tvts.hdmi.HdmiEdidHostTest#testIfHotplugEventMissed[/home/xts/tools/android-tvts/./tools/../../android-tvts/testcases/res/EDID/shortlist/67DBD3E84099.bin : 7]
pass
com.google.android.tvts.hdmi.HdmiEdidHostTest#test4k30DolbyVision[/home/xts/tools/android-tvts/./tools/../../android-tvts/testcases/res/EDID/shortlist/67DBD3E84099.bin : 7]
ASSUMPTION_FAILURE
org.junit.AssumptionViolatedException: This test is applicable only to devices which run Android U or later.
com.google.android.tvts.hdmi.HdmiEdidHostTest#testAudioEncodingsMatch[/home/xts/tools/android-tvts/./tools/../../android-tvts/testcases/res/EDID/shortlist/67DBD3E84099.bin : 7]
pass
com.google.android.tvts.hdmi.HdmiEdidHostTest#testAudioChannelCountMatch[/home/xts/tools/android-tvts/./tools/../../android-tvts/testcases/res/EDID/shortlist/67DBD3E84099.bin : 7]
pass
com.google.android.tvts.hdmi.HdmiEdidHostTest#testIfCommunicationIssueWithDut[/home/xts/tools/android-tvts/./tools/../../android-tvts/testcases/res/EDID/shortlist/67DBD3E84099.bin : 7]
pass
com.google.android.tvts.hdmi.HdmiEdidHostTest#testDeviceDisplayModesAreInEdid[/home/xts/tools/android-tvts/./tools/../../android-tvts/testcases/res/EDID/shortlist/67DBD3E84099.bin : 7]
pass
com.google.android.tvts.hdmi.HdmiEdidHostTest#testDeviceProductInfo[/home/xts/tools/android-tvts/./tools/../../android-tvts/testcases/res/EDID/shortlist/67DBD3E84099.bin : 7]
pass
com.google.android.tvts.hdmi.HdmiEdidHostTest#testHdmiOutputInEdid[/home/xts/tools/android-tvts/./tools/../../android-tvts/testcases/res/EDID/shortlist/67DBD3E84099.bin : 7]
pass
com.google.android.tvts.hdmi.HdmiEdidHostTest#testDpiMatch[/home/xts/tools/android-tvts/./tools/../../android-tvts/testcases/res/EDID/shortlist/bootTestOrderA_defaultMode3840x2160p60Hz.bin : 8]
fail
java.lang.AssertionError: DPI does not match: device reported DPI: 160.0, 160.0 is expected to match EDID DPI calculated from DTD: 81.28, 80.68235 (screen size = 60.0cm x 34.0cm) or EDID DPI calculated from basic display info: 81.28, 80.68235 (screen size = 60cm x 34cm)
com.google.android.tvts.hdmi.HdmiEdidHostTest#testHdrModesMatch[/home/xts/tools/android-tvts/./tools/../../android-tvts/testcases/res/EDID/shortlist/bootTestOrderA_defaultMode3840x2160p60Hz.bin : 8]
pass
com.google.android.tvts.hdmi.HdmiEdidHostTest#testVideoFailsafeModeSetForInvalidEdid[/home/xts/tools/android-tvts/./tools/../../android-tvts/testcases/res/EDID/shortlist/bootTestOrderA_defaultMode3840x2160p60Hz.bin : 8]
pass
com.google.android.tvts.hdmi.HdmiEdidHostTest#testAudioSamplingRatesMatch[/home/xts/tools/android-tvts/./tools/../../android-tvts/testcases/res/EDID/shortlist/bootTestOrderA_defaultMode3840x2160p60Hz.bin : 8]
pass
com.google.android.tvts.hdmi.HdmiEdidHostTest#testCompareTvDisplayModes[/home/xts/tools/android-tvts/./tools/../../android-tvts/testcases/res/EDID/shortlist/bootTestOrderA_defaultMode3840x2160p60Hz.bin : 8]
pass
com.google.android.tvts.hdmi.HdmiEdidHostTest#test6_1AudioChannelMaskSupport[/home/xts/tools/android-tvts/./tools/../../android-tvts/testcases/res/EDID/shortlist/bootTestOrderA_defaultMode3840x2160p60Hz.bin : 8]
pass
com.google.android.tvts.hdmi.HdmiEdidHostTest#testIfRebootNeeded[/home/xts/tools/android-tvts/./tools/../../android-tvts/testcases/res/EDID/shortlist/bootTestOrderA_defaultMode3840x2160p60Hz.bin : 8]
pass
com.google.android.tvts.hdmi.HdmiEdidHostTest#testBootDisplayMode[/home/xts/tools/android-tvts/./tools/../../android-tvts/testcases/res/EDID/shortlist/bootTestOrderA_defaultMode3840x2160p60Hz.bin : 8]
ASSUMPTION_FAILURE
org.junit.AssumptionViolatedException: This test is applicable only to devices which run Android T or later.
com.google.android.tvts.hdmi.HdmiEdidHostTest#testModeSpecificHdrTypesMatchSupportedHdrTypes[/home/xts/tools/android-tvts/./tools/../../android-tvts/testcases/res/EDID/shortlist/bootTestOrderA_defaultMode3840x2160p60Hz.bin : 8]
ASSUMPTION_FAILURE
org.junit.AssumptionViolatedException: This test is applicable only to devices which run Android U or later.
com.google.android.tvts.hdmi.HdmiEdidHostTest#testNoRepetitionsInDisplayModes[/home/xts/tools/android-tvts/./tools/../../android-tvts/testcases/res/EDID/shortlist/bootTestOrderA_defaultMode3840x2160p60Hz.bin : 8]
pass
com.google.android.tvts.hdmi.HdmiEdidHostTest#testHdmiOutputMatchesMaxRes[/home/xts/tools/android-tvts/./tools/../../android-tvts/testcases/res/EDID/shortlist/bootTestOrderA_defaultMode3840x2160p60Hz.bin : 8]
pass
com.google.android.tvts.hdmi.HdmiEdidHostTest#testIfHotplugEventMissed[/home/xts/tools/android-tvts/./tools/../../android-tvts/testcases/res/EDID/shortlist/bootTestOrderA_defaultMode3840x2160p60Hz.bin : 8]
pass
com.google.android.tvts.hdmi.HdmiEdidHostTest#test4k30DolbyVision[/home/xts/tools/android-tvts/./tools/../../android-tvts/testcases/res/EDID/shortlist/bootTestOrderA_defaultMode3840x2160p60Hz.bin : 8]
ASSUMPTION_FAILURE
org.junit.AssumptionViolatedException: This test is applicable only to devices which run Android U or later.
com.google.android.tvts.hdmi.HdmiEdidHostTest#testAudioEncodingsMatch[/home/xts/tools/android-tvts/./tools/../../android-tvts/testcases/res/EDID/shortlist/bootTestOrderA_defaultMode3840x2160p60Hz.bin : 8]
pass
com.google.android.tvts.hdmi.HdmiEdidHostTest#testAudioChannelCountMatch[/home/xts/tools/android-tvts/./tools/../../android-tvts/testcases/res/EDID/shortlist/bootTestOrderA_defaultMode3840x2160p60Hz.bin : 8]
pass
com.google.android.tvts.hdmi.HdmiEdidHostTest#testIfCommunicationIssueWithDut[/home/xts/tools/android-tvts/./tools/../../android-tvts/testcases/res/EDID/shortlist/bootTestOrderA_defaultMode3840x2160p60Hz.bin : 8]
pass
com.google.android.tvts.hdmi.HdmiEdidHostTest#testDeviceDisplayModesAreInEdid[/home/xts/tools/android-tvts/./tools/../../android-tvts/testcases/res/EDID/shortlist/bootTestOrderA_defaultMode3840x2160p60Hz.bin : 8]
pass
com.google.android.tvts.hdmi.HdmiEdidHostTest#testDeviceProductInfo[/home/xts/tools/android-tvts/./tools/../../android-tvts/testcases/res/EDID/shortlist/bootTestOrderA_defaultMode3840x2160p60Hz.bin : 8]
pass
com.google.android.tvts.hdmi.HdmiEdidHostTest#testHdmiOutputInEdid[/home/xts/tools/android-tvts/./tools/../../android-tvts/testcases/res/EDID/shortlist/bootTestOrderA_defaultMode3840x2160p60Hz.bin : 8]
pass
com.google.android.tvts.hdmi.HdmiEdidHostTest#testDpiMatch[/home/xts/tools/android-tvts/./tools/../../android-tvts/testcases/res/EDID/shortlist/19DF6A5AE0BC.bin : 9]
fail
java.lang.AssertionError: DPI does not match: device reported DPI: 160.0, 160.0 is expected to match EDID DPI calculated from DTD: 68.881355, 68.92462 (screen size = 70.799995cm x 39.8cm) or EDID DPI calculated from basic display info: 69.66857, 70.33846 (screen size = 70cm x 39cm)
com.google.android.tvts.hdmi.HdmiEdidHostTest#testHdrModesMatch[/home/xts/tools/android-tvts/./tools/../../android-tvts/testcases/res/EDID/shortlist/19DF6A5AE0BC.bin : 9]
pass
com.google.android.tvts.hdmi.HdmiEdidHostTest#testVideoFailsafeModeSetForInvalidEdid[/home/xts/tools/android-tvts/./tools/../../android-tvts/testcases/res/EDID/shortlist/19DF6A5AE0BC.bin : 9]
pass
com.google.android.tvts.hdmi.HdmiEdidHostTest#testAudioSamplingRatesMatch[/home/xts/tools/android-tvts/./tools/../../android-tvts/testcases/res/EDID/shortlist/19DF6A5AE0BC.bin : 9]
pass
com.google.android.tvts.hdmi.HdmiEdidHostTest#testCompareTvDisplayModes[/home/xts/tools/android-tvts/./tools/../../android-tvts/testcases/res/EDID/shortlist/19DF6A5AE0BC.bin : 9]
pass
com.google.android.tvts.hdmi.HdmiEdidHostTest#test6_1AudioChannelMaskSupport[/home/xts/tools/android-tvts/./tools/../../android-tvts/testcases/res/EDID/shortlist/19DF6A5AE0BC.bin : 9]
pass
com.google.android.tvts.hdmi.HdmiEdidHostTest#testIfRebootNeeded[/home/xts/tools/android-tvts/./tools/../../android-tvts/testcases/res/EDID/shortlist/19DF6A5AE0BC.bin : 9]
pass
com.google.android.tvts.hdmi.HdmiEdidHostTest#testBootDisplayMode[/home/xts/tools/android-tvts/./tools/../../android-tvts/testcases/res/EDID/shortlist/19DF6A5AE0BC.bin : 9]
ASSUMPTION_FAILURE
org.junit.AssumptionViolatedException: This test is applicable only to devices which run Android T or later.
com.google.android.tvts.hdmi.HdmiEdidHostTest#testModeSpecificHdrTypesMatchSupportedHdrTypes[/home/xts/tools/android-tvts/./tools/../../android-tvts/testcases/res/EDID/shortlist/19DF6A5AE0BC.bin : 9]
ASSUMPTION_FAILURE
org.junit.AssumptionViolatedException: This test is applicable only to devices which run Android U or later.
com.google.android.tvts.hdmi.HdmiEdidHostTest#testNoRepetitionsInDisplayModes[/home/xts/tools/android-tvts/./tools/../../android-tvts/testcases/res/EDID/shortlist/19DF6A5AE0BC.bin : 9]
pass
com.google.android.tvts.hdmi.HdmiEdidHostTest#testHdmiOutputMatchesMaxRes[/home/xts/tools/android-tvts/./tools/../../android-tvts/testcases/res/EDID/shortlist/19DF6A5AE0BC.bin : 9]
pass
com.google.android.tvts.hdmi.HdmiEdidHostTest#testIfHotplugEventMissed[/home/xts/tools/android-tvts/./tools/../../android-tvts/testcases/res/EDID/shortlist/19DF6A5AE0BC.bin : 9]
pass
com.google.android.tvts.hdmi.HdmiEdidHostTest#test4k30DolbyVision[/home/xts/tools/android-tvts/./tools/../../android-tvts/testcases/res/EDID/shortlist/19DF6A5AE0BC.bin : 9]
ASSUMPTION_FAILURE
org.junit.AssumptionViolatedException: This test is applicable only to devices which run Android U or later.
com.google.android.tvts.hdmi.HdmiEdidHostTest#testAudioEncodingsMatch[/home/xts/tools/android-tvts/./tools/../../android-tvts/testcases/res/EDID/shortlist/19DF6A5AE0BC.bin : 9]
pass
com.google.android.tvts.hdmi.HdmiEdidHostTest#testAudioChannelCountMatch[/home/xts/tools/android-tvts/./tools/../../android-tvts/testcases/res/EDID/shortlist/19DF6A5AE0BC.bin : 9]
pass
com.google.android.tvts.hdmi.HdmiEdidHostTest#testIfCommunicationIssueWithDut[/home/xts/tools/android-tvts/./tools/../../android-tvts/testcases/res/EDID/shortlist/19DF6A5AE0BC.bin : 9]
pass
com.google.android.tvts.hdmi.HdmiEdidHostTest#testDeviceDisplayModesAreInEdid[/home/xts/tools/android-tvts/./tools/../../android-tvts/testcases/res/EDID/shortlist/19DF6A5AE0BC.bin : 9]
pass
com.google.android.tvts.hdmi.HdmiEdidHostTest#testDeviceProductInfo[/home/xts/tools/android-tvts/./tools/../../android-tvts/testcases/res/EDID/shortlist/19DF6A5AE0BC.bin : 9]
pass
com.google.android.tvts.hdmi.HdmiEdidHostTest#testHdmiOutputInEdid[/home/xts/tools/android-tvts/./tools/../../android-tvts/testcases/res/EDID/shortlist/19DF6A5AE0BC.bin : 9]
pass
com.google.android.tvts.hdmi.HdmiEdidHostTest#testDpiMatch[/home/xts/tools/android-tvts/./tools/../../android-tvts/testcases/res/EDID/shortlist/AC4B172CF004.bin : 10]
fail
java.lang.AssertionError: DPI does not match: device reported DPI: 160.0, 160.0 is expected to match EDID DPI calculated from DTD: 60.96, 60.959995 (screen size = 80.0cm x 45.0cm) or EDID DPI calculated from basic display info: 51.334732, 50.800003 (screen size = 95cm x 54cm)
com.google.android.tvts.hdmi.HdmiEdidHostTest#testHdrModesMatch[/home/xts/tools/android-tvts/./tools/../../android-tvts/testcases/res/EDID/shortlist/AC4B172CF004.bin : 10]
pass
com.google.android.tvts.hdmi.HdmiEdidHostTest#testVideoFailsafeModeSetForInvalidEdid[/home/xts/tools/android-tvts/./tools/../../android-tvts/testcases/res/EDID/shortlist/AC4B172CF004.bin : 10]
pass
com.google.android.tvts.hdmi.HdmiEdidHostTest#testAudioSamplingRatesMatch[/home/xts/tools/android-tvts/./tools/../../android-tvts/testcases/res/EDID/shortlist/AC4B172CF004.bin : 10]
pass
com.google.android.tvts.hdmi.HdmiEdidHostTest#testCompareTvDisplayModes[/home/xts/tools/android-tvts/./tools/../../android-tvts/testcases/res/EDID/shortlist/AC4B172CF004.bin : 10]
pass
com.google.android.tvts.hdmi.HdmiEdidHostTest#test6_1AudioChannelMaskSupport[/home/xts/tools/android-tvts/./tools/../../android-tvts/testcases/res/EDID/shortlist/AC4B172CF004.bin : 10]
pass
com.google.android.tvts.hdmi.HdmiEdidHostTest#testIfRebootNeeded[/home/xts/tools/android-tvts/./tools/../../android-tvts/testcases/res/EDID/shortlist/AC4B172CF004.bin : 10]
pass
com.google.android.tvts.hdmi.HdmiEdidHostTest#testBootDisplayMode[/home/xts/tools/android-tvts/./tools/../../android-tvts/testcases/res/EDID/shortlist/AC4B172CF004.bin : 10]
ASSUMPTION_FAILURE
org.junit.AssumptionViolatedException: This test is applicable only to devices which run Android T or later.
com.google.android.tvts.hdmi.HdmiEdidHostTest#testModeSpecificHdrTypesMatchSupportedHdrTypes[/home/xts/tools/android-tvts/./tools/../../android-tvts/testcases/res/EDID/shortlist/AC4B172CF004.bin : 10]
ASSUMPTION_FAILURE
org.junit.AssumptionViolatedException: This test is applicable only to devices which run Android U or later.
com.google.android.tvts.hdmi.HdmiEdidHostTest#testNoRepetitionsInDisplayModes[/home/xts/tools/android-tvts/./tools/../../android-tvts/testcases/res/EDID/shortlist/AC4B172CF004.bin : 10]
pass
com.google.android.tvts.hdmi.HdmiEdidHostTest#testHdmiOutputMatchesMaxRes[/home/xts/tools/android-tvts/./tools/../../android-tvts/testcases/res/EDID/shortlist/AC4B172CF004.bin : 10]
pass
com.google.android.tvts.hdmi.HdmiEdidHostTest#testIfHotplugEventMissed[/home/xts/tools/android-tvts/./tools/../../android-tvts/testcases/res/EDID/shortlist/AC4B172CF004.bin : 10]
pass
com.google.android.tvts.hdmi.HdmiEdidHostTest#test4k30DolbyVision[/home/xts/tools/android-tvts/./tools/../../android-tvts/testcases/res/EDID/shortlist/AC4B172CF004.bin : 10]
ASSUMPTION_FAILURE
org.junit.AssumptionViolatedException: This test is applicable only to devices which run Android U or later.
com.google.android.tvts.hdmi.HdmiEdidHostTest#testAudioEncodingsMatch[/home/xts/tools/android-tvts/./tools/../../android-tvts/testcases/res/EDID/shortlist/AC4B172CF004.bin : 10]
pass
com.google.android.tvts.hdmi.HdmiEdidHostTest#testAudioChannelCountMatch[/home/xts/tools/android-tvts/./tools/../../android-tvts/testcases/res/EDID/shortlist/AC4B172CF004.bin : 10]
pass
com.google.android.tvts.hdmi.HdmiEdidHostTest#testIfCommunicationIssueWithDut[/home/xts/tools/android-tvts/./tools/../../android-tvts/testcases/res/EDID/shortlist/AC4B172CF004.bin : 10]
pass
com.google.android.tvts.hdmi.HdmiEdidHostTest#testDeviceDisplayModesAreInEdid[/home/xts/tools/android-tvts/./tools/../../android-tvts/testcases/res/EDID/shortlist/AC4B172CF004.bin : 10]
pass
com.google.android.tvts.hdmi.HdmiEdidHostTest#testDeviceProductInfo[/home/xts/tools/android-tvts/./tools/../../android-tvts/testcases/res/EDID/shortlist/AC4B172CF004.bin : 10]
pass
com.google.android.tvts.hdmi.HdmiEdidHostTest#testHdmiOutputInEdid[/home/xts/tools/android-tvts/./tools/../../android-tvts/testcases/res/EDID/shortlist/AC4B172CF004.bin : 10]
pass
com.google.android.tvts.hdmi.HdmiEdidHostTest#testDpiMatch[/home/xts/tools/android-tvts/./tools/../../android-tvts/testcases/res/EDID/shortlist/4E56E2A27C3A.bin : 11]
fail
java.lang.AssertionError: DPI does not match: device reported DPI: 160.0, 160.0 is expected to match EDID DPI calculated from DTD: 69.868195, 69.80153 (screen size = 69.799995cm x 39.3cm) or EDID DPI calculated from basic display info: 69.66857, 70.33846 (screen size = 70cm x 39cm)
com.google.android.tvts.hdmi.HdmiEdidHostTest#testHdrModesMatch[/home/xts/tools/android-tvts/./tools/../../android-tvts/testcases/res/EDID/shortlist/4E56E2A27C3A.bin : 11]
pass
com.google.android.tvts.hdmi.HdmiEdidHostTest#testVideoFailsafeModeSetForInvalidEdid[/home/xts/tools/android-tvts/./tools/../../android-tvts/testcases/res/EDID/shortlist/4E56E2A27C3A.bin : 11]
pass
com.google.android.tvts.hdmi.HdmiEdidHostTest#testAudioSamplingRatesMatch[/home/xts/tools/android-tvts/./tools/../../android-tvts/testcases/res/EDID/shortlist/4E56E2A27C3A.bin : 11]
pass
com.google.android.tvts.hdmi.HdmiEdidHostTest#testCompareTvDisplayModes[/home/xts/tools/android-tvts/./tools/../../android-tvts/testcases/res/EDID/shortlist/4E56E2A27C3A.bin : 11]
pass
com.google.android.tvts.hdmi.HdmiEdidHostTest#test6_1AudioChannelMaskSupport[/home/xts/tools/android-tvts/./tools/../../android-tvts/testcases/res/EDID/shortlist/4E56E2A27C3A.bin : 11]
pass
com.google.android.tvts.hdmi.HdmiEdidHostTest#testIfRebootNeeded[/home/xts/tools/android-tvts/./tools/../../android-tvts/testcases/res/EDID/shortlist/4E56E2A27C3A.bin : 11]
pass
com.google.android.tvts.hdmi.HdmiEdidHostTest#testBootDisplayMode[/home/xts/tools/android-tvts/./tools/../../android-tvts/testcases/res/EDID/shortlist/4E56E2A27C3A.bin : 11]
ASSUMPTION_FAILURE
org.junit.AssumptionViolatedException: This test is applicable only to devices which run Android T or later.
com.google.android.tvts.hdmi.HdmiEdidHostTest#testModeSpecificHdrTypesMatchSupportedHdrTypes[/home/xts/tools/android-tvts/./tools/../../android-tvts/testcases/res/EDID/shortlist/4E56E2A27C3A.bin : 11]
ASSUMPTION_FAILURE
org.junit.AssumptionViolatedException: This test is applicable only to devices which run Android U or later.
com.google.android.tvts.hdmi.HdmiEdidHostTest#testNoRepetitionsInDisplayModes[/home/xts/tools/android-tvts/./tools/../../android-tvts/testcases/res/EDID/shortlist/4E56E2A27C3A.bin : 11]
pass
com.google.android.tvts.hdmi.HdmiEdidHostTest#testHdmiOutputMatchesMaxRes[/home/xts/tools/android-tvts/./tools/../../android-tvts/testcases/res/EDID/shortlist/4E56E2A27C3A.bin : 11]
pass
com.google.android.tvts.hdmi.HdmiEdidHostTest#testIfHotplugEventMissed[/home/xts/tools/android-tvts/./tools/../../android-tvts/testcases/res/EDID/shortlist/4E56E2A27C3A.bin : 11]
pass
com.google.android.tvts.hdmi.HdmiEdidHostTest#test4k30DolbyVision[/home/xts/tools/android-tvts/./tools/../../android-tvts/testcases/res/EDID/shortlist/4E56E2A27C3A.bin : 11]
ASSUMPTION_FAILURE
org.junit.AssumptionViolatedException: This test is applicable only to devices which run Android U or later.
com.google.android.tvts.hdmi.HdmiEdidHostTest#testAudioEncodingsMatch[/home/xts/tools/android-tvts/./tools/../../android-tvts/testcases/res/EDID/shortlist/4E56E2A27C3A.bin : 11]
pass
com.google.android.tvts.hdmi.HdmiEdidHostTest#testAudioChannelCountMatch[/home/xts/tools/android-tvts/./tools/../../android-tvts/testcases/res/EDID/shortlist/4E56E2A27C3A.bin : 11]
pass
com.google.android.tvts.hdmi.HdmiEdidHostTest#testIfCommunicationIssueWithDut[/home/xts/tools/android-tvts/./tools/../../android-tvts/testcases/res/EDID/shortlist/4E56E2A27C3A.bin : 11]
pass
com.google.android.tvts.hdmi.HdmiEdidHostTest#testDeviceDisplayModesAreInEdid[/home/xts/tools/android-tvts/./tools/../../android-tvts/testcases/res/EDID/shortlist/4E56E2A27C3A.bin : 11]
pass
com.google.android.tvts.hdmi.HdmiEdidHostTest#testDeviceProductInfo[/home/xts/tools/android-tvts/./tools/../../android-tvts/testcases/res/EDID/shortlist/4E56E2A27C3A.bin : 11]
pass
com.google.android.tvts.hdmi.HdmiEdidHostTest#testHdmiOutputInEdid[/home/xts/tools/android-tvts/./tools/../../android-tvts/testcases/res/EDID/shortlist/4E56E2A27C3A.bin : 11]
pass
com.google.android.tvts.hdmi.HdmiEdidHostTest#testDpiMatch[/home/xts/tools/android-tvts/./tools/../../android-tvts/testcases/res/EDID/shortlist/LG16843009.bin : 12]
fail
java.lang.AssertionError: DPI does not match: device reported DPI: 160.0, 160.0 is expected to match EDID DPI calculated from DTD: 30.48, 30.479998 (screen size = 160.0cm x 90.0cm) or EDID DPI calculated from basic display info: 30.48, 30.48 (screen size = 160cm x 90cm)
com.google.android.tvts.hdmi.HdmiEdidHostTest#testHdrModesMatch[/home/xts/tools/android-tvts/./tools/../../android-tvts/testcases/res/EDID/shortlist/LG16843009.bin : 12]
pass
com.google.android.tvts.hdmi.HdmiEdidHostTest#testVideoFailsafeModeSetForInvalidEdid[/home/xts/tools/android-tvts/./tools/../../android-tvts/testcases/res/EDID/shortlist/LG16843009.bin : 12]
pass
com.google.android.tvts.hdmi.HdmiEdidHostTest#testAudioSamplingRatesMatch[/home/xts/tools/android-tvts/./tools/../../android-tvts/testcases/res/EDID/shortlist/LG16843009.bin : 12]
pass
com.google.android.tvts.hdmi.HdmiEdidHostTest#testCompareTvDisplayModes[/home/xts/tools/android-tvts/./tools/../../android-tvts/testcases/res/EDID/shortlist/LG16843009.bin : 12]
pass
com.google.android.tvts.hdmi.HdmiEdidHostTest#test6_1AudioChannelMaskSupport[/home/xts/tools/android-tvts/./tools/../../android-tvts/testcases/res/EDID/shortlist/LG16843009.bin : 12]
pass
com.google.android.tvts.hdmi.HdmiEdidHostTest#testIfRebootNeeded[/home/xts/tools/android-tvts/./tools/../../android-tvts/testcases/res/EDID/shortlist/LG16843009.bin : 12]
pass
com.google.android.tvts.hdmi.HdmiEdidHostTest#testBootDisplayMode[/home/xts/tools/android-tvts/./tools/../../android-tvts/testcases/res/EDID/shortlist/LG16843009.bin : 12]
ASSUMPTION_FAILURE
org.junit.AssumptionViolatedException: This test is applicable only to devices which run Android T or later.
com.google.android.tvts.hdmi.HdmiEdidHostTest#testModeSpecificHdrTypesMatchSupportedHdrTypes[/home/xts/tools/android-tvts/./tools/../../android-tvts/testcases/res/EDID/shortlist/LG16843009.bin : 12]
ASSUMPTION_FAILURE
org.junit.AssumptionViolatedException: This test is applicable only to devices which run Android U or later.
com.google.android.tvts.hdmi.HdmiEdidHostTest#testNoRepetitionsInDisplayModes[/home/xts/tools/android-tvts/./tools/../../android-tvts/testcases/res/EDID/shortlist/LG16843009.bin : 12]
pass
com.google.android.tvts.hdmi.HdmiEdidHostTest#testHdmiOutputMatchesMaxRes[/home/xts/tools/android-tvts/./tools/../../android-tvts/testcases/res/EDID/shortlist/LG16843009.bin : 12]
pass
com.google.android.tvts.hdmi.HdmiEdidHostTest#testIfHotplugEventMissed[/home/xts/tools/android-tvts/./tools/../../android-tvts/testcases/res/EDID/shortlist/LG16843009.bin : 12]
pass
com.google.android.tvts.hdmi.HdmiEdidHostTest#test4k30DolbyVision[/home/xts/tools/android-tvts/./tools/../../android-tvts/testcases/res/EDID/shortlist/LG16843009.bin : 12]
ASSUMPTION_FAILURE
org.junit.AssumptionViolatedException: This test is applicable only to devices which run Android U or later.
com.google.android.tvts.hdmi.HdmiEdidHostTest#testAudioEncodingsMatch[/home/xts/tools/android-tvts/./tools/../../android-tvts/testcases/res/EDID/shortlist/LG16843009.bin : 12]
pass
com.google.android.tvts.hdmi.HdmiEdidHostTest#testAudioChannelCountMatch[/home/xts/tools/android-tvts/./tools/../../android-tvts/testcases/res/EDID/shortlist/LG16843009.bin : 12]
pass
com.google.android.tvts.hdmi.HdmiEdidHostTest#testIfCommunicationIssueWithDut[/home/xts/tools/android-tvts/./tools/../../android-tvts/testcases/res/EDID/shortlist/LG16843009.bin : 12]
pass
com.google.android.tvts.hdmi.HdmiEdidHostTest#testDeviceDisplayModesAreInEdid[/home/xts/tools/android-tvts/./tools/../../android-tvts/testcases/res/EDID/shortlist/LG16843009.bin : 12]
pass
com.google.android.tvts.hdmi.HdmiEdidHostTest#testDeviceProductInfo[/home/xts/tools/android-tvts/./tools/../../android-tvts/testcases/res/EDID/shortlist/LG16843009.bin : 12]
pass
com.google.android.tvts.hdmi.HdmiEdidHostTest#testHdmiOutputInEdid[/home/xts/tools/android-tvts/./tools/../../android-tvts/testcases/res/EDID/shortlist/LG16843009.bin : 12]
pass
com.google.android.tvts.hdmi.HdmiEdidHostTest#testDpiMatch[/home/xts/tools/android-tvts/./tools/../../android-tvts/testcases/res/EDID/shortlist/invalid_byte_flip_edid_1080i_to_1080p.bin : 13]
pass
com.google.android.tvts.hdmi.HdmiEdidHostTest#testHdrModesMatch[/home/xts/tools/android-tvts/./tools/../../android-tvts/testcases/res/EDID/shortlist/invalid_byte_flip_edid_1080i_to_1080p.bin : 13]
pass
com.google.android.tvts.hdmi.HdmiEdidHostTest#testVideoFailsafeModeSetForInvalidEdid[/home/xts/tools/android-tvts/./tools/../../android-tvts/testcases/res/EDID/shortlist/invalid_byte_flip_edid_1080i_to_1080p.bin : 13]
pass
com.google.android.tvts.hdmi.HdmiEdidHostTest#testAudioSamplingRatesMatch[/home/xts/tools/android-tvts/./tools/../../android-tvts/testcases/res/EDID/shortlist/invalid_byte_flip_edid_1080i_to_1080p.bin : 13]
pass
com.google.android.tvts.hdmi.HdmiEdidHostTest#testCompareTvDisplayModes[/home/xts/tools/android-tvts/./tools/../../android-tvts/testcases/res/EDID/shortlist/invalid_byte_flip_edid_1080i_to_1080p.bin : 13]
pass
com.google.android.tvts.hdmi.HdmiEdidHostTest#test6_1AudioChannelMaskSupport[/home/xts/tools/android-tvts/./tools/../../android-tvts/testcases/res/EDID/shortlist/invalid_byte_flip_edid_1080i_to_1080p.bin : 13]
pass
com.google.android.tvts.hdmi.HdmiEdidHostTest#testIfRebootNeeded[/home/xts/tools/android-tvts/./tools/../../android-tvts/testcases/res/EDID/shortlist/invalid_byte_flip_edid_1080i_to_1080p.bin : 13]
pass
com.google.android.tvts.hdmi.HdmiEdidHostTest#testBootDisplayMode[/home/xts/tools/android-tvts/./tools/../../android-tvts/testcases/res/EDID/shortlist/invalid_byte_flip_edid_1080i_to_1080p.bin : 13]
ASSUMPTION_FAILURE
org.junit.AssumptionViolatedException: This test is applicable only to devices which run Android T or later.
com.google.android.tvts.hdmi.HdmiEdidHostTest#testModeSpecificHdrTypesMatchSupportedHdrTypes[/home/xts/tools/android-tvts/./tools/../../android-tvts/testcases/res/EDID/shortlist/invalid_byte_flip_edid_1080i_to_1080p.bin : 13]
ASSUMPTION_FAILURE
org.junit.AssumptionViolatedException: This test is applicable only to devices which run Android U or later.
com.google.android.tvts.hdmi.HdmiEdidHostTest#testNoRepetitionsInDisplayModes[/home/xts/tools/android-tvts/./tools/../../android-tvts/testcases/res/EDID/shortlist/invalid_byte_flip_edid_1080i_to_1080p.bin : 13]
pass
com.google.android.tvts.hdmi.HdmiEdidHostTest#testHdmiOutputMatchesMaxRes[/home/xts/tools/android-tvts/./tools/../../android-tvts/testcases/res/EDID/shortlist/invalid_byte_flip_edid_1080i_to_1080p.bin : 13]
pass
com.google.android.tvts.hdmi.HdmiEdidHostTest#testIfHotplugEventMissed[/home/xts/tools/android-tvts/./tools/../../android-tvts/testcases/res/EDID/shortlist/invalid_byte_flip_edid_1080i_to_1080p.bin : 13]
pass
com.google.android.tvts.hdmi.HdmiEdidHostTest#test4k30DolbyVision[/home/xts/tools/android-tvts/./tools/../../android-tvts/testcases/res/EDID/shortlist/invalid_byte_flip_edid_1080i_to_1080p.bin : 13]
ASSUMPTION_FAILURE
org.junit.AssumptionViolatedException: This test is applicable only to devices which run Android U or later.
com.google.android.tvts.hdmi.HdmiEdidHostTest#testAudioEncodingsMatch[/home/xts/tools/android-tvts/./tools/../../android-tvts/testcases/res/EDID/shortlist/invalid_byte_flip_edid_1080i_to_1080p.bin : 13]
pass
com.google.android.tvts.hdmi.HdmiEdidHostTest#testAudioChannelCountMatch[/home/xts/tools/android-tvts/./tools/../../android-tvts/testcases/res/EDID/shortlist/invalid_byte_flip_edid_1080i_to_1080p.bin : 13]
pass
com.google.android.tvts.hdmi.HdmiEdidHostTest#testIfCommunicationIssueWithDut[/home/xts/tools/android-tvts/./tools/../../android-tvts/testcases/res/EDID/shortlist/invalid_byte_flip_edid_1080i_to_1080p.bin : 13]
pass
com.google.android.tvts.hdmi.HdmiEdidHostTest#testDeviceDisplayModesAreInEdid[/home/xts/tools/android-tvts/./tools/../../android-tvts/testcases/res/EDID/shortlist/invalid_byte_flip_edid_1080i_to_1080p.bin : 13]
pass
com.google.android.tvts.hdmi.HdmiEdidHostTest#testDeviceProductInfo[/home/xts/tools/android-tvts/./tools/../../android-tvts/testcases/res/EDID/shortlist/invalid_byte_flip_edid_1080i_to_1080p.bin : 13]
pass
com.google.android.tvts.hdmi.HdmiEdidHostTest#testHdmiOutputInEdid[/home/xts/tools/android-tvts/./tools/../../android-tvts/testcases/res/EDID/shortlist/invalid_byte_flip_edid_1080i_to_1080p.bin : 13]
pass
com.google.android.tvts.hdmi.HdmiEdidHostTest#testDpiMatch[/home/xts/tools/android-tvts/./tools/../../android-tvts/testcases/res/EDID/shortlist/bootTestOrderB_defaultMode1440x900p60Hz.bin : 14]
fail
java.lang.AssertionError: DPI does not match: device reported DPI: 160.0, 160.0 is expected to match EDID DPI calculated from DTD: 116.3914, 104.70229 (screen size = 41.9cm x 26.199999cm) or EDID DPI calculated from basic display info: 116.11429, 105.50769 (screen size = 42cm x 26cm)
com.google.android.tvts.hdmi.HdmiEdidHostTest#testHdrModesMatch[/home/xts/tools/android-tvts/./tools/../../android-tvts/testcases/res/EDID/shortlist/bootTestOrderB_defaultMode1440x900p60Hz.bin : 14]
pass
com.google.android.tvts.hdmi.HdmiEdidHostTest#testVideoFailsafeModeSetForInvalidEdid[/home/xts/tools/android-tvts/./tools/../../android-tvts/testcases/res/EDID/shortlist/bootTestOrderB_defaultMode1440x900p60Hz.bin : 14]
pass
com.google.android.tvts.hdmi.HdmiEdidHostTest#testAudioSamplingRatesMatch[/home/xts/tools/android-tvts/./tools/../../android-tvts/testcases/res/EDID/shortlist/bootTestOrderB_defaultMode1440x900p60Hz.bin : 14]
pass
com.google.android.tvts.hdmi.HdmiEdidHostTest#testCompareTvDisplayModes[/home/xts/tools/android-tvts/./tools/../../android-tvts/testcases/res/EDID/shortlist/bootTestOrderB_defaultMode1440x900p60Hz.bin : 14]
pass
com.google.android.tvts.hdmi.HdmiEdidHostTest#test6_1AudioChannelMaskSupport[/home/xts/tools/android-tvts/./tools/../../android-tvts/testcases/res/EDID/shortlist/bootTestOrderB_defaultMode1440x900p60Hz.bin : 14]
pass
com.google.android.tvts.hdmi.HdmiEdidHostTest#testIfRebootNeeded[/home/xts/tools/android-tvts/./tools/../../android-tvts/testcases/res/EDID/shortlist/bootTestOrderB_defaultMode1440x900p60Hz.bin : 14]
pass
com.google.android.tvts.hdmi.HdmiEdidHostTest#testBootDisplayMode[/home/xts/tools/android-tvts/./tools/../../android-tvts/testcases/res/EDID/shortlist/bootTestOrderB_defaultMode1440x900p60Hz.bin : 14]
ASSUMPTION_FAILURE
org.junit.AssumptionViolatedException: This test is applicable only to devices which run Android T or later.
com.google.android.tvts.hdmi.HdmiEdidHostTest#testModeSpecificHdrTypesMatchSupportedHdrTypes[/home/xts/tools/android-tvts/./tools/../../android-tvts/testcases/res/EDID/shortlist/bootTestOrderB_defaultMode1440x900p60Hz.bin : 14]
ASSUMPTION_FAILURE
org.junit.AssumptionViolatedException: This test is applicable only to devices which run Android U or later.
com.google.android.tvts.hdmi.HdmiEdidHostTest#testNoRepetitionsInDisplayModes[/home/xts/tools/android-tvts/./tools/../../android-tvts/testcases/res/EDID/shortlist/bootTestOrderB_defaultMode1440x900p60Hz.bin : 14]
pass
com.google.android.tvts.hdmi.HdmiEdidHostTest#testHdmiOutputMatchesMaxRes[/home/xts/tools/android-tvts/./tools/../../android-tvts/testcases/res/EDID/shortlist/bootTestOrderB_defaultMode1440x900p60Hz.bin : 14]
pass
com.google.android.tvts.hdmi.HdmiEdidHostTest#testIfHotplugEventMissed[/home/xts/tools/android-tvts/./tools/../../android-tvts/testcases/res/EDID/shortlist/bootTestOrderB_defaultMode1440x900p60Hz.bin : 14]
pass
com.google.android.tvts.hdmi.HdmiEdidHostTest#test4k30DolbyVision[/home/xts/tools/android-tvts/./tools/../../android-tvts/testcases/res/EDID/shortlist/bootTestOrderB_defaultMode1440x900p60Hz.bin : 14]
ASSUMPTION_FAILURE
org.junit.AssumptionViolatedException: This test is applicable only to devices which run Android U or later.
com.google.android.tvts.hdmi.HdmiEdidHostTest#testAudioEncodingsMatch[/home/xts/tools/android-tvts/./tools/../../android-tvts/testcases/res/EDID/shortlist/bootTestOrderB_defaultMode1440x900p60Hz.bin : 14]
pass
com.google.android.tvts.hdmi.HdmiEdidHostTest#testAudioChannelCountMatch[/home/xts/tools/android-tvts/./tools/../../android-tvts/testcases/res/EDID/shortlist/bootTestOrderB_defaultMode1440x900p60Hz.bin : 14]
pass
com.google.android.tvts.hdmi.HdmiEdidHostTest#testIfCommunicationIssueWithDut[/home/xts/tools/android-tvts/./tools/../../android-tvts/testcases/res/EDID/shortlist/bootTestOrderB_defaultMode1440x900p60Hz.bin : 14]
pass
com.google.android.tvts.hdmi.HdmiEdidHostTest#testDeviceDisplayModesAreInEdid[/home/xts/tools/android-tvts/./tools/../../android-tvts/testcases/res/EDID/shortlist/bootTestOrderB_defaultMode1440x900p60Hz.bin : 14]
pass
com.google.android.tvts.hdmi.HdmiEdidHostTest#testDeviceProductInfo[/home/xts/tools/android-tvts/./tools/../../android-tvts/testcases/res/EDID/shortlist/bootTestOrderB_defaultMode1440x900p60Hz.bin : 14]
pass
com.google.android.tvts.hdmi.HdmiEdidHostTest#testHdmiOutputInEdid[/home/xts/tools/android-tvts/./tools/../../android-tvts/testcases/res/EDID/shortlist/bootTestOrderB_defaultMode1440x900p60Hz.bin : 14]
pass
com.google.android.tvts.hdmi.HdmiEdidHostTest#testDpiMatch[/home/xts/tools/android-tvts/./tools/../../android-tvts/testcases/res/EDID/shortlist/invalid_partial_read_edid.bin : 15]
pass
com.google.android.tvts.hdmi.HdmiEdidHostTest#testHdrModesMatch[/home/xts/tools/android-tvts/./tools/../../android-tvts/testcases/res/EDID/shortlist/invalid_partial_read_edid.bin : 15]
pass
com.google.android.tvts.hdmi.HdmiEdidHostTest#testVideoFailsafeModeSetForInvalidEdid[/home/xts/tools/android-tvts/./tools/../../android-tvts/testcases/res/EDID/shortlist/invalid_partial_read_edid.bin : 15]
pass
com.google.android.tvts.hdmi.HdmiEdidHostTest#testAudioSamplingRatesMatch[/home/xts/tools/android-tvts/./tools/../../android-tvts/testcases/res/EDID/shortlist/invalid_partial_read_edid.bin : 15]
pass
com.google.android.tvts.hdmi.HdmiEdidHostTest#testCompareTvDisplayModes[/home/xts/tools/android-tvts/./tools/../../android-tvts/testcases/res/EDID/shortlist/invalid_partial_read_edid.bin : 15]
pass
com.google.android.tvts.hdmi.HdmiEdidHostTest#test6_1AudioChannelMaskSupport[/home/xts/tools/android-tvts/./tools/../../android-tvts/testcases/res/EDID/shortlist/invalid_partial_read_edid.bin : 15]
pass
com.google.android.tvts.hdmi.HdmiEdidHostTest#testIfRebootNeeded[/home/xts/tools/android-tvts/./tools/../../android-tvts/testcases/res/EDID/shortlist/invalid_partial_read_edid.bin : 15]
pass
com.google.android.tvts.hdmi.HdmiEdidHostTest#testBootDisplayMode[/home/xts/tools/android-tvts/./tools/../../android-tvts/testcases/res/EDID/shortlist/invalid_partial_read_edid.bin : 15]
ASSUMPTION_FAILURE
org.junit.AssumptionViolatedException: This test is applicable only to devices which run Android T or later.
com.google.android.tvts.hdmi.HdmiEdidHostTest#testModeSpecificHdrTypesMatchSupportedHdrTypes[/home/xts/tools/android-tvts/./tools/../../android-tvts/testcases/res/EDID/shortlist/invalid_partial_read_edid.bin : 15]
ASSUMPTION_FAILURE
org.junit.AssumptionViolatedException: This test is applicable only to devices which run Android U or later.
com.google.android.tvts.hdmi.HdmiEdidHostTest#testNoRepetitionsInDisplayModes[/home/xts/tools/android-tvts/./tools/../../android-tvts/testcases/res/EDID/shortlist/invalid_partial_read_edid.bin : 15]
pass
com.google.android.tvts.hdmi.HdmiEdidHostTest#testHdmiOutputMatchesMaxRes[/home/xts/tools/android-tvts/./tools/../../android-tvts/testcases/res/EDID/shortlist/invalid_partial_read_edid.bin : 15]
pass
com.google.android.tvts.hdmi.HdmiEdidHostTest#testIfHotplugEventMissed[/home/xts/tools/android-tvts/./tools/../../android-tvts/testcases/res/EDID/shortlist/invalid_partial_read_edid.bin : 15]
pass
com.google.android.tvts.hdmi.HdmiEdidHostTest#test4k30DolbyVision[/home/xts/tools/android-tvts/./tools/../../android-tvts/testcases/res/EDID/shortlist/invalid_partial_read_edid.bin : 15]
ASSUMPTION_FAILURE
org.junit.AssumptionViolatedException: This test is applicable only to devices which run Android U or later.
com.google.android.tvts.hdmi.HdmiEdidHostTest#testAudioEncodingsMatch[/home/xts/tools/android-tvts/./tools/../../android-tvts/testcases/res/EDID/shortlist/invalid_partial_read_edid.bin : 15]
pass
com.google.android.tvts.hdmi.HdmiEdidHostTest#testAudioChannelCountMatch[/home/xts/tools/android-tvts/./tools/../../android-tvts/testcases/res/EDID/shortlist/invalid_partial_read_edid.bin : 15]
pass
com.google.android.tvts.hdmi.HdmiEdidHostTest#testIfCommunicationIssueWithDut[/home/xts/tools/android-tvts/./tools/../../android-tvts/testcases/res/EDID/shortlist/invalid_partial_read_edid.bin : 15]
pass
com.google.android.tvts.hdmi.HdmiEdidHostTest#testDeviceDisplayModesAreInEdid[/home/xts/tools/android-tvts/./tools/../../android-tvts/testcases/res/EDID/shortlist/invalid_partial_read_edid.bin : 15]
pass
com.google.android.tvts.hdmi.HdmiEdidHostTest#testDeviceProductInfo[/home/xts/tools/android-tvts/./tools/../../android-tvts/testcases/res/EDID/shortlist/invalid_partial_read_edid.bin : 15]
pass
com.google.android.tvts.hdmi.HdmiEdidHostTest#testHdmiOutputInEdid[/home/xts/tools/android-tvts/./tools/../../android-tvts/testcases/res/EDID/shortlist/invalid_partial_read_edid.bin : 15]
pass