![]() |
| Summary | |
|---|---|
| Suite / Plan | CTS / cts |
| Suite / Build | 12_r7 / 9566628 |
| Host Info | Result/@start xts-deskmini (Linux - 5.15.0-69-generic) |
| Start time / End Time | Thu Apr 13 17:12:00 CST 2023 / Thu Apr 13 17:13:55 CST 2023 |
| Tests Passed | 8 |
| Tests Failed | 2 |
| Modules Done | 2 |
| Modules Total | 2 |
| Fingerprint | SKB/BFX_AT100/BFX-AT100:12/STTC.220724.001/15.537.37-20230413:userdebug/release-keys |
| Security Patch | 2023-03-01 |
| Release (SDK) | 12 (31) |
| ABIs | armeabi-v7a,armeabi |
| Module | Passed | Failed | Assumption Failure | Ignored | Total Tests | Done | Reason |
|---|---|---|---|---|---|---|---|
| armeabi-v7a CtsGraphicsTestCases | 4 | 1 | 0 | 0 | 5 | true | |
| armeabi-v7a CtsGraphicsTestCases[instant] | 4 | 1 | 0 | 0 | 5 | true |
| armeabi-v7a CtsGraphicsTestCases | ||
| Test | Result | Details |
|---|---|---|
| android.graphics.cts.SetFrameRateTest#testExactFrameRateMatch_NonSeamless |
fail
|
java.lang.AssertionError: Timed out waiting for a stable and compatible frame rate. expected=60.00 received=60.00. Stack trace: android.graphics.cts.FrameRateCtsActivity$FrameRateTimeoutException
at android.graphics.cts.FrameRateCtsActivity.verifyCompatibleAndStableFrameRate(FrameRateCtsActivity.java:562)
at android.graphics.cts.FrameRateCtsActivity.lambda$testExactFrameRateMatch$1$FrameRateCtsActivity(FrameRateCtsActivity.java:730)
at android.graphics.cts.FrameRateCtsActivity$$ExternalSyntheticLambda3.run(Unknown Source:4)
at android.graphics.cts.FrameRateCtsActivity.runOneSurfaceTest(FrameRateCtsActivity.java:867)
at android.graphics.cts.FrameRateCtsActivity.testExactFrameRateMatch(FrameRateCtsActivity.java:689)
at android.graphics.cts.FrameRateCtsActivity.lambda$testExactFrameRateMatch$0$FrameRateCtsActivity(FrameRateCtsActivity.java:683)
at android.graphics.cts.FrameRateCtsActivity$$ExternalSyntheticLambda8.run(Unknown Source:4)
at android.graphics.cts.FrameRateCtsActivity.runTestsWithPreconditions(FrameRateCtsActivity.java:630)
at android.graphics.cts.FrameRateCtsActivity.testExactFrameRateMatch(FrameRateCtsActivity.java:683)
at android.graphics.cts.SetFrameRateTest.testExactFrameRateMatch_NonSeamless(SetFrameRateTest.java:94)
at java.lang.reflect.Method.invoke(Native Method)
at org.junit.runners.model.FrameworkMethod$1.runReflectiveCall(FrameworkMethod.java:59)
at org.junit.internal.runners.model.ReflectiveCallable.run(ReflectiveCallable.java:12)
at org.junit.runners.model.FrameworkMethod.invokeExplosively(FrameworkMethod.java:61)
at org.junit.internal.runners.statements.InvokeMethod.evaluate(InvokeMethod.java:17)
at org.junit.internal.runners.statements.FailOnTimeout$CallableStatement.call(FailOnTimeout.java:148)
at org.junit.internal.runners.statements.FailOnTimeout$CallableStatement.call(FailOnTimeout.java:142)
at java.util.concurrent.FutureTask.run(FutureTask.java:266)
at java.lang.Thread.run(Thread.java:920)
at org.junit.Assert.fail(Assert.java:89)
at org.junit.Assert.assertTrue(Assert.java:42)
at android.graphics.cts.FrameRateCtsActivity.runTestsWithPreconditions(FrameRateCtsActivity.java:645)
at android.graphics.cts.FrameRateCtsActivity.testExactFrameRateMatch(FrameRateCtsActivity.java:683)
at android.graphics.cts.SetFrameRateTest.testExactFrameRateMatch_NonSeamless(SetFrameRateTest.java:94)
|
| armeabi-v7a CtsGraphicsTestCases[instant] | ||
| Test | Result | Details |
|---|---|---|
| android.graphics.cts.SetFrameRateTest#testExactFrameRateMatch_NonSeamless |
fail
|
java.lang.AssertionError: Timed out waiting for a stable and compatible frame rate. expected=60.00 received=60.00. Stack trace: android.graphics.cts.FrameRateCtsActivity$FrameRateTimeoutException
at android.graphics.cts.FrameRateCtsActivity.verifyCompatibleAndStableFrameRate(FrameRateCtsActivity.java:562)
at android.graphics.cts.FrameRateCtsActivity.lambda$testExactFrameRateMatch$1$FrameRateCtsActivity(FrameRateCtsActivity.java:730)
at android.graphics.cts.FrameRateCtsActivity$$ExternalSyntheticLambda3.run(Unknown Source:4)
at android.graphics.cts.FrameRateCtsActivity.runOneSurfaceTest(FrameRateCtsActivity.java:867)
at android.graphics.cts.FrameRateCtsActivity.testExactFrameRateMatch(FrameRateCtsActivity.java:689)
at android.graphics.cts.FrameRateCtsActivity.lambda$testExactFrameRateMatch$0$FrameRateCtsActivity(FrameRateCtsActivity.java:683)
at android.graphics.cts.FrameRateCtsActivity$$ExternalSyntheticLambda8.run(Unknown Source:4)
at android.graphics.cts.FrameRateCtsActivity.runTestsWithPreconditions(FrameRateCtsActivity.java:630)
at android.graphics.cts.FrameRateCtsActivity.testExactFrameRateMatch(FrameRateCtsActivity.java:683)
at android.graphics.cts.SetFrameRateTest.testExactFrameRateMatch_NonSeamless(SetFrameRateTest.java:94)
at java.lang.reflect.Method.invoke(Native Method)
at org.junit.runners.model.FrameworkMethod$1.runReflectiveCall(FrameworkMethod.java:59)
at org.junit.internal.runners.model.ReflectiveCallable.run(ReflectiveCallable.java:12)
at org.junit.runners.model.FrameworkMethod.invokeExplosively(FrameworkMethod.java:61)
at org.junit.internal.runners.statements.InvokeMethod.evaluate(InvokeMethod.java:17)
at org.junit.internal.runners.statements.FailOnTimeout$CallableStatement.call(FailOnTimeout.java:148)
at org.junit.internal.runners.statements.FailOnTimeout$CallableStatement.call(FailOnTimeout.java:142)
at java.util.concurrent.FutureTask.run(FutureTask.java:266)
at java.lang.Thread.run(Thread.java:920)
at org.junit.Assert.fail(Assert.java:89)
at org.junit.Assert.assertTrue(Assert.java:42)
at android.graphics.cts.FrameRateCtsActivity.runTestsWithPreconditions(FrameRateCtsActivity.java:645)
at android.graphics.cts.FrameRateCtsActivity.testExactFrameRateMatch(FrameRateCtsActivity.java:683)
at android.graphics.cts.SetFrameRateTest.testExactFrameRateMatch_NonSeamless(SetFrameRateTest.java:94)
|
| armeabi-v7a CtsGraphicsTestCases | ||
| Test | Result | Details |
|---|---|---|
| android.graphics.cts.SetFrameRateTest#testExactFrameRateMatch_Seamless |
pass
| |
| android.graphics.cts.SetFrameRateTest#testFixedSource_NonSeamless |
pass
| |
| android.graphics.cts.SetFrameRateTest#testFixedSource_Seamless |
pass
| |
| android.graphics.cts.SetFrameRateTest#testInvalidParams |
pass
| |
| android.graphics.cts.SetFrameRateTest#testExactFrameRateMatch_NonSeamless |
fail
|
java.lang.AssertionError: Timed out waiting for a stable and compatible frame rate. expected=60.00 received=60.00. Stack trace: android.graphics.cts.FrameRateCtsActivity$FrameRateTimeoutException
|
| armeabi-v7a CtsGraphicsTestCases[instant] | ||
| Test | Result | Details |
|---|---|---|
| android.graphics.cts.SetFrameRateTest#testExactFrameRateMatch_Seamless |
pass
| |
| android.graphics.cts.SetFrameRateTest#testFixedSource_NonSeamless |
pass
| |
| android.graphics.cts.SetFrameRateTest#testFixedSource_Seamless |
pass
| |
| android.graphics.cts.SetFrameRateTest#testInvalidParams |
pass
| |
| android.graphics.cts.SetFrameRateTest#testExactFrameRateMatch_NonSeamless |
fail
|
java.lang.AssertionError: Timed out waiting for a stable and compatible frame rate. expected=60.00 received=60.00. Stack trace: android.graphics.cts.FrameRateCtsActivity$FrameRateTimeoutException
|