![]() |
| Summary | |
|---|---|
| Suite / Plan | VTS / cts-on-gsi |
| Suite / Build | 12_r7 / 9566628 |
| Host Info | Result/@start googlecerti (Linux - 5.4.0-131-generic) |
| Start time / End Time | Thu Apr 20 11:35:12 KST 2023 / Thu Apr 20 11:58:43 KST 2023 |
| Tests Passed | 166776 |
| Tests Failed | 328 |
| Modules Done | 296 |
| Modules Total | 297 |
| Fingerprint | SKB/INTEKS20SI/INTEKS20SI:12/STTC.220724.001/eng.intek.20230414.125302:user/release-keys |
| Security Patch | 2023-03-01 |
| Release (SDK) | 12 (31) |
| ABIs | armeabi-v7a,armeabi |
| Module | Passed | Failed | Assumption Failure | Ignored | Total Tests | Done |
|---|---|---|---|---|---|---|
| armeabi-v7a CtsAccelerationTestCases | 6 | 0 | 0 | 0 | 6 | true |
| armeabi-v7a CtsActivityRecognitionTestCases | 1 | 0 | 0 | 0 | 1 | true |
| armeabi-v7a CtsAdbManagerHostTestCases | 2 | 0 | 0 | 0 | 2 | true |
| armeabi-v7a CtsAlarmManagerTestCases | 40 | 0 | 0 | 3 | 43 | true |
| armeabi-v7a CtsAngleIntegrationHostTestCases | 0 | 0 | 11 | 0 | 11 | true |
| armeabi-v7a CtsAnimationTestCases | 146 | 0 | 0 | 0 | 146 | true |
| armeabi-v7a CtsApacheHttpTestCases | 32 | 0 | 0 | 0 | 32 | true |
| armeabi-v7a CtsApexSharedLibrariesTestCases | 0 | 0 | 0 | 1 | 1 | true |
| armeabi-v7a CtsAppCloningHostTest | 2 | 0 | 0 | 0 | 2 | true |
| armeabi-v7a CtsAppOps2TestCases | 1 | 0 | 0 | 0 | 1 | true |
| armeabi-v7a CtsAppSearchHostTestCases | 3 | 0 | 4 | 0 | 7 | true |
| armeabi-v7a CtsAppSearchTestCases | 186 | 0 | 0 | 0 | 186 | true |
| armeabi-v7a CtsAppSecurityHostTestCases | 424 | 0 | 60 | 2 | 486 | true |
| armeabi-v7a CtsAppTestCases | 889 | 0 | 17 | 6 | 912 | true |
| armeabi-v7a CtsAutoFillServiceTestCases | 746 | 0 | 62 | 4 | 812 | true |
| armeabi-v7a CtsBatterySavingTestCases | 5 | 0 | 13 | 0 | 18 | true |
| armeabi-v7a CtsBiometricsTestCases | 0 | 0 | 36 | 0 | 36 | true |
| armeabi-v7a CtsBionicTestCases | 3092 | 0 | 0 | 29 | 3121 | true |
| armeabi-v7a CtsBluetoothTestCases | 62 | 0 | 0 | 0 | 62 | true |
| armeabi-v7a CtsBugreportTestCases | 7 | 0 | 0 | 0 | 7 | true |
| armeabi-v7a CtsCallLogTestCases | 0 | 0 | 0 | 1 | 1 | true |
| armeabi-v7a CtsCameraApi25TestCases | 1 | 0 | 0 | 0 | 1 | true |
| armeabi-v7a CtsCameraApi31TestCases | 1 | 0 | 0 | 0 | 1 | true |
| armeabi-v7a CtsCameraTestCases | 587 | 0 | 0 | 0 | 587 | true |
| armeabi-v7a CtsCarHostTestCases | 1 | 0 | 18 | 0 | 19 | true |
| armeabi-v7a CtsCarrierApiTestCases | 0 | 0 | 60 | 0 | 60 | true |
| armeabi-v7a CtsClasspathsTestCases | 4 | 0 | 0 | 0 | 4 | true |
| armeabi-v7a CtsColorModeTestCases | 3 | 0 | 0 | 0 | 3 | true |
| armeabi-v7a CtsDeqpTestCases | 3735 | 0 | 0 | 0 | 3735 | true |
| armeabi-v7a CtsDeviceConfigTestCases | 61 | 0 | 0 | 0 | 61 | true |
| armeabi-v7a CtsDeviceIdleHostTestCases | 2 | 0 | 0 | 0 | 2 | true |
| armeabi-v7a CtsDevicePolicyTestCases | 39 | 0 | 102 | 5 | 146 | true |
| armeabi-v7a CtsDeviceStateManagerTestCases | 7 | 0 | 0 | 0 | 7 | true |
| armeabi-v7a CtsDisplayTestCases | 31 | 0 | 6 | 0 | 37 | true |
| armeabi-v7a CtsDomainVerificationDeviceMultiUserTestCases | 0 | 0 | 8 | 0 | 8 | true |
| armeabi-v7a CtsDomainVerificationDeviceStandaloneTestCases | 32 | 0 | 0 | 0 | 32 | true |
| armeabi-v7a CtsDomainVerificationHostTestCases | 3 | 0 | 0 | 0 | 3 | true |
| armeabi-v7a CtsDownloadManagerApi28 | 6 | 0 | 0 | 0 | 6 | true |
| armeabi-v7a CtsDownloadManagerInstaller | 1 | 0 | 0 | 0 | 1 | true |
| armeabi-v7a CtsDpiTestCases | 7 | 0 | 0 | 0 | 7 | true |
| armeabi-v7a CtsDpiTestCases2 | 6 | 0 | 0 | 0 | 6 | true |
| armeabi-v7a CtsDreamsTestCases | 3 | 0 | 0 | 0 | 3 | true |
| armeabi-v7a CtsDrmTestCases | 43 | 0 | 0 | 0 | 43 | true |
| armeabi-v7a CtsDropBoxManagerTestCases | 5 | 0 | 0 | 0 | 5 | true |
| armeabi-v7a CtsDumpsysHostTestCases | 4 | 0 | 0 | 0 | 4 | true |
| armeabi-v7a CtsDynamicLinkerTestCases | 3 | 0 | 0 | 0 | 3 | true |
| armeabi-v7a CtsDynamicMimeHostTestCases | 44 | 0 | 0 | 0 | 44 | true |
| armeabi-v7a CtsEdiHostTestCases | 5 | 0 | 0 | 0 | 5 | true |
| armeabi-v7a CtsEffectTestCases | 6 | 0 | 0 | 0 | 6 | true |
| armeabi-v7a CtsExternalServiceTestCases | 11 | 0 | 0 | 0 | 11 | true |
| armeabi-v7a CtsExtractNativeLibsHostTestCases | 2 | 0 | 87 | 0 | 89 | true |
| armeabi-v7a CtsFileSystemTestCases | 5 | 0 | 0 | 0 | 5 | true |
| armeabi-v7a CtsFragmentTestCases | 155 | 0 | 0 | 0 | 155 | true |
| armeabi-v7a CtsFragmentTestCasesSdk26 | 1 | 0 | 0 | 0 | 1 | true |
| armeabi-v7a CtsFrameRateOverrideTestCases | 8 | 0 | 0 | 0 | 8 | true |
| armeabi-v7a CtsFsMgrTestCases | 34 | 0 | 0 | 1 | 35 | true |
| armeabi-v7a CtsGameManagerTestCases | 4 | 0 | 0 | 0 | 4 | true |
| armeabi-v7a CtsGestureTestCases | 29 | 0 | 0 | 0 | 29 | true |
| armeabi-v7a CtsGpuProfilingDataTestCases | 1 | 0 | 1 | 0 | 2 | true |
| armeabi-v7a CtsGpuToolsHostTestCases | 22 | 0 | 0 | 0 | 22 | true |
| armeabi-v7a CtsGraphicsTestCases | 3708 | 0 | 2 | 4 | 3714 | true |
| armeabi-v7a CtsGwpAsanTestCases | 7 | 0 | 0 | 0 | 7 | true |
| armeabi-v7a CtsHardwareTestCases | 86 | 0 | 19 | 0 | 105 | true |
| armeabi-v7a CtsHarmfulAppWarningHostTestCases | 1 | 0 | 0 | 0 | 1 | true |
| armeabi-v7a CtsHdmiCecHostTestCases | 42 | 0 | 18 | 12 | 72 | true |
| armeabi-v7a CtsHiddenApiBlocklistApi27TestCases | 4 | 0 | 0 | 0 | 4 | true |
| armeabi-v7a CtsHiddenApiBlocklistApi28TestCases | 4 | 0 | 0 | 0 | 4 | true |
| armeabi-v7a CtsHiddenApiBlocklistCurrentApiTestCases | 4 | 0 | 0 | 0 | 4 | true |
| armeabi-v7a CtsHiddenApiBlocklistDebugClassTestCases | 4 | 0 | 0 | 0 | 4 | true |
| armeabi-v7a CtsHiddenApiBlocklistTestApiTestCases | 4 | 0 | 0 | 0 | 4 | true |
| armeabi-v7a CtsHiddenApiKillswitchSdkListTestCases | 4 | 0 | 0 | 0 | 4 | true |
| armeabi-v7a CtsHostTzDataTests | 24 | 0 | 0 | 0 | 24 | true |
| armeabi-v7a CtsHostsideHiddenapiTests | 1 | 0 | 0 | 0 | 1 | true |
| armeabi-v7a CtsHostsideNetworkTests | 75 | 0 | 0 | 0 | 75 | true |
| armeabi-v7a CtsHostsideNumberBlockingTestCases | 1 | 0 | 0 | 0 | 1 | true |
| armeabi-v7a CtsHostsideTvTests | 4 | 0 | 0 | 0 | 4 | true |
| armeabi-v7a CtsHostsideWebViewTests | 7 | 0 | 2 | 0 | 9 | true |
| armeabi-v7a CtsIcu4cTestCases | 2899 | 0 | 0 | 0 | 2899 | true |
| armeabi-v7a CtsIcuTestCases | 7708 | 0 | 5 | 26 | 7739 | true |
| armeabi-v7a CtsIdentityTestCases | 47 | 0 | 21 | 0 | 68 | true |
| armeabi-v7a CtsIkeTestCases | 79 | 0 | 3 | 0 | 82 | true |
| armeabi-v7a CtsIncidentHostTestCases | 27 | 0 | 0 | 0 | 27 | true |
| armeabi-v7a CtsIncrementalInstallHostTestCases | 0 | 0 | 14 | 0 | 14 | true |
| armeabi-v7a CtsInitTestCases | 99 | 0 | 0 | 11 | 110 | true |
| armeabi-v7a CtsInlineMockingTestCases | 66 | 0 | 0 | 1 | 67 | true |
| armeabi-v7a CtsInputMethodServiceHostTestCases | 17 | 0 | 2 | 0 | 19 | true |
| armeabi-v7a CtsInputMethodTestCases | 178 | 0 | 5 | 0 | 183 | true |
| armeabi-v7a CtsInputTestCases | 4 | 0 | 0 | 0 | 4 | true |
| armeabi-v7a CtsInstallHostTestCases | 40 | 0 | 80 | 0 | 120 | true |
| armeabi-v7a CtsInstalledLoadingProgressHostTests | 1 | 0 | 5 | 0 | 6 | true |
| armeabi-v7a CtsInstantAppTests | 22 | 0 | 0 | 0 | 22 | true |
| armeabi-v7a CtsIntentSignatureTestCases | 1 | 0 | 0 | 0 | 1 | true |
| armeabi-v7a CtsJdwpSecurityHostTestCases | 1 | 0 | 0 | 0 | 1 | true |
| armeabi-v7a CtsJobSchedulerSharedUidTestCases | 14 | 0 | 0 | 0 | 14 | true |
| armeabi-v7a CtsJobSchedulerTestCases | 98 | 0 | 19 | 0 | 117 | true |
| armeabi-v7a CtsKernelConfigTestCases | 5 | 0 | 0 | 0 | 5 | true |
| armeabi-v7a CtsKeystoreTestCases | 1100 | 0 | 4 | 0 | 1104 | true |
| armeabi-v7a CtsLeanbackJankTestCases | 1 | 0 | 0 | 0 | 1 | true |
| armeabi-v7a CtsLegacyNotification30TestCases | 16 | 0 | 0 | 0 | 16 | true |
| armeabi-v7a CtsLibcoreApiEvolutionTestCases | 11 | 0 | 0 | 0 | 11 | true |
| armeabi-v7a CtsLibcoreFileIOTestCases | 18 | 0 | 0 | 0 | 18 | true |
| armeabi-v7a CtsLibcoreJsr166TestCases | 3373 | 0 | 0 | 0 | 3373 | true |
| armeabi-v7a CtsLibcoreLegacy22TestCases | 5 | 0 | 0 | 0 | 5 | true |
| armeabi-v7a CtsLibcoreOjTestCases | 7300 | 0 | 0 | 0 | 7300 | true |
| armeabi-v7a CtsLibcoreOkHttpTestCases | 1990 | 0 | 0 | 17 | 2007 | true |
| armeabi-v7a CtsLibcoreTestCases | 29339 | 0 | 29 | 11 | 29379 | true |
| armeabi-v7a CtsLibcoreWycheproofBCTestCases | 35 | 0 | 0 | 0 | 35 | true |
| armeabi-v7a CtsLibcoreWycheproofConscryptTestCases | 41 | 0 | 0 | 0 | 41 | true |
| armeabi-v7a CtsLiblogTestCases | 66 | 0 | 0 | 0 | 66 | true |
| armeabi-v7a CtsLibnativehelperTestCases | 4 | 0 | 0 | 0 | 4 | true |
| armeabi-v7a CtsLocationCoarseTestCases | 11 | 0 | 0 | 0 | 11 | true |
| armeabi-v7a CtsLocationFineTestCases | 78 | 0 | 9 | 1 | 88 | true |
| armeabi-v7a CtsLocationGnssTestCases | 23 | 0 | 1 | 0 | 24 | true |
| armeabi-v7a CtsLocationPrivilegedTestCases | 23 | 0 | 0 | 0 | 23 | true |
| armeabi-v7a CtsLocationTimeZoneManagerHostTest | 1 | 0 | 2 | 0 | 3 | true |
| armeabi-v7a CtsLogdTestCases | 55 | 0 | 0 | 1 | 56 | true |
| armeabi-v7a CtsMatchFlagTestCases | 5 | 0 | 0 | 0 | 5 | true |
| armeabi-v7a CtsMediaBitstreamsTestCases | 4541 | 0 | 0 | 0 | 4541 | true |
| armeabi-v7a CtsMediaHostTestCases | 33 | 0 | 0 | 0 | 33 | true |
| armeabi-v7a CtsMediaParserHostTestCases | 10 | 0 | 0 | 0 | 10 | true |
| armeabi-v7a CtsMediaParserTestCases | 68 | 0 | 0 | 1 | 69 | true |
| armeabi-v7a CtsMediaPerformanceClassTestCases | 1 | 0 | 40 | 0 | 41 | true |
| armeabi-v7a CtsMediaProviderTranscodeTests | 0 | 0 | 35 | 3 | 38 | true |
| armeabi-v7a CtsMediaStressTestCases | 120 | 0 | 0 | 0 | 120 | true |
| armeabi-v7a CtsMediaTestCases | 2009 | 322 | 4 | 0 | 2335 | false |
| armeabi-v7a CtsMediaTranscodingTestCases | 41 | 0 | 0 | 0 | 41 | true |
| armeabi-v7a CtsMediaV2TestCases | 1635 | 0 | 111 | 224 | 1970 | true |
| armeabi-v7a CtsMidiTestCases | 9 | 0 | 0 | 0 | 9 | true |
| armeabi-v7a CtsMimeMapTestCases | 26 | 0 | 0 | 0 | 26 | true |
| armeabi-v7a CtsMockingDebuggableTestCases | 29 | 0 | 0 | 1 | 30 | true |
| armeabi-v7a CtsMockingTestCases | 28 | 0 | 1 | 1 | 30 | true |
| armeabi-v7a CtsMonkeyTestCases | 10 | 0 | 0 | 0 | 10 | true |
| armeabi-v7a CtsMultiUserHostTestCases | 1 | 0 | 13 | 0 | 14 | true |
| armeabi-v7a CtsMultiUserTestCases | 5 | 0 | 0 | 0 | 5 | true |
| armeabi-v7a CtsMusicRecognitionTestCases | 0 | 0 | 6 | 0 | 6 | true |
| armeabi-v7a CtsNNAPIBenchmarkTestCases | 14 | 0 | 0 | 0 | 14 | true |
| armeabi-v7a CtsNNAPIJavaTestCases | 1 | 0 | 0 | 0 | 1 | true |
| armeabi-v7a CtsNNAPITestCases | 65059 | 0 | 0 | 0 | 65059 | true |
| armeabi-v7a CtsNativeEncryptionTestCases | 1 | 0 | 0 | 0 | 1 | true |
| armeabi-v7a CtsNativeHardwareTestCases | 329 | 0 | 0 | 0 | 329 | true |
| armeabi-v7a CtsNativeMediaAAudioTestCases | 159 | 0 | 0 | 0 | 159 | true |
| armeabi-v7a CtsNativeMediaMetricsTestCases | 10 | 0 | 0 | 0 | 10 | true |
| armeabi-v7a CtsNativeMediaSlTestCases | 10 | 0 | 0 | 0 | 10 | true |
| armeabi-v7a CtsNativeMediaXaTestCases | 2 | 0 | 0 | 0 | 2 | true |
| armeabi-v7a CtsNativeMidiTestCases | 10 | 0 | 0 | 0 | 10 | true |
| armeabi-v7a CtsNativeNetDnsTestCases | 6 | 0 | 0 | 0 | 6 | true |
| armeabi-v7a CtsNativeNetTestCases | 4 | 0 | 0 | 0 | 4 | true |
| armeabi-v7a CtsNativeVerifiedBootTestCases | 1 | 0 | 0 | 0 | 1 | true |
| armeabi-v7a CtsNdefTestCases | 11 | 0 | 0 | 0 | 11 | true |
| armeabi-v7a CtsNdkBinderTestCases | 541 | 0 | 0 | 0 | 541 | true |
| armeabi-v7a CtsNetApi23TestCases | 3 | 0 | 0 | 0 | 3 | true |
| armeabi-v7a CtsNetSecConfigAttributeTestCases | 1 | 0 | 0 | 0 | 1 | true |
| armeabi-v7a CtsNetSecConfigBasicDebugDisabledTestCases | 1 | 0 | 0 | 0 | 1 | true |
| armeabi-v7a CtsNetSecConfigBasicDebugEnabledTestCases | 1 | 0 | 0 | 0 | 1 | true |
| armeabi-v7a CtsNetSecConfigBasicDomainConfigTestCases | 3 | 0 | 0 | 0 | 3 | true |
| armeabi-v7a CtsNetSecConfigCleartextTrafficTestCases | 3 | 0 | 0 | 0 | 3 | true |
| armeabi-v7a CtsNetSecConfigDownloadManagerTestCases | 3 | 0 | 0 | 0 | 3 | true |
| armeabi-v7a CtsNetSecConfigInvalidPinTestCases | 2 | 0 | 0 | 0 | 2 | true |
| armeabi-v7a CtsNetSecConfigNestedDomainConfigTestCases | 2 | 0 | 0 | 0 | 2 | true |
| armeabi-v7a CtsNetSecConfigPrePCleartextTrafficTestCases | 3 | 0 | 0 | 0 | 3 | true |
| armeabi-v7a CtsNetSecConfigResourcesSrcTestCases | 5 | 0 | 0 | 0 | 5 | true |
| armeabi-v7a CtsNetSecPolicyUsesCleartextTrafficFalseTestCases | 6 | 0 | 0 | 0 | 6 | true |
| armeabi-v7a CtsNetSecPolicyUsesCleartextTrafficTrueTestCases | 6 | 0 | 0 | 0 | 6 | true |
| armeabi-v7a CtsNetSecPolicyUsesCleartextTrafficUnspecifiedTestCases | 6 | 0 | 0 | 0 | 6 | true |
| armeabi-v7a CtsNetTestCases | 620 | 0 | 35 | 1 | 656 | true |
| armeabi-v7a CtsNetTestCasesLegacyApi22 | 2 | 0 | 0 | 0 | 2 | true |
| armeabi-v7a CtsNetTestCasesLegacyPermission22 | 3 | 0 | 0 | 0 | 3 | true |
| armeabi-v7a CtsNetTestCasesUpdateStatsPermission | 2 | 0 | 0 | 0 | 2 | true |
| armeabi-v7a CtsNfcTestCases | 0 | 0 | 5 | 0 | 5 | true |
| armeabi-v7a CtsOpenGLTestCases | 60 | 0 | 0 | 1 | 61 | true |
| armeabi-v7a CtsOpenGlPerf2TestCases | 9 | 0 | 0 | 0 | 9 | true |
| armeabi-v7a CtsOpenGlPerfTestCases | 1 | 0 | 0 | 0 | 1 | true |
| armeabi-v7a CtsOsHostTestCases | 36 | 0 | 5 | 1 | 42 | true |
| armeabi-v7a CtsOsTestCases | 667 | 0 | 33 | 2 | 702 | true |
| armeabi-v7a CtsPackageManagerMultiUserHostTestCases | 0 | 0 | 3 | 0 | 3 | true |
| armeabi-v7a CtsPackageManagerParsingHostTestCases | 11 | 0 | 0 | 0 | 11 | true |
| armeabi-v7a CtsPackageManagerPreferredActivityHostTestCases | 2 | 0 | 0 | 0 | 2 | true |
| armeabi-v7a CtsPackageManagerStatsHostTestCases | 5 | 0 | 0 | 0 | 5 | true |
| armeabi-v7a CtsPdfTestCases | 5241 | 0 | 0 | 0 | 5241 | true |
| armeabi-v7a CtsPerfettoTestCases | 38 | 0 | 0 | 4 | 42 | true |
| armeabi-v7a CtsPermission2TestCases | 88 | 0 | 6 | 0 | 94 | true |
| armeabi-v7a CtsPermission3TestCases | 39 | 0 | 18 | 0 | 57 | true |
| armeabi-v7a CtsPermission4TestCases | 2 | 0 | 1 | 0 | 3 | true |
| armeabi-v7a CtsPermission5TestCases | 21 | 0 | 4 | 0 | 25 | true |
| armeabi-v7a CtsPermissionManagerNativeTestCases | 1 | 0 | 0 | 0 | 1 | true |
| armeabi-v7a CtsPermissionTestCases | 299 | 0 | 17 | 1 | 317 | true |
| armeabi-v7a CtsPermissionTestCasesSdk28 | 1 | 0 | 0 | 0 | 1 | true |
| armeabi-v7a CtsPermissionTestCasesTelephony | 15 | 0 | 0 | 0 | 15 | true |
| armeabi-v7a CtsProviderTestCases | 457 | 0 | 18 | 11 | 486 | true |
| armeabi-v7a CtsProviderUiTestCases | 9 | 0 | 0 | 0 | 9 | true |
| armeabi-v7a CtsQuickAccessWalletTestCases | 32 | 0 | 0 | 0 | 32 | true |
| armeabi-v7a CtsRebootReadinessTestCases | 10 | 0 | 0 | 0 | 10 | true |
| armeabi-v7a CtsRenderscriptLegacyTestCases | 11 | 0 | 0 | 0 | 11 | true |
| armeabi-v7a CtsRenderscriptTestCases | 744 | 0 | 0 | 0 | 744 | true |
| armeabi-v7a CtsResolverServiceTestCases | 2 | 0 | 0 | 0 | 2 | true |
| armeabi-v7a CtsResourcesLoaderTests | 650 | 0 | 0 | 0 | 650 | true |
| armeabi-v7a CtsRoleTestCases | 59 | 0 | 13 | 0 | 72 | true |
| armeabi-v7a CtsRollbackManagerHostTestCases | 6 | 0 | 6 | 0 | 12 | true |
| armeabi-v7a CtsRotationResolverServiceDeviceTestCases | 0 | 0 | 3 | 0 | 3 | true |
| armeabi-v7a CtsSampleDeviceTestCases | 6 | 0 | 0 | 0 | 6 | true |
| armeabi-v7a CtsSampleHostTestCases | 6 | 0 | 1 | 0 | 7 | true |
| armeabi-v7a CtsSaxTestCases | 2 | 0 | 0 | 0 | 2 | true |
| armeabi-v7a CtsScopedStorageCoreHostTest | 4 | 0 | 0 | 0 | 4 | true |
| armeabi-v7a CtsScopedStorageDeviceOnlyTest | 220 | 0 | 0 | 2 | 222 | true |
| armeabi-v7a CtsScopedStorageHostTest | 49 | 0 | 0 | 0 | 49 | true |
| armeabi-v7a CtsSdkExtensionsTestCases | 4 | 0 | 0 | 0 | 4 | true |
| armeabi-v7a CtsSearchUiServiceTestCases | 20 | 0 | 0 | 0 | 20 | true |
| armeabi-v7a CtsSeccompHostTestCases | 3 | 0 | 0 | 0 | 3 | true |
| armeabi-v7a CtsSecureFrpInstallTestCases | 2 | 0 | 0 | 0 | 2 | true |
| armeabi-v7a CtsSecurityBulletinHostTestCases | 0 | 0 | 0 | 0 | 0 | true |
| armeabi-v7a CtsSecurityHostTestCases | 54 | 0 | 0 | 0 | 54 | true |
| armeabi-v7a CtsSecurityTestCases | 48 | 0 | 0 | 0 | 48 | true |
| armeabi-v7a CtsSensorPrivacyTestCases | 12 | 0 | 10 | 1 | 23 | true |
| armeabi-v7a CtsSensorRatePermissionTestCases | 30 | 0 | 60 | 0 | 90 | true |
| armeabi-v7a CtsSensorTestCases | 318 | 0 | 0 | 0 | 318 | true |
| armeabi-v7a CtsSettingsHostTestCases | 4 | 0 | 0 | 0 | 4 | true |
| armeabi-v7a CtsSettingsSuggestionsTest | 3 | 0 | 0 | 0 | 3 | true |
| armeabi-v7a CtsSettingsTestCases | 0 | 0 | 4 | 0 | 4 | true |
| armeabi-v7a CtsSharedLibsApiSignatureTestCases | 1 | 0 | 0 | 0 | 1 | true |
| armeabi-v7a CtsSharesheetTestCases | 3 | 0 | 0 | 0 | 3 | true |
| armeabi-v7a CtsShortcutHostTestCases | 12 | 0 | 0 | 0 | 12 | true |
| armeabi-v7a CtsShortcutManagerTestCases | 71 | 0 | 0 | 0 | 71 | true |
| armeabi-v7a CtsSignedConfigHostTestCases | 13 | 0 | 1 | 0 | 14 | true |
| armeabi-v7a CtsSilentUpdateHostTestCases | 11 | 0 | 0 | 0 | 11 | true |
| armeabi-v7a CtsSimRestrictedApisTestCases | 19 | 0 | 0 | 0 | 19 | true |
| armeabi-v7a CtsSliceTestCases | 41 | 0 | 0 | 0 | 41 | true |
| armeabi-v7a CtsSmartspaceServiceTestCases | 10 | 0 | 0 | 0 | 10 | true |
| armeabi-v7a CtsSpeechTestCases | 17 | 0 | 0 | 0 | 17 | true |
| armeabi-v7a CtsStatsdAtomHostTestCases | 102 | 0 | 0 | 0 | 102 | true |
| armeabi-v7a CtsSyncContentHostTestCases | 0 | 0 | 16 | 0 | 16 | true |
| armeabi-v7a CtsSyncManagerTestsCases | 5 | 0 | 0 | 0 | 5 | true |
| armeabi-v7a CtsSystemApiAnnotationTestCases | 1 | 0 | 0 | 0 | 1 | true |
| armeabi-v7a CtsSystemApiSignatureTestCases | 1 | 0 | 0 | 0 | 1 | true |
| armeabi-v7a CtsSystemUiHostTestCases | 12 | 0 | 0 | 0 | 12 | true |
| armeabi-v7a CtsSystemUiTestCases | 12 | 0 | 15 | 1 | 28 | true |
| armeabi-v7a CtsTaggingHostTestCases | 21 | 0 | 0 | 0 | 21 | true |
| armeabi-v7a CtsTelecomTestCases2 | 10 | 0 | 0 | 0 | 10 | true |
| armeabi-v7a CtsTelecomTestCases3 | 3 | 0 | 0 | 0 | 3 | true |
| armeabi-v7a CtsTelephonyHostCases | 1 | 0 | 0 | 0 | 1 | true |
| armeabi-v7a CtsTelephonyProviderHostCases | 2 | 0 | 0 | 0 | 2 | true |
| armeabi-v7a CtsTelephonyProviderTestCases | 2 | 0 | 50 | 1 | 53 | true |
| armeabi-v7a CtsTelephonySdk28TestCases | 3 | 0 | 0 | 0 | 3 | true |
| armeabi-v7a CtsTelephonyTestCasesPermissionReadPhoneState | 1 | 0 | 0 | 0 | 1 | true |
| armeabi-v7a CtsTetheringTest | 11 | 0 | 7 | 0 | 18 | true |
| armeabi-v7a CtsTextClassifierTestCases | 126 | 0 | 3 | 1 | 130 | true |
| armeabi-v7a CtsTextTestCases | 1281 | 0 | 4 | 0 | 1285 | true |
| armeabi-v7a CtsTfliteNnapiDelegateTestCases | 122 | 0 | 0 | 0 | 122 | true |
| armeabi-v7a CtsThemeHostTestCases | 1 | 0 | 0 | 0 | 1 | true |
| armeabi-v7a CtsThermalTestCases | 5 | 0 | 0 | 0 | 5 | true |
| armeabi-v7a CtsTimeTestCases | 13 | 0 | 0 | 0 | 13 | true |
| armeabi-v7a CtsTransitionTestCases | 122 | 0 | 0 | 0 | 122 | true |
| armeabi-v7a CtsTranslationTestCases | 53 | 0 | 15 | 0 | 68 | true |
| armeabi-v7a CtsTrustedVoiceHostTestCases | 1 | 0 | 0 | 0 | 1 | true |
| armeabi-v7a CtsTvProviderTestCases | 2 | 0 | 0 | 0 | 2 | true |
| armeabi-v7a CtsTvTestCases | 128 | 0 | 54 | 1 | 183 | true |
| armeabi-v7a CtsUiAutomationTestCases | 15 | 0 | 0 | 0 | 15 | true |
| armeabi-v7a CtsUiRenderingTestCases | 708 | 0 | 0 | 1 | 709 | true |
| armeabi-v7a CtsUiRenderingTestCases27 | 2 | 0 | 0 | 0 | 2 | true |
| armeabi-v7a CtsUidIsolationTestCases | 2 | 0 | 0 | 0 | 2 | true |
| armeabi-v7a CtsUsageStatsTestCases | 53 | 0 | 6 | 1 | 60 | true |
| armeabi-v7a CtsUsbManagerTestCases | 3 | 0 | 0 | 0 | 3 | true |
| armeabi-v7a CtsUsbTests | 1 | 0 | 0 | 0 | 1 | true |
| armeabi-v7a CtsUsesLibraryHostTestCases | 1 | 0 | 0 | 0 | 1 | true |
| armeabi-v7a CtsUsesNativeLibraryTest | 16 | 0 | 0 | 0 | 16 | true |
| armeabi-v7a CtsUtilTestCases | 349 | 0 | 0 | 0 | 349 | true |
| armeabi-v7a CtsVcnTestCases | 3 | 0 | 16 | 0 | 19 | true |
| armeabi-v7a CtsVideoTestCases | 438 | 0 | 77 | 0 | 515 | true |
| armeabi-v7a CtsViewInspectorAnnotationProcessorTestCases | 16 | 0 | 0 | 0 | 16 | true |
| armeabi-v7a CtsViewReceiveContentTestCases | 12 | 0 | 0 | 0 | 12 | true |
| armeabi-v7a CtsViewTestCases | 1138 | 0 | 5 | 3 | 1146 | true |
| armeabi-v7a CtsViewTestCasesSdk28 | 1 | 0 | 0 | 0 | 1 | true |
| armeabi-v7a CtsVoiceInteractionTestCases | 27 | 0 | 11 | 0 | 38 | true |
| armeabi-v7a CtsVoiceRecognitionTestCases | 26 | 0 | 2 | 0 | 28 | true |
| armeabi-v7a CtsVoiceSettingsTestCases | 3 | 0 | 0 | 0 | 3 | true |
| armeabi-v7a CtsVrTestCases | 16 | 0 | 0 | 0 | 16 | true |
| armeabi-v7a CtsWebkitTestCases | 282 | 0 | 0 | 0 | 282 | true |
| armeabi-v7a CtsWidgetTestCases | 2952 | 0 | 0 | 0 | 2952 | true |
| armeabi-v7a CtsWidgetTestCases29 | 24 | 0 | 0 | 0 | 24 | true |
| armeabi-v7a CtsWifiBroadcastsHostTestCases | 1 | 0 | 0 | 0 | 1 | true |
| armeabi-v7a CtsWifiTestCases | 297 | 0 | 11 | 0 | 308 | true |
| armeabi-v7a CtsWindowManagerDeviceTestCases | 879 | 6 | 325 | 14 | 1224 | true |
| armeabi-v7a CtsWindowManagerJetpackTestCases | 0 | 0 | 10 | 0 | 10 | true |
| armeabi-v7a CtsWindowManagerSdk25TestCases | 1 | 0 | 0 | 0 | 1 | true |
| armeabi-v7a CtsWindowManagerSdk28TestCases | 0 | 0 | 1 | 0 | 1 | true |
| armeabi-v7a CtsWindowManagerSdk29TestCases | 4 | 0 | 3 | 0 | 7 | true |
| armeabi-v7a CtsWrapNoWrapTestCases | 1 | 0 | 0 | 0 | 1 | true |
| armeabi-v7a CtsWrapWrapDebugMallocDebugTestCases | 1 | 0 | 0 | 0 | 1 | true |
| armeabi-v7a CtsWrapWrapDebugTestCases | 1 | 0 | 0 | 0 | 1 | true |
| armeabi-v7a CtsWrapWrapNoDebugTestCases | 1 | 0 | 0 | 0 | 1 | true |
| armeabi-v7a LegacyStorageTest | 49 | 0 | 0 | 0 | 49 | true |
| armeabi-v7a ResourceObserverNativeTest | 4 | 0 | 0 | 0 | 4 | true |
| armeabi-v7a ScopedStorageTest | 49 | 0 | 0 | 0 | 49 | true |
| armeabi-v7a signed-CtsOmapiTestCases | 1 | 0 | 11 | 0 | 12 | true |
| armeabi-v7a signed-CtsSecureElementAccessControlTestCases1 | 0 | 0 | 6 | 0 | 6 | true |
| armeabi-v7a signed-CtsSecureElementAccessControlTestCases2 | 0 | 0 | 6 | 0 | 6 | true |
| armeabi-v7a signed-CtsSecureElementAccessControlTestCases3 | 0 | 0 | 5 | 0 | 5 | true |
| armeabi-v7a vm-tests-tf | 3126 | 0 | 0 | 0 | 3126 | true |
| armeabi-v7a CtsMediaTestCases | ||
| Test | Result | Details |
|---|---|---|
| android.media.cts.ImageReaderDecoderTest#testOtherVP9ImageReader |
fail
|
Test failed to run to completion. Reason: 'Instrumentation run failed due to 'Process crashed.''. Check device logcat for details
|
| android.media.cts.MediaActivityTest#testVolumeKey_whileSessionAlive |
fail
|
Test did not run due to instrumentation issue. Run level error reported reason: 'Instrumentation run failed due to 'Process crashed.''
|
| android.media.cts.MediaBrowserTest#testConnectionFailed |
fail
|
Test did not run due to instrumentation issue. Run level error reported reason: 'Instrumentation run failed due to 'Process crashed.''
|
| android.media.cts.MediaBrowserTest#testGetItemThrowsIAE |
fail
|
Test did not run due to instrumentation issue. Run level error reported reason: 'Instrumentation run failed due to 'Process crashed.''
|
| android.media.cts.MediaCasTest#testClearKeyApis |
fail
|
Test did not run due to instrumentation issue. Run level error reported reason: 'Instrumentation run failed due to 'Process crashed.''
|
| android.media.cts.MediaCasTest#testClearKeyPluginInstalled |
fail
|
Test did not run due to instrumentation issue. Run level error reported reason: 'Instrumentation run failed due to 'Process crashed.''
|
| android.media.cts.MediaCasTest#testEnumeratePlugins |
fail
|
Test did not run due to instrumentation issue. Run level error reported reason: 'Instrumentation run failed due to 'Process crashed.''
|
| android.media.cts.MediaCodecCapabilitiesTest#testAvcBaseline12 |
fail
|
Test did not run due to instrumentation issue. Run level error reported reason: 'Instrumentation run failed due to 'Process crashed.''
|
| android.media.cts.MediaCodecCapabilitiesTest#testAvcBaseline30 |
fail
|
Test did not run due to instrumentation issue. Run level error reported reason: 'Instrumentation run failed due to 'Process crashed.''
|
| android.media.cts.MediaCodecCapabilitiesTest#testH263DecoderProfileAndLevel |
fail
|
Test did not run due to instrumentation issue. Run level error reported reason: 'Instrumentation run failed due to 'Process crashed.''
|
| android.media.cts.MediaCodecCapabilitiesTest#testHaveAdaptiveVideoDecoderForAllSupportedFormats |
fail
|
Test did not run due to instrumentation issue. Run level error reported reason: 'Instrumentation run failed due to 'Process crashed.''
|
| android.media.cts.MediaCodecCapabilitiesTest#testHevcMain21 |
fail
|
Test did not run due to instrumentation issue. Run level error reported reason: 'Instrumentation run failed due to 'Process crashed.''
|
| android.media.cts.MediaCodecCapabilitiesTest#testHevcMain4 |
fail
|
Test did not run due to instrumentation issue. Run level error reported reason: 'Instrumentation run failed due to 'Process crashed.''
|
| android.media.cts.MediaCodecCapabilitiesTest#testLowLatencyFeatureIsSupportedOnly |
fail
|
Test did not run due to instrumentation issue. Run level error reported reason: 'Instrumentation run failed due to 'Process crashed.''
|
| android.media.cts.MediaCodecCapabilitiesTest#testMpeg4DecoderProfileAndLevel |
fail
|
Test did not run due to instrumentation issue. Run level error reported reason: 'Instrumentation run failed due to 'Process crashed.''
|
| android.media.cts.MediaCodecCapabilitiesTest#testSecureCodecsAdvertiseSecurePlayback |
fail
|
Test did not run due to instrumentation issue. Run level error reported reason: 'Instrumentation run failed due to 'Process crashed.''
|
| android.media.cts.MediaCodecCapabilitiesTest#testVp9DecoderCapabilitiesOnTv |
fail
|
Test did not run due to instrumentation issue. Run level error reported reason: 'Instrumentation run failed due to 'Process crashed.''
|
| android.media.cts.MediaCodecListTest#testAllHardwareAcceleratedVideoCodecsPublishPerformancePoints |
fail
|
Test did not run due to instrumentation issue. Run level error reported reason: 'Instrumentation run failed due to 'Process crashed.''
|
| android.media.cts.MediaCodecListTest#testFindDecoderWithAacProfile |
fail
|
Test did not run due to instrumentation issue. Run level error reported reason: 'Instrumentation run failed due to 'Process crashed.''
|
| android.media.cts.MediaCodecListTest#testRequiredMediaCodecList |
fail
|
Test did not run due to instrumentation issue. Run level error reported reason: 'Instrumentation run failed due to 'Process crashed.''
|
| android.media.cts.MediaCodecListTest#testVideoPerformancePointsSanity |
fail
|
Test did not run due to instrumentation issue. Run level error reported reason: 'Instrumentation run failed due to 'Process crashed.''
|
| android.media.cts.MediaCodecTest#testAsyncFlushAndReset |
fail
|
Test did not run due to instrumentation issue. Run level error reported reason: 'Instrumentation run failed due to 'Process crashed.''
|
| android.media.cts.MediaCodecTest#testConcurrentAudioVideoEncodings |
fail
|
Test did not run due to instrumentation issue. Run level error reported reason: 'Instrumentation run failed due to 'Process crashed.''
|
| android.media.cts.MediaCodecTest#testCreateTwoAudioDecoders |
fail
|
Test did not run due to instrumentation issue. Run level error reported reason: 'Instrumentation run failed due to 'Process crashed.''
|
| android.media.cts.MediaCodecTest#testFlacIdentity |
fail
|
Test did not run due to instrumentation issue. Run level error reported reason: 'Instrumentation run failed due to 'Process crashed.''
|
| android.media.cts.MediaCodecTest#testPCMEncoding |
fail
|
Test did not run due to instrumentation issue. Run level error reported reason: 'Instrumentation run failed due to 'Process crashed.''
|
| android.media.cts.MediaCodecTest#testPrependHeadersToSyncFrames |
fail
|
Test did not run due to instrumentation issue. Run level error reported reason: 'Instrumentation run failed due to 'Process crashed.''
|
| android.media.cts.MediaCodecTest#testReleaseAfterFlush |
fail
|
Test did not run due to instrumentation issue. Run level error reported reason: 'Instrumentation run failed due to 'Process crashed.''
|
| android.media.cts.MediaCodecTest#testSignalSurfaceEOS |
fail
|
Test did not run due to instrumentation issue. Run level error reported reason: 'Instrumentation run failed due to 'Process crashed.''
|
| android.media.cts.MediaController2Test#testCallback_onCommandResult |
fail
|
Test did not run due to instrumentation issue. Run level error reported reason: 'Instrumentation run failed due to 'Process crashed.''
|
| android.media.cts.MediaControllerTest#testDispatchMediaButtonEventWithNullKeyEvent |
fail
|
Test did not run due to instrumentation issue. Run level error reported reason: 'Instrumentation run failed due to 'Process crashed.''
|
| android.media.cts.MediaControllerTest#testGetPlaybackState |
fail
|
Test did not run due to instrumentation issue. Run level error reported reason: 'Instrumentation run failed due to 'Process crashed.''
|
| android.media.cts.MediaControllerTest#testGetRatingType |
fail
|
Test did not run due to instrumentation issue. Run level error reported reason: 'Instrumentation run failed due to 'Process crashed.''
|
| android.media.cts.MediaControllerTest#testGetSessionToken |
fail
|
Test did not run due to instrumentation issue. Run level error reported reason: 'Instrumentation run failed due to 'Process crashed.''
|
| android.media.cts.MediaControllerTest#testRegisterCallbackWithNullThrowsIAE |
fail
|
Test did not run due to instrumentation issue. Run level error reported reason: 'Instrumentation run failed due to 'Process crashed.''
|
| android.media.cts.MediaControllerTest#testSendCustomActionWithIllegalArgumentsThrowsIAE |
fail
|
Test did not run due to instrumentation issue. Run level error reported reason: 'Instrumentation run failed due to 'Process crashed.''
|
| android.media.cts.MediaControllerTest#testTransportControlsPlayAndPrepareFromMediaIdWithIllegalArgumentsThrowsIAE |
fail
|
Test did not run due to instrumentation issue. Run level error reported reason: 'Instrumentation run failed due to 'Process crashed.''
|
| android.media.cts.MediaDrmClearkeyTest#testClearKeyPlaybackCenc2 |
fail
|
Test did not run due to instrumentation issue. Run level error reported reason: 'Instrumentation run failed due to 'Process crashed.''
|
| android.media.cts.MediaDrmClearkeyTest#testClearKeyPlaybackOfflineCenc |
fail
|
Test did not run due to instrumentation issue. Run level error reported reason: 'Instrumentation run failed due to 'Process crashed.''
|
| android.media.cts.MediaDrmClearkeyTest#testClearOnEventListener |
fail
|
Test did not run due to instrumentation issue. Run level error reported reason: 'Instrumentation run failed due to 'Process crashed.''
|
| android.media.cts.MediaDrmClearkeyTest#testGetNumberOfSessions |
fail
|
Test did not run due to instrumentation issue. Run level error reported reason: 'Instrumentation run failed due to 'Process crashed.''
|
| android.media.cts.MediaDrmClearkeyTest#testIsCryptoSchemeSupportedWithSecurityLevel |
fail
|
Test did not run due to instrumentation issue. Run level error reported reason: 'Instrumentation run failed due to 'Process crashed.''
|
| android.media.cts.MediaDrmClearkeyTest#testSetProperties |
fail
|
Test did not run due to instrumentation issue. Run level error reported reason: 'Instrumentation run failed due to 'Process crashed.''
|
| android.media.cts.MediaDrmMockTest#testEventNoSessionNoDataWithExecutor |
fail
|
Test did not run due to instrumentation issue. Run level error reported reason: 'Instrumentation run failed due to 'Process crashed.''
|
| android.media.cts.MediaDrmMockTest#testExpirationUpdate |
fail
|
Test did not run due to instrumentation issue. Run level error reported reason: 'Instrumentation run failed due to 'Process crashed.''
|
| android.media.cts.MediaDrmMockTest#testGetKeyRequestOffline |
fail
|
Test did not run due to instrumentation issue. Run level error reported reason: 'Instrumentation run failed due to 'Process crashed.''
|
| android.media.cts.MediaDrmMockTest#testIsCryptoSchemeNotSupported |
fail
|
Test did not run due to instrumentation issue. Run level error reported reason: 'Instrumentation run failed due to 'Process crashed.''
|
| android.media.cts.MediaDrmMockTest#testIsMimeTypeSupported |
fail
|
Test did not run due to instrumentation issue. Run level error reported reason: 'Instrumentation run failed due to 'Process crashed.''
|
| android.media.cts.MediaDrmMockTest#testKeyStatusChangeWithExecutor |
fail
|
Test did not run due to instrumentation issue. Run level error reported reason: 'Instrumentation run failed due to 'Process crashed.''
|
| android.media.cts.MediaDrmMockTest#testMultipleSessions |
fail
|
Test did not run due to instrumentation issue. Run level error reported reason: 'Instrumentation run failed due to 'Process crashed.''
|
| android.media.cts.MediaDrmMockTest#testNullPropertyByteArray |
fail
|
Test did not run due to instrumentation issue. Run level error reported reason: 'Instrumentation run failed due to 'Process crashed.''
|
| android.media.cts.MediaDrmMockTest#testQueryKeyStatus |
fail
|
Test did not run due to instrumentation issue. Run level error reported reason: 'Instrumentation run failed due to 'Process crashed.''
|
| android.media.cts.MediaDrmMockTest#testRemoveKeys |
fail
|
Test did not run due to instrumentation issue. Run level error reported reason: 'Instrumentation run failed due to 'Process crashed.''
|
| android.media.cts.MediaDrmMockTest#testSessionLostState |
fail
|
Test did not run due to instrumentation issue. Run level error reported reason: 'Instrumentation run failed due to 'Process crashed.''
|
| android.media.cts.MediaDrmMockTest#testSessionLostStateWithExecutor |
fail
|
Test did not run due to instrumentation issue. Run level error reported reason: 'Instrumentation run failed due to 'Process crashed.''
|
| android.media.cts.MediaExtractorTest#testGetAudioPresentations |
fail
|
Test did not run due to instrumentation issue. Run level error reported reason: 'Instrumentation run failed due to 'Process crashed.''
|
| android.media.cts.MediaFormatTest#testKeySetContainsAndRemove |
fail
|
Test did not run due to instrumentation issue. Run level error reported reason: 'Instrumentation run failed due to 'Process crashed.''
|
| android.media.cts.MediaFormatTest#testMissingValue |
fail
|
Test did not run due to instrumentation issue. Run level error reported reason: 'Instrumentation run failed due to 'Process crashed.''
|
| android.media.cts.MediaMetadataRetrieverTest#testGenreParsing |
fail
|
Test did not run due to instrumentation issue. Run level error reported reason: 'Instrumentation run failed due to 'Process crashed.''
|
| android.media.cts.MediaMetadataRetrieverTest#testGetEmbeddedPicture |
fail
|
Test did not run due to instrumentation issue. Run level error reported reason: 'Instrumentation run failed due to 'Process crashed.''
|
| android.media.cts.MediaMetadataRetrieverTest#testGetFrameAtTimeClosest |
fail
|
Test did not run due to instrumentation issue. Run level error reported reason: 'Instrumentation run failed due to 'Process crashed.''
|
| android.media.cts.MediaMetadataRetrieverTest#testGetImageAtIndex |
fail
|
Test did not run due to instrumentation issue. Run level error reported reason: 'Instrumentation run failed due to 'Process crashed.''
|
| android.media.cts.MediaMetadataRetrieverTest#testID3v240ExtHeader |
fail
|
Test did not run due to instrumentation issue. Run level error reported reason: 'Instrumentation run failed due to 'Process crashed.''
|
| android.media.cts.MediaMetadataRetrieverTest#testRetrieveFailsIfMediaDataSourceReturnsAnError |
fail
|
Test did not run due to instrumentation issue. Run level error reported reason: 'Instrumentation run failed due to 'Process crashed.''
|
| android.media.cts.MediaMuxerTest#testTimestampsStartOffsetAudio |
fail
|
Test did not run due to instrumentation issue. Run level error reported reason: 'Instrumentation run failed due to 'Process crashed.''
|
| android.media.cts.MediaMuxerTest#testTimestampsStartOffsetNegativeAudioVideo |
fail
|
Test did not run due to instrumentation issue. Run level error reported reason: 'Instrumentation run failed due to 'Process crashed.''
|
| android.media.cts.MediaMuxerTest#testTimestampsStartOffsetVideo |
fail
|
Test did not run due to instrumentation issue. Run level error reported reason: 'Instrumentation run failed due to 'Process crashed.''
|
| android.media.cts.MediaMuxerTest#testTimestampsStartOffsetVideoAudio |
fail
|
Test did not run due to instrumentation issue. Run level error reported reason: 'Instrumentation run failed due to 'Process crashed.''
|
| android.media.cts.MediaPlayerDrmTest#testCAR_CLEARKEY_AUDIO_DOWNLOADED_V3_ASYNC_DRMPREPARED |
fail
|
Test did not run due to instrumentation issue. Run level error reported reason: 'Instrumentation run failed due to 'Process crashed.''
|
| android.media.cts.MediaPlayerTest#testLocalVideo_3gp_H263_176x144_300kbps_12fps_AAC_Mono_24kbps_11025Hz |
fail
|
Test did not run due to instrumentation issue. Run level error reported reason: 'Instrumentation run failed due to 'Process crashed.''
|
| android.media.cts.MediaPlayerTest#testLocalVideo_3gp_H263_176x144_300kbps_25fps_AAC_Stereo_128kbps_11025Hz |
fail
|
Test did not run due to instrumentation issue. Run level error reported reason: 'Instrumentation run failed due to 'Process crashed.''
|
| android.media.cts.MediaPlayerTest#testLocalVideo_3gp_H263_176x144_300kbps_25fps_AAC_Stereo_24kbps_11025Hz |
fail
|
Test did not run due to instrumentation issue. Run level error reported reason: 'Instrumentation run failed due to 'Process crashed.''
|
| android.media.cts.MediaPlayerTest#testLocalVideo_3gp_H263_176x144_56kbps_12fps_AAC_Mono_24kbps_11025Hz |
fail
|
Test did not run due to instrumentation issue. Run level error reported reason: 'Instrumentation run failed due to 'Process crashed.''
|
| android.media.cts.MediaPlayerTest#testLocalVideo_3gp_H263_176x144_56kbps_12fps_AAC_Stereo_128kbps_11025Hz |
fail
|
Test did not run due to instrumentation issue. Run level error reported reason: 'Instrumentation run failed due to 'Process crashed.''
|
| android.media.cts.MediaPlayerTest#testLocalVideo_3gp_H263_176x144_56kbps_25fps_AAC_Stereo_128kbps_22050Hz |
fail
|
Test did not run due to instrumentation issue. Run level error reported reason: 'Instrumentation run failed due to 'Process crashed.''
|
| android.media.cts.MediaPlayerTest#testLocalVideo_3gp_H263_176x144_56kbps_25fps_AAC_Stereo_24kbps_11025Hz |
fail
|
Test did not run due to instrumentation issue. Run level error reported reason: 'Instrumentation run failed due to 'Process crashed.''
|
| android.media.cts.MediaPlayerTest#testLocalVideo_MP4_H264_480x360_1000kbps_25fps_AAC_Stereo_128kbps_44110Hz |
fail
|
Test did not run due to instrumentation issue. Run level error reported reason: 'Instrumentation run failed due to 'Process crashed.''
|
| android.media.cts.MediaPlayerTest#testLocalVideo_MP4_H264_480x360_1350kbps_30fps_AAC_Stereo_128kbps_44110Hz_frag |
fail
|
Test did not run due to instrumentation issue. Run level error reported reason: 'Instrumentation run failed due to 'Process crashed.''
|
| android.media.cts.MediaPlayerTest#testLocalVideo_mkv_audio_pcm_be |
fail
|
Test did not run due to instrumentation issue. Run level error reported reason: 'Instrumentation run failed due to 'Process crashed.''
|
| android.media.cts.MediaPlayerTest#testMediaDataSourceIsClosedOnReset |
fail
|
Test did not run due to instrumentation issue. Run level error reported reason: 'Instrumentation run failed due to 'Process crashed.''
|
| android.media.cts.MediaPlayerTest#testMediaTimeDiscontinuity |
fail
|
Test did not run due to instrumentation issue. Run level error reported reason: 'Instrumentation run failed due to 'Process crashed.''
|
| android.media.cts.MediaPlayerTest#testPlayAudioAmr |
fail
|
Test did not run due to instrumentation issue. Run level error reported reason: 'Instrumentation run failed due to 'Process crashed.''
|
| android.media.cts.MediaPlayerTest#testPlayAudioLooping |
fail
|
Test did not run due to instrumentation issue. Run level error reported reason: 'Instrumentation run failed due to 'Process crashed.''
|
| android.media.cts.MediaPlayerTest#testPlayAudioMp3 |
fail
|
Test did not run due to instrumentation issue. Run level error reported reason: 'Instrumentation run failed due to 'Process crashed.''
|
| android.media.cts.MediaPlayerTest#testPlaybackFailsIfMediaDataSourceReturnsAnError |
fail
|
Test did not run due to instrumentation issue. Run level error reported reason: 'Instrumentation run failed due to 'Process crashed.''
|
| android.media.cts.MediaPlayerTest#testPlaybackFailsIfMediaDataSourceThrows |
fail
|
Test did not run due to instrumentation issue. Run level error reported reason: 'Instrumentation run failed due to 'Process crashed.''
|
| android.media.cts.MediaPlayerTest#testPlaybackRate |
fail
|
Test did not run due to instrumentation issue. Run level error reported reason: 'Instrumentation run failed due to 'Process crashed.''
|
| android.media.cts.MediaPlayerTest#testRecordAndPlay |
fail
|
Test did not run due to instrumentation issue. Run level error reported reason: 'Instrumentation run failed due to 'Process crashed.''
|
| android.media.cts.MediaRandomTest#testPlayerRandomActionHEVC |
fail
|
Test did not run due to instrumentation issue. Run level error reported reason: 'Instrumentation run failed due to 'Process crashed.''
|
| android.media.cts.MediaRandomTest#testPlayerRandomActionMpeg2 |
fail
|
Test did not run due to instrumentation issue. Run level error reported reason: 'Instrumentation run failed due to 'Process crashed.''
|
| android.media.cts.MediaRecorderTest#testOnErrorListener |
fail
|
Test did not run due to instrumentation issue. Run level error reported reason: 'Instrumentation run failed due to 'Process crashed.''
|
| android.media.cts.MediaRecorderTest#testProfileAvcBaselineLevel1 |
fail
|
Test did not run due to instrumentation issue. Run level error reported reason: 'Instrumentation run failed due to 'Process crashed.''
|
| android.media.cts.MediaRecorderTest#testRecorderVideo |
fail
|
Test did not run due to instrumentation issue. Run level error reported reason: 'Instrumentation run failed due to 'Process crashed.''
|
| android.media.cts.MediaRecorderTest#testRecordingAudioInRawFormats |
fail
|
Test did not run due to instrumentation issue. Run level error reported reason: 'Instrumentation run failed due to 'Process crashed.''
|
| android.media.cts.MediaRecorderTest#testSetMaxFileSize |
fail
|
Test did not run due to instrumentation issue. Run level error reported reason: 'Instrumentation run failed due to 'Process crashed.''
|
| android.media.cts.MediaRecorderTest#testSurfaceRecordingTimeLapse |
fail
|
Test did not run due to instrumentation issue. Run level error reported reason: 'Instrumentation run failed due to 'Process crashed.''
|
| android.media.cts.MediaRoute2InfoTest#testEqualsCreatedWithSameArguments |
fail
|
Test did not run due to instrumentation issue. Run level error reported reason: 'Instrumentation run failed due to 'Process crashed.''
|
| android.media.cts.MediaRoute2InfoTest#testBuilderaddFeatures |
fail
|
Test did not run due to instrumentation issue. Run level error reported reason: 'Instrumentation run failed due to 'Process crashed.''
|
| android.media.cts.MediaRoute2InfoTest#testBuilderConstructorWithInvalidValues |
fail
|
Test did not run due to instrumentation issue. Run level error reported reason: 'Instrumentation run failed due to 'Process crashed.''
|
| android.media.cts.MediaRoute2InfoTest#testDescribeContents |
fail
|
Test did not run due to instrumentation issue. Run level error reported reason: 'Instrumentation run failed due to 'Process crashed.''
|
| android.media.cts.MediaRoute2ProviderServiceTest#testSessionRelatedCallbacks |
fail
|
Test did not run due to instrumentation issue. Run level error reported reason: 'Instrumentation run failed due to 'Process crashed.''
|
| android.media.cts.MediaRoute2ProviderServiceTest#testNotifyRoutesInvokesMediaRouter2RouteCallback |
fail
|
Test did not run due to instrumentation issue. Run level error reported reason: 'Instrumentation run failed due to 'Process crashed.''
|
| android.media.cts.MediaRoute2ProviderServiceTest#testGetSessionInfoAndGetAllSessionInfo |
fail
|
Test did not run due to instrumentation issue. Run level error reported reason: 'Instrumentation run failed due to 'Process crashed.''
|
| android.media.cts.MediaRouter2Test#testRoutingControllerRelease |
fail
|
Test did not run due to instrumentation issue. Run level error reported reason: 'Instrumentation run failed due to 'Process crashed.''
|
| android.media.cts.MediaRouter2Test#testStop |
fail
|
Test did not run due to instrumentation issue. Run level error reported reason: 'Instrumentation run failed due to 'Process crashed.''
|
| android.media.cts.MediaRouter2Test#markCallbacksAsTested |
fail
|
Test did not run due to instrumentation issue. Run level error reported reason: 'Instrumentation run failed due to 'Process crashed.''
|
| android.media.cts.MediaRouter2Test#testTransferToTwice |
fail
|
Test did not run due to instrumentation issue. Run level error reported reason: 'Instrumentation run failed due to 'Process crashed.''
|
| android.media.cts.MediaRouter2Test#testRegisterTransferCallbackWithInvalidArguments |
fail
|
Test did not run due to instrumentation issue. Run level error reported reason: 'Instrumentation run failed due to 'Process crashed.''
|
| android.media.cts.MediaRouter2Test#testUnregisterTransferCallbackWithNullCallback |
fail
|
Test did not run due to instrumentation issue. Run level error reported reason: 'Instrumentation run failed due to 'Process crashed.''
|
| android.media.cts.MediaRouterTest#testSelectRoute |
fail
|
Test did not run due to instrumentation issue. Run level error reported reason: 'Instrumentation run failed due to 'Process crashed.''
|
| android.media.cts.MediaSession2ServiceTest#testAddSessions_removedWhenClose |
fail
|
Test did not run due to instrumentation issue. Run level error reported reason: 'Instrumentation run failed due to 'Process crashed.''
|
| android.media.cts.MediaSession2ServiceTest#testAllControllersDisconnected_multipleSessions |
fail
|
Test did not run due to instrumentation issue. Run level error reported reason: 'Instrumentation run failed due to 'Process crashed.''
|
| android.media.cts.MediaSession2Test#testBuilder_setExtras_withFrameworkParcelable |
fail
|
Test did not run due to instrumentation issue. Run level error reported reason: 'Instrumentation run failed due to 'Process crashed.''
|
| android.media.cts.MediaSession2Test#testCallback_onSessionCommand |
fail
|
Test did not run due to instrumentation issue. Run level error reported reason: 'Instrumentation run failed due to 'Process crashed.''
|
| android.media.cts.MediaSessionManagerTest#testGetMediaKeyEventSession_throwsSecurityException |
fail
|
Test did not run due to instrumentation issue. Run level error reported reason: 'Instrumentation run failed due to 'Process crashed.''
|
| android.media.cts.MediaSessionManagerTest#testOnMediaKeyEventDispatchedListener |
fail
|
Test did not run due to instrumentation issue. Run level error reported reason: 'Instrumentation run failed due to 'Process crashed.''
|
| android.media.cts.MediaSessionTest#testQueueItem |
fail
|
Test did not run due to instrumentation issue. Run level error reported reason: 'Instrumentation run failed due to 'Process crashed.''
|
| android.media.cts.MediaSessionTest#testSeriesOfSetQueue |
fail
|
Test did not run due to instrumentation issue. Run level error reported reason: 'Instrumentation run failed due to 'Process crashed.''
|
| android.media.cts.MediaSessionTest#testSessionToken |
fail
|
Test did not run due to instrumentation issue. Run level error reported reason: 'Instrumentation run failed due to 'Process crashed.''
|
| android.media.cts.MediaSessionTest#testSetQueueWithLargeNumberOfItems |
fail
|
Test did not run due to instrumentation issue. Run level error reported reason: 'Instrumentation run failed due to 'Process crashed.''
|
| android.media.cts.NativeDecoderTest#testAMediaDataSourceClose |
fail
|
Test did not run due to instrumentation issue. Run level error reported reason: 'Instrumentation run failed due to 'Process crashed.''
|
| android.media.cts.NativeDecoderTest#testDataSourceWithCallback |
fail
|
Test did not run due to instrumentation issue. Run level error reported reason: 'Instrumentation run failed due to 'Process crashed.''
|
| android.media.cts.NativeDecoderTest#testMediaFormat |
fail
|
Test did not run due to instrumentation issue. Run level error reported reason: 'Instrumentation run failed due to 'Process crashed.''
|
| android.media.cts.NativeDecoderTest#testMuxerVp9 |
fail
|
Test did not run due to instrumentation issue. Run level error reported reason: 'Instrumentation run failed due to 'Process crashed.''
|
| android.media.cts.NativeMediaDrmClearkeyTest#testClearKeyPlaybackCenc |
fail
|
Test did not run due to instrumentation issue. Run level error reported reason: 'Instrumentation run failed due to 'Process crashed.''
|
| android.media.cts.NativeMediaDrmClearkeyTest#testClearKeyPlaybackCenc2 |
fail
|
Test did not run due to instrumentation issue. Run level error reported reason: 'Instrumentation run failed due to 'Process crashed.''
|
| android.media.cts.NativeMediaDrmClearkeyTest#testGetPropertyString |
fail
|
Test did not run due to instrumentation issue. Run level error reported reason: 'Instrumentation run failed due to 'Process crashed.''
|
| android.media.cts.NativeMediaDrmClearkeyTest#testIsCryptoSchemeNotSupported |
fail
|
Test did not run due to instrumentation issue. Run level error reported reason: 'Instrumentation run failed due to 'Process crashed.''
|
| android.media.cts.NativeMediaDrmClearkeyTest#testPropertyByteArray |
fail
|
Test did not run due to instrumentation issue. Run level error reported reason: 'Instrumentation run failed due to 'Process crashed.''
|
| android.media.cts.ParamsTest#testPlaybackParamsAudioFallbackMode |
fail
|
Test did not run due to instrumentation issue. Run level error reported reason: 'Instrumentation run failed due to 'Process crashed.''
|
| android.media.cts.ParamsTest#testPlaybackParamsSpeed |
fail
|
Test did not run due to instrumentation issue. Run level error reported reason: 'Instrumentation run failed due to 'Process crashed.''
|
| android.media.cts.ParamsTest#testSyncParamsMultipleSettings |
fail
|
Test did not run due to instrumentation issue. Run level error reported reason: 'Instrumentation run failed due to 'Process crashed.''
|
| android.media.cts.PresetReverbTest#test1_0Presets |
fail
|
Test did not run due to instrumentation issue. Run level error reported reason: 'Instrumentation run failed due to 'Process crashed.''
|
| android.media.cts.PresetReverbTest#test3_2ParameterChangedListener |
fail
|
Test did not run due to instrumentation issue. Run level error reported reason: 'Instrumentation run failed due to 'Process crashed.''
|
| android.media.cts.RatingTest#testHeartRating |
fail
|
Test did not run due to instrumentation issue. Run level error reported reason: 'Instrumentation run failed due to 'Process crashed.''
|
| android.media.cts.RatingTest#testPercentageWithIllegalRatingValueGetters |
fail
|
Test did not run due to instrumentation issue. Run level error reported reason: 'Instrumentation run failed due to 'Process crashed.''
|
| android.media.cts.RatingTest#testParcelization |
fail
|
Test did not run due to instrumentation issue. Run level error reported reason: 'Instrumentation run failed due to 'Process crashed.''
|
| android.media.cts.RatingTest#testStarRatingWithIllegalRatingValueGetters |
fail
|
Test did not run due to instrumentation issue. Run level error reported reason: 'Instrumentation run failed due to 'Process crashed.''
|
| android.media.cts.RemoteControllerTest#testClearArtworkConfiguration |
fail
|
Test did not run due to instrumentation issue. Run level error reported reason: 'Instrumentation run failed due to 'Process crashed.''
|
| android.media.cts.ResourceManagerTest#testReclaimResourceMixVsNonsecure |
fail
|
Test did not run due to instrumentation issue. Run level error reported reason: 'Instrumentation run failed due to 'Process crashed.''
|
| android.media.cts.RouteDiscoveryPreferenceTest#testEqualsReturnFalseWithCopyConstructor |
fail
|
Test did not run due to instrumentation issue. Run level error reported reason: 'Instrumentation run failed due to 'Process crashed.''
|
| android.media.cts.RouteDiscoveryPreferenceTest#testBuilderSetPreferredFeaturesWithNull |
fail
|
Test did not run due to instrumentation issue. Run level error reported reason: 'Instrumentation run failed due to 'Process crashed.''
|
| android.media.cts.RoutingSessionInfoTest#testBuilderBuildWithEmptySelectedRoutesThrowsIAE |
fail
|
Test did not run due to instrumentation issue. Run level error reported reason: 'Instrumentation run failed due to 'Process crashed.''
|
| android.media.cts.RoutingTest#test_audioRecord_RoutingListener |
fail
|
Test did not run due to instrumentation issue. Run level error reported reason: 'Instrumentation run failed due to 'Process crashed.''
|
| android.media.cts.RoutingTest#test_audioTrack_RoutingListener |
fail
|
Test did not run due to instrumentation issue. Run level error reported reason: 'Instrumentation run failed due to 'Process crashed.''
|
| android.media.cts.RoutingTest#test_mediaPlayer_preferredDevice |
fail
|
Test did not run due to instrumentation issue. Run level error reported reason: 'Instrumentation run failed due to 'Process crashed.''
|
| android.media.cts.Session2CommandTest#testWriteToParcel |
fail
|
Test did not run due to instrumentation issue. Run level error reported reason: 'Instrumentation run failed due to 'Process crashed.''
|
| android.media.cts.StreamingMediaPlayerTest#testPlayHlsStreamWithTimedId3 |
fail
|
Test did not run due to instrumentation issue. Run level error reported reason: 'Instrumentation run failed due to 'Process crashed.''
|
| android.media.cts.StreamingMediaPlayerTest#testPlayMp3Stream1Ssl |
fail
|
Test did not run due to instrumentation issue. Run level error reported reason: 'Instrumentation run failed due to 'Process crashed.''
|
| android.media.cts.StreamingMediaPlayerTest#testPlayMp3Stream2 |
fail
|
Test did not run due to instrumentation issue. Run level error reported reason: 'Instrumentation run failed due to 'Process crashed.''
|
| android.media.cts.StreamingMediaPlayerTest#testPlayOggStreamRedirect |
fail
|
Test did not run due to instrumentation issue. Run level error reported reason: 'Instrumentation run failed due to 'Process crashed.''
|
| android.media.cts.SurfaceEncodeTimestampTest#testMaxFps |
fail
|
Test did not run due to instrumentation issue. Run level error reported reason: 'Instrumentation run failed due to 'Process crashed.''
|
| android.media.cts.SystemMediaRouter2Test#testStop |
fail
|
Test did not run due to instrumentation issue. Run level error reported reason: 'Instrumentation run failed due to 'Process crashed.''
|
| android.media.cts.SystemMediaRouter2Test#testRouteCallbackOnRoutesChanged_whenLocalVolumeChanged |
fail
|
Test did not run due to instrumentation issue. Run level error reported reason: 'Instrumentation run failed due to 'Process crashed.''
|
| android.media.cts.SystemMediaRouter2Test#testTransferTo_fails_onTransferFailureCalled |
fail
|
Test did not run due to instrumentation issue. Run level error reported reason: 'Instrumentation run failed due to 'Process crashed.''
|
| android.media.cts.SystemMediaRouter2Test#testGetControllerReturnsNullForUnknownId |
fail
|
Test did not run due to instrumentation issue. Run level error reported reason: 'Instrumentation run failed due to 'Process crashed.''
|
| android.media.cts.SystemMediaRouter2Test#testRouteCallbackOnRoutesChanged |
fail
|
Test did not run due to instrumentation issue. Run level error reported reason: 'Instrumentation run failed due to 'Process crashed.''
|
| android.media.cts.SystemMediaRouter2Test#testGetInstanceReturnsSameInstance |
fail
|
Test did not run due to instrumentation issue. Run level error reported reason: 'Instrumentation run failed due to 'Process crashed.''
|
| android.media.cts.VideoCodecTest#testDynamicBitrateChangeAVCCBR |
fail
|
Test did not run due to instrumentation issue. Run level error reported reason: 'Instrumentation run failed due to 'Process crashed.''
|
| android.media.cts.VideoCodecTest#testDynamicBitrateChangeAVCVBR |
fail
|
Test did not run due to instrumentation issue. Run level error reported reason: 'Instrumentation run failed due to 'Process crashed.''
|
| android.media.cts.VideoCodecTest#testDynamicBitrateChangeHEVCCBR |
fail
|
Test did not run due to instrumentation issue. Run level error reported reason: 'Instrumentation run failed due to 'Process crashed.''
|
| android.media.cts.VideoCodecTest#testDynamicBitrateChangeHEVCVBR |
fail
|
Test did not run due to instrumentation issue. Run level error reported reason: 'Instrumentation run failed due to 'Process crashed.''
|
| android.media.cts.VideoCodecTest#testDynamicBitrateChangeVP9CBR |
fail
|
Test did not run due to instrumentation issue. Run level error reported reason: 'Instrumentation run failed due to 'Process crashed.''
|
| android.media.cts.VideoCodecTest#testDynamicBitrateChangeVP9VBR |
fail
|
Test did not run due to instrumentation issue. Run level error reported reason: 'Instrumentation run failed due to 'Process crashed.''
|
| android.media.cts.VideoCodecTest#testParallelEncodingAndDecodingAVC |
fail
|
Test did not run due to instrumentation issue. Run level error reported reason: 'Instrumentation run failed due to 'Process crashed.''
|
| android.media.cts.VideoCodecTest#testSyncFrameVP8CBR |
fail
|
Test did not run due to instrumentation issue. Run level error reported reason: 'Instrumentation run failed due to 'Process crashed.''
|
| android.media.cts.VideoCodecTest#testSyncFrameVP8VBR |
fail
|
Test did not run due to instrumentation issue. Run level error reported reason: 'Instrumentation run failed due to 'Process crashed.''
|
| android.media.cts.VideoDecoderPerfTest#testAvcCount0720x0480 |
fail
|
Test did not run due to instrumentation issue. Run level error reported reason: 'Instrumentation run failed due to 'Process crashed.''
|
| android.media.cts.VideoDecoderPerfTest#testAvcGoog1Perf0320x0240 |
fail
|
Test did not run due to instrumentation issue. Run level error reported reason: 'Instrumentation run failed due to 'Process crashed.''
|
| android.media.cts.VideoDecoderPerfTest#testAvcGoog1Perf1920x1080 |
fail
|
Test did not run due to instrumentation issue. Run level error reported reason: 'Instrumentation run failed due to 'Process crashed.''
|
| android.media.cts.VideoDecoderPerfTest#testAvcOther0Perf0320x0240 |
fail
|
Test did not run due to instrumentation issue. Run level error reported reason: 'Instrumentation run failed due to 'Process crashed.''
|
| android.media.cts.VideoDecoderPerfTest#testAvcOther0Perf1920x1080 |
fail
|
Test did not run due to instrumentation issue. Run level error reported reason: 'Instrumentation run failed due to 'Process crashed.''
|
| android.media.cts.VideoDecoderPerfTest#testAvcOther1Perf0320x0240 |
fail
|
Test did not run due to instrumentation issue. Run level error reported reason: 'Instrumentation run failed due to 'Process crashed.''
|
| android.media.cts.VideoDecoderPerfTest#testAvcOther3Perf1280x0720 |
fail
|
Test did not run due to instrumentation issue. Run level error reported reason: 'Instrumentation run failed due to 'Process crashed.''
|
| android.media.cts.VideoDecoderPerfTest#testH263Goog0Perf0176x0144 |
fail
|
Test did not run due to instrumentation issue. Run level error reported reason: 'Instrumentation run failed due to 'Process crashed.''
|
| android.media.cts.VideoDecoderPerfTest#testH263Goog0Perf0352x0288 |
fail
|
Test did not run due to instrumentation issue. Run level error reported reason: 'Instrumentation run failed due to 'Process crashed.''
|
| android.media.cts.VideoDecoderPerfTest#testH263Goog1Perf0352x0288 |
fail
|
Test did not run due to instrumentation issue. Run level error reported reason: 'Instrumentation run failed due to 'Process crashed.''
|
| android.media.cts.VideoDecoderPerfTest#testHevcGoog0Perf0352x0288 |
fail
|
Test did not run due to instrumentation issue. Run level error reported reason: 'Instrumentation run failed due to 'Process crashed.''
|
| android.media.cts.VideoDecoderPerfTest#testHevcGoog0Perf0640x0360 |
fail
|
Test did not run due to instrumentation issue. Run level error reported reason: 'Instrumentation run failed due to 'Process crashed.''
|
| android.media.cts.VideoDecoderPerfTest#testHevcGoog0Perf1280x0720 |
fail
|
Test did not run due to instrumentation issue. Run level error reported reason: 'Instrumentation run failed due to 'Process crashed.''
|
| android.media.cts.VideoDecoderPerfTest#testHevcGoog1Perf0640x0360 |
fail
|
Test did not run due to instrumentation issue. Run level error reported reason: 'Instrumentation run failed due to 'Process crashed.''
|
| android.media.cts.VideoDecoderPerfTest#testHevcGoog1Perf0720x0480 |
fail
|
Test did not run due to instrumentation issue. Run level error reported reason: 'Instrumentation run failed due to 'Process crashed.''
|
| android.media.cts.VideoDecoderPerfTest#testHevcGoog1Perf3840x2160 |
fail
|
Test did not run due to instrumentation issue. Run level error reported reason: 'Instrumentation run failed due to 'Process crashed.''
|
| android.media.cts.VideoDecoderPerfTest#testHevcOther0Perf0640x0360 |
fail
|
Test did not run due to instrumentation issue. Run level error reported reason: 'Instrumentation run failed due to 'Process crashed.''
|
| android.media.cts.VideoDecoderPerfTest#testHevcOther0Perf0720x0480 |
fail
|
Test did not run due to instrumentation issue. Run level error reported reason: 'Instrumentation run failed due to 'Process crashed.''
|
| android.media.cts.VideoDecoderPerfTest#testHevcOther0Perf3840x2160 |
fail
|
Test did not run due to instrumentation issue. Run level error reported reason: 'Instrumentation run failed due to 'Process crashed.''
|
| android.media.cts.VideoDecoderPerfTest#testHevcOther3Perf1920x1080 |
fail
|
Test did not run due to instrumentation issue. Run level error reported reason: 'Instrumentation run failed due to 'Process crashed.''
|
| android.media.cts.VideoDecoderPerfTest#testMpeg4Goog0Perf0176x0144 |
fail
|
Test did not run due to instrumentation issue. Run level error reported reason: 'Instrumentation run failed due to 'Process crashed.''
|
| android.media.cts.VideoDecoderPerfTest#testMpeg4Goog0Perf0480x0360 |
fail
|
Test did not run due to instrumentation issue. Run level error reported reason: 'Instrumentation run failed due to 'Process crashed.''
|
| android.media.cts.VideoDecoderPerfTest#testMpeg4Goog1Perf1280x0720 |
fail
|
Test did not run due to instrumentation issue. Run level error reported reason: 'Instrumentation run failed due to 'Process crashed.''
|
| android.media.cts.VideoDecoderPerfTest#testVp8Goog1Perf0320x0180 |
fail
|
Test did not run due to instrumentation issue. Run level error reported reason: 'Instrumentation run failed due to 'Process crashed.''
|
| android.media.cts.VideoDecoderPerfTest#testVp8Other0Perf1920x1080 |
fail
|
Test did not run due to instrumentation issue. Run level error reported reason: 'Instrumentation run failed due to 'Process crashed.''
|
| android.media.cts.VideoDecoderPerfTest#testVp9Count1920x1080 |
fail
|
Test did not run due to instrumentation issue. Run level error reported reason: 'Instrumentation run failed due to 'Process crashed.''
|
| android.media.cts.VideoDecoderPerfTest#testVp9Other1Perf1920x1080 |
fail
|
Test did not run due to instrumentation issue. Run level error reported reason: 'Instrumentation run failed due to 'Process crashed.''
|
| android.media.cts.VideoDecoderPerfTest#testVp9Other3Perf0320x0180 |
fail
|
Test did not run due to instrumentation issue. Run level error reported reason: 'Instrumentation run failed due to 'Process crashed.''
|
| android.media.cts.VideoDecoderPerfTest#testVp9Other3Perf1280x0720 |
fail
|
Test did not run due to instrumentation issue. Run level error reported reason: 'Instrumentation run failed due to 'Process crashed.''
|
| android.media.cts.VideoEncoderTest#testGoogH263Flex360pWithIntraRefresh |
fail
|
Test did not run due to instrumentation issue. Run level error reported reason: 'Instrumentation run failed due to 'Process crashed.''
|
| android.media.cts.VideoEncoderTest#testGoogH263FlexMinMin |
fail
|
Test did not run due to instrumentation issue. Run level error reported reason: 'Instrumentation run failed due to 'Process crashed.''
|
| android.media.cts.VideoEncoderTest#testGoogH263FlexNearMaxMax |
fail
|
Test did not run due to instrumentation issue. Run level error reported reason: 'Instrumentation run failed due to 'Process crashed.''
|
| android.media.cts.VideoEncoderTest#testGoogH263SurfMaxMax |
fail
|
Test did not run due to instrumentation issue. Run level error reported reason: 'Instrumentation run failed due to 'Process crashed.''
|
| android.media.cts.VideoEncoderTest#testGoogH264Flex480p |
fail
|
Test did not run due to instrumentation issue. Run level error reported reason: 'Instrumentation run failed due to 'Process crashed.''
|
| android.media.cts.VideoEncoderTest#testGoogH264Flex720p |
fail
|
Test did not run due to instrumentation issue. Run level error reported reason: 'Instrumentation run failed due to 'Process crashed.''
|
| android.media.cts.VideoEncoderTest#testGoogH264FlexNearMaxMax |
fail
|
Test did not run due to instrumentation issue. Run level error reported reason: 'Instrumentation run failed due to 'Process crashed.''
|
| android.media.cts.VideoEncoderTest#testGoogH264FlexNearMaxMin |
fail
|
Test did not run due to instrumentation issue. Run level error reported reason: 'Instrumentation run failed due to 'Process crashed.''
|
| android.media.cts.VideoEncoderTest#testGoogH264SurfMinMax |
fail
|
Test did not run due to instrumentation issue. Run level error reported reason: 'Instrumentation run failed due to 'Process crashed.''
|
| android.media.cts.VideoEncoderTest#testGoogH265Flex1080p |
fail
|
Test did not run due to instrumentation issue. Run level error reported reason: 'Instrumentation run failed due to 'Process crashed.''
|
| android.media.cts.VideoEncoderTest#testGoogH265Flex360pWithIntraRefresh |
fail
|
Test did not run due to instrumentation issue. Run level error reported reason: 'Instrumentation run failed due to 'Process crashed.''
|
| android.media.cts.VideoEncoderTest#testGoogH265FlexArbitraryW |
fail
|
Test did not run due to instrumentation issue. Run level error reported reason: 'Instrumentation run failed due to 'Process crashed.''
|
| android.media.cts.VideoEncoderTest#testGoogH265FlexMaxMax |
fail
|
Test did not run due to instrumentation issue. Run level error reported reason: 'Instrumentation run failed due to 'Process crashed.''
|
| android.media.cts.VideoEncoderTest#testGoogH265FlexNearMaxMin |
fail
|
Test did not run due to instrumentation issue. Run level error reported reason: 'Instrumentation run failed due to 'Process crashed.''
|
| android.media.cts.VideoEncoderTest#testGoogH265Surf1080p |
fail
|
Test did not run due to instrumentation issue. Run level error reported reason: 'Instrumentation run failed due to 'Process crashed.''
|
| android.media.cts.VideoEncoderTest#testGoogH265Surf720p |
fail
|
Test did not run due to instrumentation issue. Run level error reported reason: 'Instrumentation run failed due to 'Process crashed.''
|
| android.media.cts.VideoEncoderTest#testGoogH265SurfMaxMin |
fail
|
Test did not run due to instrumentation issue. Run level error reported reason: 'Instrumentation run failed due to 'Process crashed.''
|
| android.media.cts.VideoEncoderTest#testGoogH265SurfNearMinMax |
fail
|
Test did not run due to instrumentation issue. Run level error reported reason: 'Instrumentation run failed due to 'Process crashed.''
|
| android.media.cts.VideoEncoderTest#testGoogMpeg4FlexArbitraryW |
fail
|
Test did not run due to instrumentation issue. Run level error reported reason: 'Instrumentation run failed due to 'Process crashed.''
|
| android.media.cts.VideoEncoderTest#testGoogMpeg4FlexMinMax |
fail
|
Test did not run due to instrumentation issue. Run level error reported reason: 'Instrumentation run failed due to 'Process crashed.''
|
| android.media.cts.VideoEncoderTest#testGoogMpeg4FlexNearMaxMin |
fail
|
Test did not run due to instrumentation issue. Run level error reported reason: 'Instrumentation run failed due to 'Process crashed.''
|
| android.media.cts.VideoEncoderTest#testGoogMpeg4SurfMinMax |
fail
|
Test did not run due to instrumentation issue. Run level error reported reason: 'Instrumentation run failed due to 'Process crashed.''
|
| android.media.cts.VideoEncoderTest#testGoogMpeg4SurfMinMin |
fail
|
Test did not run due to instrumentation issue. Run level error reported reason: 'Instrumentation run failed due to 'Process crashed.''
|
| android.media.cts.VideoEncoderTest#testGoogMpeg4SurfNearMinMax |
fail
|
Test did not run due to instrumentation issue. Run level error reported reason: 'Instrumentation run failed due to 'Process crashed.''
|
| android.media.cts.VideoEncoderTest#testGoogMpeg4SurfQCIF |
fail
|
Test did not run due to instrumentation issue. Run level error reported reason: 'Instrumentation run failed due to 'Process crashed.''
|
| android.media.cts.VideoEncoderTest#testGoogVP8Flex1080p |
fail
|
Test did not run due to instrumentation issue. Run level error reported reason: 'Instrumentation run failed due to 'Process crashed.''
|
| android.media.cts.VideoEncoderTest#testGoogVP8SurfArbitraryH |
fail
|
Test did not run due to instrumentation issue. Run level error reported reason: 'Instrumentation run failed due to 'Process crashed.''
|
| android.media.cts.VideoEncoderTest#testGoogVP8SurfNearMinMin |
fail
|
Test did not run due to instrumentation issue. Run level error reported reason: 'Instrumentation run failed due to 'Process crashed.''
|
| android.media.cts.VideoEncoderTest#testGoogVP9FlexMaxMax |
fail
|
Test did not run due to instrumentation issue. Run level error reported reason: 'Instrumentation run failed due to 'Process crashed.''
|
| android.media.cts.VideoEncoderTest#testGoogVP9SurfMaxMax |
fail
|
Test did not run due to instrumentation issue. Run level error reported reason: 'Instrumentation run failed due to 'Process crashed.''
|
| android.media.cts.VideoEncoderTest#testGoogVP9SurfMaxMin |
fail
|
Test did not run due to instrumentation issue. Run level error reported reason: 'Instrumentation run failed due to 'Process crashed.''
|
| android.media.cts.VideoEncoderTest#testOtherH263FlexMinMax |
fail
|
Test did not run due to instrumentation issue. Run level error reported reason: 'Instrumentation run failed due to 'Process crashed.''
|
| android.media.cts.VideoEncoderTest#testOtherH263FlexMinMin |
fail
|
Test did not run due to instrumentation issue. Run level error reported reason: 'Instrumentation run failed due to 'Process crashed.''
|
| android.media.cts.VideoEncoderTest#testOtherH263FlexNearMaxMax |
fail
|
Test did not run due to instrumentation issue. Run level error reported reason: 'Instrumentation run failed due to 'Process crashed.''
|
| android.media.cts.VideoEncoderTest#testOtherH264Flex720p |
fail
|
Test did not run due to instrumentation issue. Run level error reported reason: 'Instrumentation run failed due to 'Process crashed.''
|
| android.media.cts.VideoEncoderTest#testOtherH264FlexNearMaxMax |
fail
|
Test did not run due to instrumentation issue. Run level error reported reason: 'Instrumentation run failed due to 'Process crashed.''
|
| android.media.cts.VideoEncoderTest#testOtherH264FlexNearMaxMin |
fail
|
Test did not run due to instrumentation issue. Run level error reported reason: 'Instrumentation run failed due to 'Process crashed.''
|
| android.media.cts.VideoEncoderTest#testOtherH265Flex1080p |
fail
|
Test did not run due to instrumentation issue. Run level error reported reason: 'Instrumentation run failed due to 'Process crashed.''
|
| android.media.cts.VideoEncoderTest#testOtherH265FlexArbitraryW |
fail
|
Test did not run due to instrumentation issue. Run level error reported reason: 'Instrumentation run failed due to 'Process crashed.''
|
| android.media.cts.VideoEncoderTest#testOtherH265FlexNearMaxMin |
fail
|
Test did not run due to instrumentation issue. Run level error reported reason: 'Instrumentation run failed due to 'Process crashed.''
|
| android.media.cts.VideoEncoderTest#testOtherH265Surf1080p |
fail
|
Test did not run due to instrumentation issue. Run level error reported reason: 'Instrumentation run failed due to 'Process crashed.''
|
| android.media.cts.VideoEncoderTest#testOtherH265Surf720p |
fail
|
Test did not run due to instrumentation issue. Run level error reported reason: 'Instrumentation run failed due to 'Process crashed.''
|
| android.media.cts.VideoEncoderTest#testOtherH265SurfMaxMax |
fail
|
Test did not run due to instrumentation issue. Run level error reported reason: 'Instrumentation run failed due to 'Process crashed.''
|
| android.media.cts.VideoEncoderTest#testOtherH265SurfMaxMin |
fail
|
Test did not run due to instrumentation issue. Run level error reported reason: 'Instrumentation run failed due to 'Process crashed.''
|
| android.media.cts.VideoEncoderTest#testOtherH265SurfNearMinMax |
fail
|
Test did not run due to instrumentation issue. Run level error reported reason: 'Instrumentation run failed due to 'Process crashed.''
|
| android.media.cts.VideoEncoderTest#testOtherMpeg4Flex360pWithIntraRefresh |
fail
|
Test did not run due to instrumentation issue. Run level error reported reason: 'Instrumentation run failed due to 'Process crashed.''
|
| android.media.cts.VideoEncoderTest#testOtherMpeg4FlexArbitraryH |
fail
|
Test did not run due to instrumentation issue. Run level error reported reason: 'Instrumentation run failed due to 'Process crashed.''
|
| android.media.cts.VideoEncoderTest#testOtherMpeg4FlexMinMax |
fail
|
Test did not run due to instrumentation issue. Run level error reported reason: 'Instrumentation run failed due to 'Process crashed.''
|
| android.media.cts.VideoEncoderTest#testOtherMpeg4FlexNearMinMax |
fail
|
Test did not run due to instrumentation issue. Run level error reported reason: 'Instrumentation run failed due to 'Process crashed.''
|
| android.media.cts.VideoEncoderTest#testOtherMpeg4FlexNearMinMin |
fail
|
Test did not run due to instrumentation issue. Run level error reported reason: 'Instrumentation run failed due to 'Process crashed.''
|
| android.media.cts.VideoEncoderTest#testOtherMpeg4SurfArbitraryW |
fail
|
Test did not run due to instrumentation issue. Run level error reported reason: 'Instrumentation run failed due to 'Process crashed.''
|
| android.media.cts.VideoEncoderTest#testOtherMpeg4SurfMinMin |
fail
|
Test did not run due to instrumentation issue. Run level error reported reason: 'Instrumentation run failed due to 'Process crashed.''
|
| android.media.cts.VideoEncoderTest#testOtherMpeg4SurfNearMaxMin |
fail
|
Test did not run due to instrumentation issue. Run level error reported reason: 'Instrumentation run failed due to 'Process crashed.''
|
| android.media.cts.VideoEncoderTest#testOtherMpeg4SurfQCIF |
fail
|
Test did not run due to instrumentation issue. Run level error reported reason: 'Instrumentation run failed due to 'Process crashed.''
|
| android.media.cts.VideoEncoderTest#testOtherVP8Flex1080p |
fail
|
Test did not run due to instrumentation issue. Run level error reported reason: 'Instrumentation run failed due to 'Process crashed.''
|
| android.media.cts.VideoEncoderTest#testOtherVP8FlexNearMinMax |
fail
|
Test did not run due to instrumentation issue. Run level error reported reason: 'Instrumentation run failed due to 'Process crashed.''
|
| android.media.cts.VideoEncoderTest#testOtherVP8FlexQCIF |
fail
|
Test did not run due to instrumentation issue. Run level error reported reason: 'Instrumentation run failed due to 'Process crashed.''
|
| android.media.cts.VideoEncoderTest#testOtherVP8Surf1080p |
fail
|
Test did not run due to instrumentation issue. Run level error reported reason: 'Instrumentation run failed due to 'Process crashed.''
|
| android.media.cts.VideoEncoderTest#testOtherVP8SurfNearMaxMax |
fail
|
Test did not run due to instrumentation issue. Run level error reported reason: 'Instrumentation run failed due to 'Process crashed.''
|
| android.media.cts.VideoEncoderTest#testOtherVP9FlexArbitraryH |
fail
|
Test did not run due to instrumentation issue. Run level error reported reason: 'Instrumentation run failed due to 'Process crashed.''
|
| android.media.cts.VideoEncoderTest#testOtherVP9FlexMaxMax |
fail
|
Test did not run due to instrumentation issue. Run level error reported reason: 'Instrumentation run failed due to 'Process crashed.''
|
| android.media.cts.VideoEncoderTest#testOtherVP9FlexNearMinMax |
fail
|
Test did not run due to instrumentation issue. Run level error reported reason: 'Instrumentation run failed due to 'Process crashed.''
|
| android.media.cts.VideoEncoderTest#testOtherVP9FlexNearMinMin |
fail
|
Test did not run due to instrumentation issue. Run level error reported reason: 'Instrumentation run failed due to 'Process crashed.''
|
| android.media.cts.VideoEncoderTest#testOtherVP9SurfArbitraryW |
fail
|
Test did not run due to instrumentation issue. Run level error reported reason: 'Instrumentation run failed due to 'Process crashed.''
|
| android.media.cts.VideoEncoderTest#testOtherVP9SurfMaxMin |
fail
|
Test did not run due to instrumentation issue. Run level error reported reason: 'Instrumentation run failed due to 'Process crashed.''
|
| android.media.cts.VideoEncoderTest#testOtherVP9SurfNearMaxMin |
fail
|
Test did not run due to instrumentation issue. Run level error reported reason: 'Instrumentation run failed due to 'Process crashed.''
|
| android.media.cts.VideoEncoderTest#testOtherVP9SurfQCIF |
fail
|
Test did not run due to instrumentation issue. Run level error reported reason: 'Instrumentation run failed due to 'Process crashed.''
|
| android.media.cts.VideoEncoderTest#testVP8Surf180p30fps800kbps |
fail
|
Test did not run due to instrumentation issue. Run level error reported reason: 'Instrumentation run failed due to 'Process crashed.''
|
| android.media.cts.VirtualizerTest#test1_0Strength |
fail
|
Test did not run due to instrumentation issue. Run level error reported reason: 'Instrumentation run failed due to 'Process crashed.''
|
| android.media.cts.VirtualizerTest#test2_0SetEnabledGetEnabled |
fail
|
Test did not run due to instrumentation issue. Run level error reported reason: 'Instrumentation run failed due to 'Process crashed.''
|
| android.media.cts.VisualizerTest#test2_0PollingCapture |
fail
|
Test did not run due to instrumentation issue. Run level error reported reason: 'Instrumentation run failed due to 'Process crashed.''
|
| android.media.cts.VolumeShaperTest#testVolumeShaperConfigurationBuilder |
fail
|
Test did not run due to instrumentation issue. Run level error reported reason: 'Instrumentation run failed due to 'Process crashed.''
|
| android.media.cts.MediaBrowserServiceTest#testDelayedNotifyChildrenChanged |
fail
|
Test did not run due to instrumentation issue. Run level error reported reason: 'Instrumentation run failed due to 'Process crashed.''
|
| android.media.cts.MediaBrowserServiceTest#testGetBrowserInfo |
fail
|
Test did not run due to instrumentation issue. Run level error reported reason: 'Instrumentation run failed due to 'Process crashed.''
|
| android.media.cts.MediaBrowserServiceTest#testGetSessionToken |
fail
|
Test did not run due to instrumentation issue. Run level error reported reason: 'Instrumentation run failed due to 'Process crashed.''
|
| android.media.cts.MediaBrowserServiceTest#testNotifyChildrenChanged |
fail
|
Test did not run due to instrumentation issue. Run level error reported reason: 'Instrumentation run failed due to 'Process crashed.''
|
| android.media.cts.MediaCodecBlockModelTest#testEncodeShortVideo |
fail
|
Test did not run due to instrumentation issue. Run level error reported reason: 'Instrumentation run failed due to 'Process crashed.''
|
| android.media.cts.MediaDrmTest#testSupportedCryptoSchemes |
fail
|
Test did not run due to instrumentation issue. Run level error reported reason: 'Instrumentation run failed due to 'Process crashed.''
|
| android.media.cts.MediaDrmTest#testRequiresSecureDecoder |
fail
|
Test did not run due to instrumentation issue. Run level error reported reason: 'Instrumentation run failed due to 'Process crashed.''
|
| android.media.cts.RingtoneTest#testPlaybackProperties |
fail
|
Test did not run due to instrumentation issue. Run level error reported reason: 'Instrumentation run failed due to 'Process crashed.''
|
| android.media.cts.ThumbnailUtilsTest#testCreateImageThumbnail |
fail
|
Test did not run due to instrumentation issue. Run level error reported reason: 'Instrumentation run failed due to 'Process crashed.''
|
| android.media.cts.ThumbnailUtilsTest#testCreateImageThumbnail_strippedSample[0] |
fail
|
Test did not run due to instrumentation issue. Run level error reported reason: 'Instrumentation run failed due to 'Process crashed.''
|
| android.media.cts.ThumbnailUtilsTest#testCreateImageThumbnail_strippedSample[1] |
fail
|
Test did not run due to instrumentation issue. Run level error reported reason: 'Instrumentation run failed due to 'Process crashed.''
|
| android.media.cts.ThumbnailUtilsTest#testCreateImageThumbnail_strippedSample[2] |
fail
|
Test did not run due to instrumentation issue. Run level error reported reason: 'Instrumentation run failed due to 'Process crashed.''
|
| android.media.cts.ThumbnailUtilsTest#testCreateImageThumbnail_strippedSample[3] |
fail
|
Test did not run due to instrumentation issue. Run level error reported reason: 'Instrumentation run failed due to 'Process crashed.''
|
| android.media.cts.ThumbnailUtilsTest#testCreateImageThumbnail_sampleWithThumbnail[0] |
fail
|
Test did not run due to instrumentation issue. Run level error reported reason: 'Instrumentation run failed due to 'Process crashed.''
|
| android.media.cts.ThumbnailUtilsTest#testCreateImageThumbnail_sampleWithThumbnail[1] |
fail
|
Test did not run due to instrumentation issue. Run level error reported reason: 'Instrumentation run failed due to 'Process crashed.''
|
| android.media.cts.ThumbnailUtilsTest#testCreateImageThumbnail_sampleWithThumbnail[2] |
fail
|
Test did not run due to instrumentation issue. Run level error reported reason: 'Instrumentation run failed due to 'Process crashed.''
|
| android.media.cts.ThumbnailUtilsTest#testCreateImageThumbnail_sampleWithThumbnail[3] |
fail
|
Test did not run due to instrumentation issue. Run level error reported reason: 'Instrumentation run failed due to 'Process crashed.''
|
| android.media.cts.ThumbnailUtilsTest#testCreateImageThumbnailAvif |
fail
|
Test did not run due to instrumentation issue. Run level error reported reason: 'Instrumentation run failed due to 'Process crashed.''
|
| android.media.cts.TimedMetaDataTest#testTimedMetaData |
fail
|
Test did not run due to instrumentation issue. Run level error reported reason: 'Instrumentation run failed due to 'Process crashed.''
|
| android.media.cts.MediaSyncTest#testAudioBufferReturn |
fail
|
Test did not run due to instrumentation issue. Run level error reported reason: 'Instrumentation run failed due to 'Process crashed.''
|
| android.media.cts.MediaSyncTest#testPlayAudio |
fail
|
Test did not run due to instrumentation issue. Run level error reported reason: 'Instrumentation run failed due to 'Process crashed.''
|
| android.media.cts.MediaSyncTest#testPlayAudioAndVideo |
fail
|
Test did not run due to instrumentation issue. Run level error reported reason: 'Instrumentation run failed due to 'Process crashed.''
|
| android.media.cts.MediaSyncTest#testPlaybackRateHalf |
fail
|
Test did not run due to instrumentation issue. Run level error reported reason: 'Instrumentation run failed due to 'Process crashed.''
|
| android.media.cts.MediaSyncTest#testSetPlaybackParamsSucceed |
fail
|
Test did not run due to instrumentation issue. Run level error reported reason: 'Instrumentation run failed due to 'Process crashed.''
|
| android.media.cts.MediaPlayerSurfaceTest#testSetSurface |
fail
|
Test did not run due to instrumentation issue. Run level error reported reason: 'Instrumentation run failed due to 'Process crashed.''
|
| android.media.cts.MediaTimestampTest#testMediaTimestamp |
fail
|
Test did not run due to instrumentation issue. Run level error reported reason: 'Instrumentation run failed due to 'Process crashed.''
|
| android.media.cts.VideoDecoderRotationTest#testRendering800x480Rotated[OMX.amlogic.vp9.decoder.awesome2:video/x-vnd.on2.vp9:90] |
fail
|
Test did not run due to instrumentation issue. Run level error reported reason: 'Instrumentation run failed due to 'Process crashed.''
|
| android.media.cts.VideoDecoderRotationTest#testRendering800x480Rotated[OMX.amlogic.vp9.decoder.awesome2:video/x-vnd.on2.vp9:180] |
fail
|
Test did not run due to instrumentation issue. Run level error reported reason: 'Instrumentation run failed due to 'Process crashed.''
|
| android.media.cts.VideoDecoderRotationTest#testRendering800x480Rotated[OMX.amlogic.vp9.decoder.awesome2:video/x-vnd.on2.vp9:270] |
fail
|
Test did not run due to instrumentation issue. Run level error reported reason: 'Instrumentation run failed due to 'Process crashed.''
|
| android.media.cts.VideoDecoderRotationTest#testRendering800x480Rotated[OMX.amlogic.vp9.decoder.awesome2:video/x-vnd.on2.vp9:360] |
fail
|
Test did not run due to instrumentation issue. Run level error reported reason: 'Instrumentation run failed due to 'Process crashed.''
|
| android.media.cts.VideoDecoderRotationTest#testRendering800x480Rotated[OMX.amlogic.avc.decoder.awesome2:video/avc:90] |
fail
|
Test did not run due to instrumentation issue. Run level error reported reason: 'Instrumentation run failed due to 'Process crashed.''
|
| android.media.cts.VideoDecoderRotationTest#testRendering800x480Rotated[OMX.amlogic.avc.decoder.awesome2:video/avc:180] |
fail
|
Test did not run due to instrumentation issue. Run level error reported reason: 'Instrumentation run failed due to 'Process crashed.''
|
| android.media.cts.VideoDecoderRotationTest#testRendering800x480Rotated[OMX.amlogic.avc.decoder.awesome2:video/avc:270] |
fail
|
Test did not run due to instrumentation issue. Run level error reported reason: 'Instrumentation run failed due to 'Process crashed.''
|
| android.media.cts.VideoDecoderRotationTest#testRendering800x480Rotated[OMX.amlogic.avc.decoder.awesome2:video/avc:360] |
fail
|
Test did not run due to instrumentation issue. Run level error reported reason: 'Instrumentation run failed due to 'Process crashed.''
|
| android.media.cts.VideoDecoderRotationTest#testRendering800x480Rotated[OMX.amlogic.hevc.decoder.awesome2:video/hevc:90] |
fail
|
Test did not run due to instrumentation issue. Run level error reported reason: 'Instrumentation run failed due to 'Process crashed.''
|
| android.media.cts.VideoDecoderRotationTest#testRendering800x480Rotated[OMX.amlogic.hevc.decoder.awesome2:video/hevc:180] |
fail
|
Test did not run due to instrumentation issue. Run level error reported reason: 'Instrumentation run failed due to 'Process crashed.''
|
| android.media.cts.VideoDecoderRotationTest#testRendering800x480Rotated[OMX.amlogic.hevc.decoder.awesome2:video/hevc:270] |
fail
|
Test did not run due to instrumentation issue. Run level error reported reason: 'Instrumentation run failed due to 'Process crashed.''
|
| android.media.cts.VideoDecoderRotationTest#testRendering800x480Rotated[OMX.amlogic.hevc.decoder.awesome2:video/hevc:360] |
fail
|
Test did not run due to instrumentation issue. Run level error reported reason: 'Instrumentation run failed due to 'Process crashed.''
|
| android.media.cts.VideoDecoderRotationTest#testRendering800x480Rotated[c2.android.avc.decoder:video/avc:90] |
fail
|
Test did not run due to instrumentation issue. Run level error reported reason: 'Instrumentation run failed due to 'Process crashed.''
|
| android.media.cts.VideoDecoderRotationTest#testRendering800x480Rotated[c2.android.avc.decoder:video/avc:180] |
fail
|
Test did not run due to instrumentation issue. Run level error reported reason: 'Instrumentation run failed due to 'Process crashed.''
|
| android.media.cts.VideoDecoderRotationTest#testRendering800x480Rotated[c2.android.avc.decoder:video/avc:270] |
fail
|
Test did not run due to instrumentation issue. Run level error reported reason: 'Instrumentation run failed due to 'Process crashed.''
|
| android.media.cts.VideoDecoderRotationTest#testRendering800x480Rotated[c2.android.avc.decoder:video/avc:360] |
fail
|
Test did not run due to instrumentation issue. Run level error reported reason: 'Instrumentation run failed due to 'Process crashed.''
|
| android.media.cts.VideoDecoderRotationTest#testRendering800x480Rotated[c2.android.hevc.decoder:video/hevc:90] |
fail
|
Test did not run due to instrumentation issue. Run level error reported reason: 'Instrumentation run failed due to 'Process crashed.''
|
| android.media.cts.VideoDecoderRotationTest#testRendering800x480Rotated[c2.android.hevc.decoder:video/hevc:180] |
fail
|
Test did not run due to instrumentation issue. Run level error reported reason: 'Instrumentation run failed due to 'Process crashed.''
|
| android.media.cts.VideoDecoderRotationTest#testRendering800x480Rotated[c2.android.hevc.decoder:video/hevc:270] |
fail
|
Test did not run due to instrumentation issue. Run level error reported reason: 'Instrumentation run failed due to 'Process crashed.''
|
| android.media.cts.VideoDecoderRotationTest#testRendering800x480Rotated[c2.android.hevc.decoder:video/hevc:360] |
fail
|
Test did not run due to instrumentation issue. Run level error reported reason: 'Instrumentation run failed due to 'Process crashed.''
|
| android.media.cts.VideoDecoderRotationTest#testRendering800x480Rotated[c2.android.vp8.decoder:video/x-vnd.on2.vp8:90] |
fail
|
Test did not run due to instrumentation issue. Run level error reported reason: 'Instrumentation run failed due to 'Process crashed.''
|
| android.media.cts.VideoDecoderRotationTest#testRendering800x480Rotated[c2.android.vp8.decoder:video/x-vnd.on2.vp8:180] |
fail
|
Test did not run due to instrumentation issue. Run level error reported reason: 'Instrumentation run failed due to 'Process crashed.''
|
| android.media.cts.VideoDecoderRotationTest#testRendering800x480Rotated[c2.android.vp8.decoder:video/x-vnd.on2.vp8:270] |
fail
|
Test did not run due to instrumentation issue. Run level error reported reason: 'Instrumentation run failed due to 'Process crashed.''
|
| android.media.cts.VideoDecoderRotationTest#testRendering800x480Rotated[c2.android.vp8.decoder:video/x-vnd.on2.vp8:360] |
fail
|
Test did not run due to instrumentation issue. Run level error reported reason: 'Instrumentation run failed due to 'Process crashed.''
|
| android.media.cts.VideoDecoderRotationTest#testRendering800x480Rotated[c2.android.vp9.decoder:video/x-vnd.on2.vp9:90] |
fail
|
Test did not run due to instrumentation issue. Run level error reported reason: 'Instrumentation run failed due to 'Process crashed.''
|
| android.media.cts.VideoDecoderRotationTest#testRendering800x480Rotated[c2.android.vp9.decoder:video/x-vnd.on2.vp9:180] |
fail
|
Test did not run due to instrumentation issue. Run level error reported reason: 'Instrumentation run failed due to 'Process crashed.''
|
| android.media.cts.VideoDecoderRotationTest#testRendering800x480Rotated[c2.android.vp9.decoder:video/x-vnd.on2.vp9:270] |
fail
|
Test did not run due to instrumentation issue. Run level error reported reason: 'Instrumentation run failed due to 'Process crashed.''
|
| android.media.cts.VideoDecoderRotationTest#testRendering800x480Rotated[c2.android.vp9.decoder:video/x-vnd.on2.vp9:360] |
fail
|
Test did not run due to instrumentation issue. Run level error reported reason: 'Instrumentation run failed due to 'Process crashed.''
|
| armeabi-v7a CtsWindowManagerDeviceTestCases | ||
| Test | Result | Details |
|---|---|---|
| android.server.wm.ActivityMetricsLoggerTests#testAppLaunchIsLogged |
fail
|
java.lang.AssertionError: transition should be started because of starting window expected:<1> but was:<2>
|
| android.server.wm.ActivityMetricsLoggerTests#testLaunchOfVisibleApp |
fail
|
java.lang.AssertionError: transition should be started because of starting window expected:<1> but was:<2>
|
| android.server.wm.ActivityMetricsLoggerTests#testNoDisplayActivityLaunch |
fail
|
java.lang.AssertionError: transition should be started because of starting window expected:<1> but was:<2>
|
| android.server.wm.SplashscreenTests#testSetBackgroundColorActivity |
fail
|
java.lang.NullPointerException: Attempt to invoke virtual method 'android.graphics.Rect android.server.wm.WindowManagerState$WindowState.getBounds()' on a null object reference
|
| android.server.wm.SplashscreenTests#testShortcutChangeTheme |
fail
|
java.lang.NullPointerException: Attempt to invoke virtual method 'android.graphics.Rect android.server.wm.WindowManagerState$WindowState.getBounds()' on a null object reference
|
| android.server.wm.SplashscreenTests#testSplashscreenContent |
fail
|
java.lang.NullPointerException: Attempt to invoke virtual method 'android.graphics.Rect android.server.wm.WindowManagerState$WindowState.getBounds()' on a null object reference
|
| Incomplete Modules |
|---|
| armeabi-v7a CtsMediaTestCases |