TEXT: 
============================================
================= Results ==================
=============== Consumed Time ==============
    armeabi-v7a TvtsAppStartTimesHostTestCases: 2h 12m 9s
    armeabi-v7a TvtsJankHostTestCases: 1h 55m 29s
    armeabi-v7a AssistantLatencyTestBench: 1h 43m 51s
    armeabi-v7a TvtsBootToBootCompletedHostTestCases: 1h 6m 45s
    armeabi-v7a TvtsMemoryScoreNewVideoTestCases: 50m 29s
    armeabi-v7a AssistantPluginHandler: 42m 54s
    armeabi-v7a TvtsMemoryScoreTestCases: 27m 45s
    armeabi-v7a TvtsAssistant4TestCases: 24m 15s
    armeabi-v7a TvtsYouTubeTS: 8m 50s
    armeabi-v7a TvtsHomeJankCujHostTestCases: 6m 15s
    armeabi-v7a TvtsMediaLaunchTimesHostTestCases: 2m 57s
    armeabi-v7a TvtsReportTestCases: 2m 33s
    armeabi-v7a CtsEdiHostTestCases: 1m 55s
    armeabi-v7a TvtsRvisTestCases: 22s
    armeabi-v7a TvtsPerfCujTestCases: 20s
    armeabi-v7a TvtsPiaHostTestCases: 12s
    armeabi-v7a TvtsAttestationTestCases: 12s
    armeabi-v7a GtvLauncherXLaunchStateHostTestCases: 5s
    armeabi-v7a TvtsApkTestCases: 3s
    armeabi-v7a GtvScorecardHostTestCases: 2s
    armeabi-v7a GtvScorecardMediaPlaybackErrorTestCases: 2s
    armeabi-v7a GtvLmkCujHostTestCases: 1s
    armeabi-v7a GtvComplianceTestCases: 1s
    armeabi-v7a TvtsHdmiHostTestCases: 1s
    armeabi-v7a TvtsCpuHostTestCases: 1s
    armeabi-v7a GtvScorecardVideoRenderedQualityTestCases: 1s
    armeabi-v7a GtvScorecardMediaBriefPlaybackTestCases: 1s
    armeabi-v7a TvtsSmokeTestCases: 967 ms
    armeabi-v7a GtvAttestationHostTestCases: 862 ms
    armeabi-v7a TvtsDefaultSettingsTestCases: 704 ms
    armeabi-v7a TvtsProvisioningHostTestCases: 557 ms
    armeabi-v7a TvConcurrentMediaPlaybackHostTestCases: 0 ms
Total aggregated tests run time: 9h 47m 46s
============== TOP 18 Slow Modules ==============
    armeabi-v7a AssistantLatencyTestBench: 0.00 tests/sec [1 tests / 6231643 msec]
    armeabi-v7a TvtsBootToBootCompletedHostTestCases: 0.00 tests/sec [1 tests / 4005427 msec]
    armeabi-v7a TvtsMemoryScoreNewVideoTestCases: 0.00 tests/sec [1 tests / 3029668 msec]
    armeabi-v7a TvtsAppStartTimesHostTestCases: 0.00 tests/sec [3 tests / 7929494 msec]
    armeabi-v7a TvtsJankHostTestCases: 0.00 tests/sec [3 tests / 6929997 msec]
    armeabi-v7a TvtsMemoryScoreTestCases: 0.00 tests/sec [1 tests / 1665443 msec]
    armeabi-v7a AssistantPluginHandler: 0.00 tests/sec [2 tests / 2574478 msec]
    armeabi-v7a TvtsAssistant4TestCases: 0.00 tests/sec [6 tests / 1455548 msec]
    armeabi-v7a TvtsHomeJankCujHostTestCases: 0.01 tests/sec [2 tests / 375741 msec]
    armeabi-v7a TvtsReportTestCases: 0.01 tests/sec [1 tests / 153109 msec]
    armeabi-v7a TvtsMediaLaunchTimesHostTestCases: 0.01 tests/sec [2 tests / 177370 msec]
    armeabi-v7a CtsEdiHostTestCases: 0.04 tests/sec [5 tests / 115692 msec]
    armeabi-v7a TvtsPerfCujTestCases: 0.05 tests/sec [1 tests / 20799 msec]
    armeabi-v7a TvtsAttestationTestCases: 0.16 tests/sec [2 tests / 12375 msec]
    armeabi-v7a TvtsPiaHostTestCases: 0.24 tests/sec [3 tests / 12547 msec]
    armeabi-v7a TvtsRvisTestCases: 0.36 tests/sec [8 tests / 22276 msec]
    armeabi-v7a GtvLauncherXLaunchStateHostTestCases: 0.99 tests/sec [5 tests / 5039 msec]
    armeabi-v7a TvtsYouTubeTS: 2.14 tests/sec [1136 tests / 530180 msec]
============== Modules Preparation Times ==============
    armeabi-v7a TvtsMemoryScoreNewVideoTestCases => prep = 7001 ms || clean = 1490 ms
    armeabi-v7a TvtsMediaLaunchTimesHostTestCases => prep = 66297 ms || clean = 1156 ms
    armeabi-v7a GtvScorecardVideoRenderedQualityTestCases => prep = 24468 ms || clean = 318 ms
    armeabi-v7a GtvScorecardHostTestCases => prep = 0 ms || clean = 316 ms
    armeabi-v7a TvtsAttestationTestCases => prep = 7077 ms || clean = 1051 ms
    armeabi-v7a TvtsPiaHostTestCases => prep = 5872 ms || clean = 1035 ms
    armeabi-v7a GtvScorecardMediaBriefPlaybackTestCases => prep = 73109 ms || clean = 317 ms
    armeabi-v7a TvtsBootToBootCompletedHostTestCases => prep = 0 ms || clean = 355 ms
    armeabi-v7a GtvScorecardMediaPlaybackErrorTestCases => prep = 6624 ms || clean = 1182 ms
    armeabi-v7a AssistantPluginHandler => prep = 0 ms || clean = 382 ms
    armeabi-v7a TvtsAssistant4TestCases => prep = 61424 ms || clean = 3646 ms
    armeabi-v7a GtvLauncherXLaunchStateHostTestCases => prep = 91459 ms || clean = 2083 ms
    armeabi-v7a TvtsMemoryScoreTestCases => prep = 11918 ms || clean = 2913 ms
    armeabi-v7a TvtsPerfCujTestCases => prep = 3707 ms || clean = 1309 ms
    armeabi-v7a TvtsRvisTestCases => prep = 8531 ms || clean = 4766 ms
    armeabi-v7a TvtsYouTubeTS => prep = 0 ms || clean = 702 ms
    armeabi-v7a TvtsProvisioningHostTestCases => prep = 0 ms || clean = 316 ms
    armeabi-v7a GtvComplianceTestCases => prep = 0 ms || clean = 316 ms
    armeabi-v7a TvtsSmokeTestCases => prep = 0 ms || clean = 358 ms
    armeabi-v7a TvtsReportTestCases => prep = 0 ms || clean = 383 ms
    armeabi-v7a TvtsHdmiHostTestCases => prep = 3879 ms || clean = 1072 ms
    armeabi-v7a GtvAttestationHostTestCases => prep = 0 ms || clean = 316 ms
    armeabi-v7a TvtsApkTestCases => prep = 1205 ms || clean = 1006 ms
    armeabi-v7a TvtsCpuHostTestCases => prep = 64 ms || clean = 599 ms
    armeabi-v7a TvtsDefaultSettingsTestCases => prep = 0 ms || clean = 326 ms
    armeabi-v7a CtsEdiHostTestCases => prep = 0 ms || clean = 316 ms
    armeabi-v7a GtvLmkCujHostTestCases => prep = 0 ms || clean = 317 ms
    armeabi-v7a TvtsAppStartTimesHostTestCases => prep = 82438 ms || clean = 1244 ms
    armeabi-v7a TvtsJankHostTestCases => prep = 15463 ms || clean = 3033 ms
    armeabi-v7a AssistantLatencyTestBench => prep = 0 ms || clean = 378 ms
    armeabi-v7a TvtsHomeJankCujHostTestCases => prep = 0 ms || clean = 319 ms
Total preparation time: 7m 50s  ||  Total tear down time: 33s
=======================================================
=============== Summary ===============
Total Run time: 3m 11s
31/32 modules completed
Module(s) with run failure(s):
    armeabi-v7a TvConcurrentMediaPlaybackHostTestCases: com.android.tradefed.targetprep.TargetSetupError[APK_INSTALLATION_FAILED|520001|DEPENDENCY_ISSUE]: Failed to install android.tvconcurrent.cts with [/data/tmp/8771c0e6-0e08-4aeb-977a-d2e4ddec3b6a/android-tvts/testcases/CtsTVConcurrentPlaybackTestCases.apk] on SKBFXYZO0DTQ. Reason: 'INSTALL_FAILED_OLDER_SDK: Failed parse during installPackageLI: /data/app/vmdl1686353332.tmp/base.apk (at Binary XML file line #38): Requires newer sdk version #31 (current version is #29)' [SKBFXYZO0DTQ bfx-at100:bfx-at100 QTT5.200429.010]
	at com.android.tradefed.targetprep.TestAppInstallSetup.installSinglePackage(TestAppInstallSetup.java:561)
	at com.android.tradefed.targetprep.TestAppInstallSetup.installer(TestAppInstallSetup.java:528)
	at com.android.tradefed.targetprep.TestAppInstallSetup.setUp(TestAppInstallSetup.java:416)
	at com.android.tradefed.testtype.suite.ModuleDefinition.runPreparerSetup(ModuleDefinition.java:1026)
	at com.android.tradefed.testtype.suite.ModuleDefinition.runTargetPreparation(ModuleDefinition.java:1496)
	at com.android.tradefed.testtype.suite.ModuleDefinition.runPreparation(ModuleDefinition.java:985)
	at com.android.tradefed.testtype.suite.ModuleDefinition.run(ModuleDefinition.java:492)
	at com.android.tradefed.testtype.suite.ITestSuite.runSingleModule(ITestSuite.java:1031)
	at com.android.tradefed.testtype.suite.ITestSuite.run(ITestSuite.java:867)
	at com.android.tradefed.invoker.shard.TestsPoolPoller.run(TestsPoolPoller.java:162)
	at com.android.tradefed.invoker.InvocationExecution.runTest(InvocationExecution.java:1443)
	at com.android.tradefed.invoker.InvocationExecution.runTests(InvocationExecution.java:1218)
	at com.android.tradefed.invoker.TestInvocation.prepareAndRun(TestInvocation.java:629)
	at com.android.tradefed.invoker.TestInvocation.performInvocation(TestInvocation.java:286)
	at com.android.tradefed.invoker.TestInvocation.invoke(TestInvocation.java:1418)
	at com.android.tradefed.command.CommandScheduler$InvocationThread.run(CommandScheduler.java:689)

Total Tests       : 1204
PASSED            : 41
FAILED            : 2
ASSUMPTION_FAILURE: 1160
IMPORTANT: Some modules failed to run to completion, tests counts may be inaccurate.
Shard 0 used: [SKBFXYZO0C1V]
Shard 1 used: [SKBFXYZO0DTQ]
============== End of Results ==============
============================================
