![]() |
| Summary | |
|---|---|
| Suite / Plan | VTS / cts-on-gsi |
| Suite / Build | 10_r16 / 9929990 |
| Host Info | Result/@start 800914-nb-4 (Linux - 4.15.0-212-generic) |
| Start time / End Time | Sat Jun 17 09:06:08 CST 2023 / Sat Jun 17 10:00:43 CST 2023 |
| Tests Passed | 89370 |
| Tests Failed | 68 |
| Modules Done | 342 |
| Modules Total | 344 |
| Fingerprint | SKB/BFX_AT100/BFX-AT100:10/QTT5.200429.010/15.536.60-20230615:user/release-keys |
| Security Patch | 2023-02-01 |
| Release (SDK) | 10 (29) |
| ABIs | armeabi-v7a,armeabi |
| Module | Passed | Failed | Assumption Failure | Ignored | Total Tests | Done |
|---|---|---|---|---|---|---|
| armeabi-v7a CtsAbiOverrideHostTestCases | 1 | 0 | 0 | 0 | 1 | true |
| armeabi-v7a CtsAccelerationTestCases | 6 | 0 | 0 | 0 | 6 | true |
| armeabi-v7a CtsAccessibilityServiceTestCases | 0 | 0 | 0 | 0 | 0 | true |
| armeabi-v7a CtsAccessibilityTestCases | 48 | 0 | 0 | 0 | 48 | true |
| armeabi-v7a CtsAccountManagerTestCases | 151 | 0 | 0 | 0 | 151 | true |
| armeabi-v7a CtsActivityManagerBackgroundActivityTestCases | 15 | 0 | 0 | 1 | 16 | true |
| armeabi-v7a CtsAdminPackageInstallerTestCases | 6 | 0 | 0 | 0 | 6 | true |
| armeabi-v7a CtsAdminTestCases | 92 | 0 | 0 | 0 | 92 | true |
| armeabi-v7a CtsAlarmManagerTestCases | 15 | 0 | 0 | 0 | 15 | true |
| armeabi-v7a CtsAndroidAppTestCases | 5 | 0 | 0 | 0 | 5 | true |
| armeabi-v7a CtsAndroidTestBase28ApiSignatureTestCases | 1 | 0 | 0 | 0 | 1 | true |
| armeabi-v7a CtsAndroidTestBaseCurrentApiSignatureTestCases | 1 | 0 | 0 | 0 | 1 | true |
| armeabi-v7a CtsAndroidTestMockCurrentApiSignatureTestCases | 1 | 0 | 0 | 0 | 1 | true |
| armeabi-v7a CtsAndroidTestRunnerCurrentApiSignatureTestCases | 1 | 0 | 0 | 0 | 1 | true |
| armeabi-v7a CtsAngleIntegrationHostTestCases | 0 | 0 | 17 | 0 | 17 | true |
| armeabi-v7a CtsAnimationTestCases | 145 | 0 | 0 | 0 | 145 | true |
| armeabi-v7a CtsApacheHttpLegacy27ApiSignatureTestCases | 1 | 0 | 0 | 0 | 1 | true |
| armeabi-v7a CtsApacheHttpLegacyCurrentApiSignatureTestCases | 1 | 0 | 0 | 0 | 1 | true |
| armeabi-v7a CtsApacheHttpLegacyUsesLibraryApiSignatureTestCases | 1 | 0 | 0 | 0 | 1 | true |
| armeabi-v7a CtsAppBindingHostTestCases | 14 | 0 | 0 | 0 | 14 | true |
| armeabi-v7a CtsAppComponentFactoryTestCases | 4 | 0 | 0 | 0 | 4 | true |
| armeabi-v7a CtsAppOpsTestCases | 11 | 0 | 0 | 6 | 17 | true |
| armeabi-v7a CtsAppSecurityHostTestCases | 337 | 0 | 2 | 0 | 339 | true |
| armeabi-v7a CtsAppTestCases | 674 | 1 | 0 | 0 | 675 | true |
| armeabi-v7a CtsAppUsageHostTestCases | 5 | 0 | 0 | 0 | 5 | true |
| armeabi-v7a CtsAppWidgetTestCases | 40 | 0 | 0 | 0 | 40 | true |
| armeabi-v7a CtsAslrMallocTestCases | 1 | 0 | 0 | 0 | 1 | true |
| armeabi-v7a CtsAssistTestCases | 16 | 0 | 0 | 0 | 16 | true |
| armeabi-v7a CtsAtomicInstallTestCases | 5 | 0 | 0 | 0 | 5 | true |
| armeabi-v7a CtsAtraceHostTestCases | 8 | 0 | 0 | 0 | 8 | true |
| armeabi-v7a CtsBackgroundRestrictionsTestCases | 2 | 0 | 0 | 0 | 2 | true |
| armeabi-v7a CtsBackupHostTestCases | 23 | 0 | 16 | 0 | 39 | true |
| armeabi-v7a CtsBackupTestCases | 21 | 0 | 0 | 0 | 21 | true |
| armeabi-v7a CtsBatterySavingTestCases | 0 | 0 | 11 | 0 | 11 | true |
| armeabi-v7a CtsBionicTestCases | 2839 | 0 | 0 | 16 | 2855 | true |
| armeabi-v7a CtsBluetoothTestCases | 50 | 0 | 0 | 0 | 50 | true |
| armeabi-v7a CtsBootStatsTestCases | 1 | 0 | 0 | 0 | 1 | true |
| armeabi-v7a CtsCalendarcommon2TestCases | 1 | 0 | 0 | 0 | 1 | true |
| armeabi-v7a CtsCameraApi25TestCases | 1 | 0 | 0 | 0 | 1 | true |
| armeabi-v7a CtsCameraTestCases | 287 | 0 | 0 | 0 | 287 | true |
| armeabi-v7a CtsCarTestCases | 0 | 0 | 0 | 12 | 12 | true |
| armeabi-v7a CtsCarrierApiTestCases | 33 | 0 | 0 | 0 | 33 | true |
| armeabi-v7a CtsClassLoaderFactoryInMemoryDexClassLoaderTestCases | 2 | 0 | 0 | 0 | 2 | true |
| armeabi-v7a CtsClassLoaderFactoryPathClassLoaderTestCases | 2 | 0 | 0 | 0 | 2 | true |
| armeabi-v7a CtsClassloaderSplitsHostTestCases | 4 | 0 | 0 | 0 | 4 | true |
| armeabi-v7a CtsColorModeTestCases | 3 | 0 | 0 | 0 | 3 | true |
| armeabi-v7a CtsCompilationTestCases | 0 | 0 | 0 | 0 | 0 | true |
| armeabi-v7a CtsContactsProviderWipe | 3 | 0 | 0 | 0 | 3 | true |
| armeabi-v7a CtsContentTestCases | 950 | 0 | 4 | 7 | 961 | true |
| armeabi-v7a CtsCppToolsTestCases | 2 | 0 | 0 | 0 | 2 | true |
| armeabi-v7a CtsCurrentApiSignatureTestCases | 1 | 0 | 0 | 0 | 1 | true |
| armeabi-v7a CtsDatabaseTestCases | 277 | 0 | 0 | 0 | 277 | true |
| armeabi-v7a CtsDeqpTestCases | 3750 | 0 | 0 | 0 | 3750 | true |
| armeabi-v7a CtsDeviceConfigTestCases | 56 | 0 | 0 | 0 | 56 | true |
| armeabi-v7a CtsDeviceIdleHostTestCases | 2 | 0 | 0 | 0 | 2 | true |
| armeabi-v7a CtsDisplayTestCases | 22 | 0 | 0 | 0 | 22 | true |
| armeabi-v7a CtsDownloadManagerApi28 | 6 | 0 | 0 | 0 | 6 | true |
| armeabi-v7a CtsDownloadManagerLegacy | 3 | 0 | 0 | 0 | 3 | true |
| armeabi-v7a CtsDpiTestCases | 8 | 0 | 0 | 0 | 8 | true |
| armeabi-v7a CtsDpiTestCases2 | 6 | 0 | 0 | 0 | 6 | true |
| armeabi-v7a CtsDreamsTestCases | 3 | 0 | 0 | 0 | 3 | true |
| armeabi-v7a CtsDrmTestCases | 43 | 0 | 0 | 0 | 43 | true |
| armeabi-v7a CtsDropBoxManagerTestCases | 5 | 0 | 0 | 0 | 5 | true |
| armeabi-v7a CtsDumpsysHostTestCases | 4 | 0 | 0 | 0 | 4 | true |
| armeabi-v7a CtsDynamicLinkerTestCases | 3 | 0 | 0 | 0 | 3 | true |
| armeabi-v7a CtsEffectTestCases | 6 | 0 | 0 | 0 | 6 | true |
| armeabi-v7a CtsExternalServiceTestCases | 11 | 0 | 0 | 0 | 11 | true |
| armeabi-v7a CtsFileSystemTestCases | 5 | 0 | 0 | 0 | 5 | true |
| armeabi-v7a CtsFragmentTestCases | 155 | 0 | 0 | 0 | 155 | true |
| armeabi-v7a CtsFragmentTestCasesSdk26 | 1 | 0 | 0 | 0 | 1 | true |
| armeabi-v7a CtsGestureTestCases | 29 | 0 | 0 | 0 | 29 | true |
| armeabi-v7a CtsGraphicsTestCases | 2153 | 0 | 0 | 1 | 2154 | true |
| armeabi-v7a CtsHardwareTestCases | 23 | 0 | 0 | 0 | 23 | true |
| armeabi-v7a CtsHarmfulAppWarningHostTestCases | 1 | 0 | 0 | 0 | 1 | true |
| armeabi-v7a CtsHiddenApiBlacklistApi27TestCases | 4 | 0 | 0 | 0 | 4 | true |
| armeabi-v7a CtsHiddenApiBlacklistApi28TestCases | 4 | 0 | 0 | 0 | 4 | true |
| armeabi-v7a CtsHiddenApiBlacklistCurrentApiTestCases | 4 | 0 | 0 | 0 | 4 | true |
| armeabi-v7a CtsHiddenApiBlacklistDebugClassTestCases | 4 | 0 | 0 | 0 | 4 | true |
| armeabi-v7a CtsHiddenApiKillswitchDebugClassTestCases | 4 | 0 | 0 | 0 | 4 | true |
| armeabi-v7a CtsHiddenApiKillswitchWhitelistTestCases | 4 | 0 | 0 | 0 | 4 | true |
| armeabi-v7a CtsHiddenApiKillswitchWildcardTestCases | 4 | 0 | 0 | 0 | 4 | true |
| armeabi-v7a CtsHostTzDataTests | 24 | 0 | 0 | 0 | 24 | true |
| armeabi-v7a CtsHostsideNetworkTests | 46 | 17 | 0 | 0 | 63 | true |
| armeabi-v7a CtsHostsideNumberBlockingTestCases | 1 | 0 | 0 | 0 | 1 | true |
| armeabi-v7a CtsHostsideTvTests | 1 | 0 | 0 | 0 | 1 | true |
| armeabi-v7a CtsHostsideWebViewTests | 7 | 0 | 0 | 0 | 7 | true |
| armeabi-v7a CtsIcuTestCases | 4426 | 0 | 4 | 28 | 4458 | true |
| armeabi-v7a CtsIncidentHostTestCases | 46 | 0 | 0 | 0 | 46 | true |
| armeabi-v7a CtsInputMethodServiceHostTestCases | 13 | 0 | 2 | 0 | 15 | true |
| armeabi-v7a CtsInputMethodTestCases | 67 | 0 | 3 | 0 | 70 | true |
| armeabi-v7a CtsIntentSignatureTestCases | 1 | 0 | 0 | 0 | 1 | true |
| armeabi-v7a CtsJdwpSecurityHostTestCases | 1 | 0 | 0 | 0 | 1 | true |
| armeabi-v7a CtsJdwpTestCases | 379 | 0 | 0 | 0 | 379 | true |
| armeabi-v7a CtsJdwpTunnelHostTestCases | 1 | 0 | 0 | 0 | 1 | true |
| armeabi-v7a CtsJniTestCases | 66 | 0 | 0 | 0 | 66 | true |
| armeabi-v7a CtsJobSchedulerSharedUidTestCases | 13 | 0 | 0 | 0 | 13 | true |
| armeabi-v7a CtsJobSchedulerTestCases | 31 | 5 | 4 | 0 | 40 | false |
| armeabi-v7a CtsJvmtiAttachingHostTestCases | 4 | 0 | 0 | 0 | 4 | true |
| armeabi-v7a CtsJvmtiAttachingTestCases | 28 | 0 | 0 | 0 | 28 | true |
| armeabi-v7a CtsJvmtiRedefineClassesHostTestCases | 1 | 0 | 0 | 0 | 1 | true |
| armeabi-v7a CtsJvmtiRunTest1900HostTestCases | 1 | 0 | 0 | 0 | 1 | true |
| armeabi-v7a CtsJvmtiRunTest1901HostTestCases | 1 | 0 | 0 | 0 | 1 | true |
| armeabi-v7a CtsJvmtiRunTest1902HostTestCases | 1 | 0 | 0 | 0 | 1 | true |
| armeabi-v7a CtsJvmtiRunTest1903HostTestCases | 1 | 0 | 0 | 0 | 1 | true |
| armeabi-v7a CtsJvmtiRunTest1904HostTestCases | 1 | 0 | 0 | 0 | 1 | true |
| armeabi-v7a CtsJvmtiRunTest1906HostTestCases | 1 | 0 | 0 | 0 | 1 | true |
| armeabi-v7a CtsJvmtiRunTest1907HostTestCases | 1 | 0 | 0 | 0 | 1 | true |
| armeabi-v7a CtsJvmtiRunTest1908HostTestCases | 1 | 0 | 0 | 0 | 1 | true |
| armeabi-v7a CtsJvmtiRunTest1909HostTestCases | 1 | 0 | 0 | 0 | 1 | true |
| armeabi-v7a CtsJvmtiRunTest1910HostTestCases | 1 | 0 | 0 | 0 | 1 | true |
| armeabi-v7a CtsJvmtiRunTest1911HostTestCases | 1 | 0 | 0 | 0 | 1 | true |
| armeabi-v7a CtsJvmtiRunTest1912HostTestCases | 1 | 0 | 0 | 0 | 1 | true |
| armeabi-v7a CtsJvmtiRunTest1913HostTestCases | 1 | 0 | 0 | 0 | 1 | true |
| armeabi-v7a CtsJvmtiRunTest1914HostTestCases | 1 | 0 | 0 | 0 | 1 | true |
| armeabi-v7a CtsJvmtiRunTest1915HostTestCases | 1 | 0 | 0 | 0 | 1 | true |
| armeabi-v7a CtsJvmtiRunTest1916HostTestCases | 1 | 0 | 0 | 0 | 1 | true |
| armeabi-v7a CtsJvmtiRunTest1917HostTestCases | 1 | 0 | 0 | 0 | 1 | true |
| armeabi-v7a CtsJvmtiRunTest1920HostTestCases | 1 | 0 | 0 | 0 | 1 | true |
| armeabi-v7a CtsJvmtiRunTest1921HostTestCases | 1 | 0 | 0 | 0 | 1 | true |
| armeabi-v7a CtsJvmtiRunTest1922HostTestCases | 1 | 0 | 0 | 0 | 1 | true |
| armeabi-v7a CtsJvmtiRunTest1923HostTestCases | 1 | 0 | 0 | 0 | 1 | true |
| armeabi-v7a CtsJvmtiRunTest1924HostTestCases | 1 | 0 | 0 | 0 | 1 | true |
| armeabi-v7a CtsJvmtiRunTest1925HostTestCases | 1 | 0 | 0 | 0 | 1 | true |
| armeabi-v7a CtsJvmtiRunTest1926HostTestCases | 1 | 0 | 0 | 0 | 1 | true |
| armeabi-v7a CtsJvmtiRunTest1927HostTestCases | 1 | 0 | 0 | 0 | 1 | true |
| armeabi-v7a CtsJvmtiRunTest1928HostTestCases | 1 | 0 | 0 | 0 | 1 | true |
| armeabi-v7a CtsJvmtiRunTest1930HostTestCases | 1 | 0 | 0 | 0 | 1 | true |
| armeabi-v7a CtsJvmtiRunTest1931HostTestCases | 1 | 0 | 0 | 0 | 1 | true |
| armeabi-v7a CtsJvmtiRunTest1932HostTestCases | 1 | 0 | 0 | 0 | 1 | true |
| armeabi-v7a CtsJvmtiRunTest1933HostTestCases | 1 | 0 | 0 | 0 | 1 | true |
| armeabi-v7a CtsJvmtiRunTest1934HostTestCases | 1 | 0 | 0 | 0 | 1 | true |
| armeabi-v7a CtsJvmtiRunTest1936HostTestCases | 1 | 0 | 0 | 0 | 1 | true |
| armeabi-v7a CtsJvmtiRunTest1937HostTestCases | 1 | 0 | 0 | 0 | 1 | true |
| armeabi-v7a CtsJvmtiRunTest1939HostTestCases | 1 | 0 | 0 | 0 | 1 | true |
| armeabi-v7a CtsJvmtiRunTest1941HostTestCases | 1 | 0 | 0 | 0 | 1 | true |
| armeabi-v7a CtsJvmtiRunTest1942HostTestCases | 1 | 0 | 0 | 0 | 1 | true |
| armeabi-v7a CtsJvmtiRunTest1943HostTestCases | 1 | 0 | 0 | 0 | 1 | true |
| armeabi-v7a CtsJvmtiRunTest1953HostTestCases | 1 | 0 | 0 | 0 | 1 | true |
| armeabi-v7a CtsJvmtiRunTest1958HostTestCases | 1 | 0 | 0 | 0 | 1 | true |
| armeabi-v7a CtsJvmtiRunTest902HostTestCases | 1 | 0 | 0 | 0 | 1 | true |
| armeabi-v7a CtsJvmtiRunTest903HostTestCases | 1 | 0 | 0 | 0 | 1 | true |
| armeabi-v7a CtsJvmtiRunTest904HostTestCases | 1 | 0 | 0 | 0 | 1 | true |
| armeabi-v7a CtsJvmtiRunTest905HostTestCases | 1 | 0 | 0 | 0 | 1 | true |
| armeabi-v7a CtsJvmtiRunTest906HostTestCases | 1 | 0 | 0 | 0 | 1 | true |
| armeabi-v7a CtsJvmtiRunTest907HostTestCases | 1 | 0 | 0 | 0 | 1 | true |
| armeabi-v7a CtsJvmtiRunTest908HostTestCases | 1 | 0 | 0 | 0 | 1 | true |
| armeabi-v7a CtsJvmtiRunTest910HostTestCases | 1 | 0 | 0 | 0 | 1 | true |
| armeabi-v7a CtsJvmtiRunTest911HostTestCases | 1 | 0 | 0 | 0 | 1 | true |
| armeabi-v7a CtsJvmtiRunTest912HostTestCases | 1 | 0 | 0 | 0 | 1 | true |
| armeabi-v7a CtsJvmtiRunTest913HostTestCases | 1 | 0 | 0 | 0 | 1 | true |
| armeabi-v7a CtsJvmtiRunTest914HostTestCases | 1 | 0 | 0 | 0 | 1 | true |
| armeabi-v7a CtsJvmtiRunTest915HostTestCases | 1 | 0 | 0 | 0 | 1 | true |
| armeabi-v7a CtsJvmtiRunTest917HostTestCases | 1 | 0 | 0 | 0 | 1 | true |
| armeabi-v7a CtsJvmtiRunTest918HostTestCases | 1 | 0 | 0 | 0 | 1 | true |
| armeabi-v7a CtsJvmtiRunTest919HostTestCases | 1 | 0 | 0 | 0 | 1 | true |
| armeabi-v7a CtsJvmtiRunTest920HostTestCases | 1 | 0 | 0 | 0 | 1 | true |
| armeabi-v7a CtsJvmtiRunTest922HostTestCases | 1 | 0 | 0 | 0 | 1 | true |
| armeabi-v7a CtsJvmtiRunTest923HostTestCases | 1 | 0 | 0 | 0 | 1 | true |
| armeabi-v7a CtsJvmtiRunTest924HostTestCases | 1 | 0 | 0 | 0 | 1 | true |
| armeabi-v7a CtsJvmtiRunTest926HostTestCases | 1 | 0 | 0 | 0 | 1 | true |
| armeabi-v7a CtsJvmtiRunTest927HostTestCases | 1 | 0 | 0 | 0 | 1 | true |
| armeabi-v7a CtsJvmtiRunTest928HostTestCases | 1 | 0 | 0 | 0 | 1 | true |
| armeabi-v7a CtsJvmtiRunTest930HostTestCases | 1 | 0 | 0 | 0 | 1 | true |
| armeabi-v7a CtsJvmtiRunTest931HostTestCases | 1 | 0 | 0 | 0 | 1 | true |
| armeabi-v7a CtsJvmtiRunTest932HostTestCases | 1 | 0 | 0 | 0 | 1 | true |
| armeabi-v7a CtsJvmtiRunTest940HostTestCases | 1 | 0 | 0 | 0 | 1 | true |
| armeabi-v7a CtsJvmtiRunTest942HostTestCases | 1 | 0 | 0 | 0 | 1 | true |
| armeabi-v7a CtsJvmtiRunTest944HostTestCases | 1 | 0 | 0 | 0 | 1 | true |
| armeabi-v7a CtsJvmtiRunTest945HostTestCases | 1 | 0 | 0 | 0 | 1 | true |
| armeabi-v7a CtsJvmtiRunTest947HostTestCases | 1 | 0 | 0 | 0 | 1 | true |
| armeabi-v7a CtsJvmtiRunTest951HostTestCases | 1 | 0 | 0 | 0 | 1 | true |
| armeabi-v7a CtsJvmtiRunTest982HostTestCases | 1 | 0 | 0 | 0 | 1 | true |
| armeabi-v7a CtsJvmtiRunTest983HostTestCases | 1 | 0 | 0 | 0 | 1 | true |
| armeabi-v7a CtsJvmtiRunTest984HostTestCases | 1 | 0 | 0 | 0 | 1 | true |
| armeabi-v7a CtsJvmtiRunTest985HostTestCases | 1 | 0 | 0 | 0 | 1 | true |
| armeabi-v7a CtsJvmtiRunTest986HostTestCases | 1 | 0 | 0 | 0 | 1 | true |
| armeabi-v7a CtsJvmtiRunTest988HostTestCases | 1 | 0 | 0 | 0 | 1 | true |
| armeabi-v7a CtsJvmtiRunTest989HostTestCases | 1 | 0 | 0 | 0 | 1 | true |
| armeabi-v7a CtsJvmtiRunTest990HostTestCases | 1 | 0 | 0 | 0 | 1 | true |
| armeabi-v7a CtsJvmtiRunTest991HostTestCases | 1 | 0 | 0 | 0 | 1 | true |
| armeabi-v7a CtsJvmtiRunTest992HostTestCases | 1 | 0 | 0 | 0 | 1 | true |
| armeabi-v7a CtsJvmtiRunTest993HostTestCases | 1 | 0 | 0 | 0 | 1 | true |
| armeabi-v7a CtsJvmtiRunTest994HostTestCases | 1 | 0 | 0 | 0 | 1 | true |
| armeabi-v7a CtsJvmtiRunTest995HostTestCases | 1 | 0 | 0 | 0 | 1 | true |
| armeabi-v7a CtsJvmtiRunTest996HostTestCases | 1 | 0 | 0 | 0 | 1 | true |
| armeabi-v7a CtsJvmtiRunTest997HostTestCases | 1 | 0 | 0 | 0 | 1 | true |
| armeabi-v7a CtsJvmtiTaggingHostTestCases | 1 | 0 | 0 | 0 | 1 | true |
| armeabi-v7a CtsJvmtiTrackingHostTestCases | 1 | 0 | 0 | 0 | 1 | true |
| armeabi-v7a CtsKernelConfigTestCases | 5 | 0 | 0 | 0 | 5 | true |
| armeabi-v7a CtsKeystoreTestCases | 1034 | 0 | 0 | 0 | 1034 | true |
| armeabi-v7a CtsLeanbackJankTestCases | 1 | 0 | 0 | 0 | 1 | true |
| armeabi-v7a CtsLegacyNotification20TestCases | 1 | 0 | 0 | 0 | 1 | true |
| armeabi-v7a CtsLegacyNotification27TestCases | 14 | 0 | 0 | 0 | 14 | true |
| armeabi-v7a CtsLegacyNotification28TestCases | 1 | 0 | 0 | 0 | 1 | true |
| armeabi-v7a CtsLegacyNotification29TestCases | 22 | 0 | 0 | 0 | 22 | true |
| armeabi-v7a CtsLibcoreApiEvolutionTestCases | 9 | 0 | 0 | 0 | 9 | true |
| armeabi-v7a CtsLibcoreFileIOTestCases | 18 | 0 | 0 | 0 | 18 | true |
| armeabi-v7a CtsLibcoreJsr166TestCases | 3373 | 0 | 0 | 0 | 3373 | true |
| armeabi-v7a CtsLibcoreLegacy22TestCases | 5 | 0 | 0 | 0 | 5 | true |
| armeabi-v7a CtsLibcoreOjTestCases | 3979 | 0 | 0 | 0 | 3979 | true |
| armeabi-v7a CtsLibcoreOkHttpTestCases | 1968 | 0 | 0 | 19 | 1987 | true |
| armeabi-v7a CtsLibcoreTestCases | 23498 | 5 | 3 | 0 | 23506 | true |
| armeabi-v7a CtsLibcoreWycheproofBCTestCases | 53 | 0 | 0 | 0 | 53 | true |
| armeabi-v7a CtsLibcoreWycheproofConscryptTestCases | 41 | 0 | 0 | 0 | 41 | true |
| armeabi-v7a CtsLiblogTestCases | 75 | 0 | 0 | 0 | 75 | true |
| armeabi-v7a CtsLocation2TestCases | 9 | 0 | 0 | 0 | 9 | true |
| armeabi-v7a CtsLocationTestCases | 140 | 0 | 0 | 0 | 140 | true |
| armeabi-v7a CtsLogdTestCases | 13 | 0 | 0 | 0 | 13 | true |
| armeabi-v7a CtsMediaBitstreamsTestCases | 4541 | 0 | 0 | 0 | 4541 | true |
| armeabi-v7a CtsMediaHostTestCases | 4 | 0 | 0 | 0 | 4 | true |
| armeabi-v7a CtsMediaStressTestCases | 120 | 0 | 0 | 0 | 120 | true |
| armeabi-v7a CtsMediaTestCases | 2311 | 0 | 0 | 0 | 2311 | true |
| armeabi-v7a CtsMidiTestCases | 7 | 0 | 0 | 0 | 7 | true |
| armeabi-v7a CtsMonkeyTestCases | 10 | 0 | 0 | 0 | 10 | true |
| armeabi-v7a CtsMultiUserHostTestCases | 10 | 0 | 0 | 0 | 10 | true |
| armeabi-v7a CtsMultiUserTestCases | 1 | 0 | 0 | 0 | 1 | true |
| armeabi-v7a CtsNNAPIBenchmarkTestCases | 14 | 0 | 0 | 0 | 14 | true |
| armeabi-v7a CtsNNAPITestCases | 16957 | 0 | 0 | 0 | 16957 | true |
| armeabi-v7a CtsNativeHardwareTestCases | 328 | 0 | 0 | 0 | 328 | true |
| armeabi-v7a CtsNativeMediaAAudioTestCases | 122 | 0 | 0 | 0 | 122 | true |
| armeabi-v7a CtsNativeMediaSlTestCases | 10 | 0 | 0 | 0 | 10 | true |
| armeabi-v7a CtsNativeMediaXaTestCases | 2 | 0 | 0 | 0 | 2 | true |
| armeabi-v7a CtsNativeMidiTestCases | 9 | 0 | 0 | 0 | 9 | true |
| armeabi-v7a CtsNativeNetTestCases | 3 | 0 | 0 | 0 | 3 | true |
| armeabi-v7a CtsNdefTestCases | 11 | 0 | 0 | 0 | 11 | true |
| armeabi-v7a CtsNdkBinderTestCases | 275 | 0 | 0 | 0 | 275 | true |
| armeabi-v7a CtsNetApi23TestCases | 0 | 3 | 0 | 0 | 3 | true |
| armeabi-v7a CtsNetSecConfigAttributeTestCases | 1 | 0 | 0 | 0 | 1 | true |
| armeabi-v7a CtsNetSecConfigBasicDebugDisabledTestCases | 1 | 0 | 0 | 0 | 1 | true |
| armeabi-v7a CtsNetSecConfigBasicDebugEnabledTestCases | 1 | 0 | 0 | 0 | 1 | true |
| armeabi-v7a CtsNetSecConfigBasicDomainConfigTestCases | 3 | 0 | 0 | 0 | 3 | true |
| armeabi-v7a CtsNetSecConfigCleartextTrafficTestCases | 3 | 0 | 0 | 0 | 3 | true |
| armeabi-v7a CtsNetSecConfigDownloadManagerTestCases | 3 | 0 | 0 | 0 | 3 | true |
| armeabi-v7a CtsNetSecConfigInvalidPinTestCases | 2 | 0 | 0 | 0 | 2 | true |
| armeabi-v7a CtsNetSecConfigNestedDomainConfigTestCases | 2 | 0 | 0 | 0 | 2 | true |
| armeabi-v7a CtsNetSecConfigPrePCleartextTrafficTestCases | 3 | 0 | 0 | 0 | 3 | true |
| armeabi-v7a CtsNetSecConfigResourcesSrcTestCases | 5 | 0 | 0 | 0 | 5 | true |
| armeabi-v7a CtsNetSecPolicyUsesCleartextTrafficFalseTestCases | 6 | 0 | 0 | 0 | 6 | true |
| armeabi-v7a CtsNetSecPolicyUsesCleartextTrafficTrueTestCases | 6 | 0 | 0 | 0 | 6 | true |
| armeabi-v7a CtsNetSecPolicyUsesCleartextTrafficUnspecifiedTestCases | 6 | 0 | 0 | 0 | 6 | true |
| armeabi-v7a CtsNetTestCases | 398 | 33 | 0 | 0 | 431 | true |
| armeabi-v7a CtsNetTestCasesInternetPermission | 1 | 0 | 0 | 0 | 1 | true |
| armeabi-v7a CtsNetTestCasesLegacyApi22 | 2 | 0 | 0 | 0 | 2 | true |
| armeabi-v7a CtsNetTestCasesLegacyPermission22 | 3 | 0 | 0 | 0 | 3 | true |
| armeabi-v7a CtsNetTestCasesUpdateStatsPermission | 2 | 0 | 0 | 0 | 2 | true |
| armeabi-v7a CtsNoPermissionTestCases | 2 | 0 | 0 | 0 | 2 | true |
| armeabi-v7a CtsNoPermissionTestCases25 | 2 | 0 | 0 | 0 | 2 | true |
| armeabi-v7a CtsOmapiTestCases | 12 | 0 | 0 | 0 | 12 | true |
| armeabi-v7a CtsOpenGLTestCases | 57 | 0 | 0 | 1 | 58 | true |
| armeabi-v7a CtsOpenGlPerf2TestCases | 9 | 0 | 0 | 0 | 9 | true |
| armeabi-v7a CtsOpenGlPerfTestCases | 4 | 0 | 0 | 0 | 4 | true |
| armeabi-v7a CtsOsHostTestCases | 23 | 0 | 0 | 1 | 24 | true |
| armeabi-v7a CtsOsTestCases | 546 | 0 | 0 | 0 | 546 | true |
| armeabi-v7a CtsPackageInstallTestCases | 16 | 0 | 0 | 0 | 16 | true |
| armeabi-v7a CtsPackageInstallerTapjackingTestCases | 1 | 0 | 0 | 0 | 1 | true |
| armeabi-v7a CtsPackageUninstallTestCases | 1 | 0 | 0 | 0 | 1 | true |
| armeabi-v7a CtsPerfettoTestCases | 24 | 0 | 0 | 0 | 24 | true |
| armeabi-v7a CtsPermission2TestCases | 92 | 0 | 0 | 0 | 92 | true |
| armeabi-v7a CtsPermissionTestCases | 223 | 0 | 12 | 0 | 235 | true |
| armeabi-v7a CtsPermissionTestCasesSdk28 | 1 | 0 | 0 | 0 | 1 | true |
| armeabi-v7a CtsPermissionTestCasesTelephony | 10 | 0 | 0 | 0 | 10 | true |
| armeabi-v7a CtsProtoTestCases | 156 | 0 | 0 | 0 | 156 | true |
| armeabi-v7a CtsProviderTestCases | 499 | 0 | 20 | 0 | 519 | true |
| armeabi-v7a CtsProviderUiTestCases | 4 | 0 | 0 | 0 | 4 | true |
| armeabi-v7a CtsRenderscriptLegacyTestCases | 11 | 0 | 0 | 0 | 11 | true |
| armeabi-v7a CtsRenderscriptTestCases | 744 | 0 | 0 | 0 | 744 | true |
| armeabi-v7a CtsResolverServiceTestCases | 2 | 0 | 0 | 0 | 2 | true |
| armeabi-v7a CtsRoleTestCases | 30 | 0 | 4 | 0 | 34 | true |
| armeabi-v7a CtsRsBlasTestCases | 198 | 0 | 0 | 0 | 198 | true |
| armeabi-v7a CtsRsCppTestCases | 123 | 0 | 0 | 0 | 123 | true |
| armeabi-v7a CtsSampleDeviceTestCases | 6 | 0 | 0 | 0 | 6 | true |
| armeabi-v7a CtsSampleHostTestCases | 6 | 0 | 1 | 0 | 7 | true |
| armeabi-v7a CtsSaxTestCases | 2 | 0 | 0 | 0 | 2 | true |
| armeabi-v7a CtsSeccompHostTestCases | 3 | 0 | 0 | 0 | 3 | true |
| armeabi-v7a CtsSecureElementAccessControlTestCases1 | 6 | 0 | 0 | 0 | 6 | true |
| armeabi-v7a CtsSecureElementAccessControlTestCases2 | 6 | 0 | 0 | 0 | 6 | true |
| armeabi-v7a CtsSecureElementAccessControlTestCases3 | 5 | 0 | 0 | 0 | 5 | true |
| armeabi-v7a CtsSecurityBulletinHostTestCases | 0 | 0 | 0 | 0 | 0 | true |
| armeabi-v7a CtsSecurityHostTestCases | 45 | 0 | 0 | 0 | 45 | true |
| armeabi-v7a CtsSecurityTestCases | 18 | 0 | 0 | 0 | 18 | true |
| armeabi-v7a CtsSelinuxEphemeralTestCases | 0 | 0 | 0 | 0 | 0 | true |
| armeabi-v7a CtsSelinuxTargetSdk25TestCases | 5 | 0 | 0 | 0 | 5 | true |
| armeabi-v7a CtsSelinuxTargetSdk27TestCases | 5 | 0 | 0 | 0 | 5 | true |
| armeabi-v7a CtsSelinuxTargetSdk28TestCases | 5 | 0 | 0 | 0 | 5 | true |
| armeabi-v7a CtsSelinuxTargetSdkCurrentTestCases | 5 | 0 | 0 | 0 | 5 | true |
| armeabi-v7a CtsSensorTestCases | 296 | 0 | 0 | 0 | 296 | true |
| armeabi-v7a CtsSharedLibsApiSignatureTestCases | 1 | 0 | 0 | 0 | 1 | true |
| armeabi-v7a CtsShortcutHostTestCases | 12 | 0 | 0 | 0 | 12 | true |
| armeabi-v7a CtsShortcutManagerTestCases | 62 | 0 | 0 | 0 | 62 | true |
| armeabi-v7a CtsSignedConfigHostTestCases | 13 | 0 | 1 | 0 | 14 | true |
| armeabi-v7a CtsSimRestrictedApisTestCases | 19 | 0 | 0 | 0 | 19 | true |
| armeabi-v7a CtsSimpleCpuTestCases | 8 | 0 | 0 | 0 | 8 | true |
| armeabi-v7a CtsSimpleperfTestCases | 235 | 0 | 0 | 0 | 235 | true |
| armeabi-v7a CtsSkQPTestCases | 1612 | 0 | 0 | 0 | 1612 | true |
| armeabi-v7a CtsSliceTestCases | 41 | 0 | 0 | 0 | 41 | true |
| armeabi-v7a CtsSpeechTestCases | 6 | 0 | 0 | 0 | 6 | true |
| armeabi-v7a CtsSustainedPerformanceHostTestCases | 1 | 0 | 0 | 0 | 1 | true |
| armeabi-v7a CtsSyncAccountAccessOtherCertTestCases | 0 | 0 | 1 | 0 | 1 | true |
| armeabi-v7a CtsSyncContentHostTestCases | 0 | 0 | 0 | 0 | 0 | true |
| armeabi-v7a CtsSyncManagerTestsCases | 3 | 0 | 0 | 0 | 3 | true |
| armeabi-v7a CtsSystemApiAnnotationTestCases | 1 | 0 | 0 | 0 | 1 | true |
| armeabi-v7a CtsSystemApiSignatureTestCases | 1 | 0 | 0 | 0 | 1 | true |
| armeabi-v7a CtsSystemIntentTestCases | 1 | 0 | 0 | 0 | 1 | true |
| armeabi-v7a CtsSystemUiHostTestCases | 11 | 0 | 0 | 0 | 11 | true |
| armeabi-v7a CtsSystemUiTestCases | 1 | 0 | 12 | 0 | 13 | true |
| armeabi-v7a CtsTelecomTestCases2 | 8 | 0 | 0 | 0 | 8 | true |
| armeabi-v7a CtsTelecomTestCases3 | 3 | 0 | 0 | 0 | 3 | true |
| armeabi-v7a CtsTelephony3TestCases | 1 | 0 | 0 | 0 | 1 | true |
| armeabi-v7a CtsTelephonyProviderTestCases | 0 | 0 | 9 | 0 | 9 | true |
| armeabi-v7a CtsTelephonySdk28TestCases | 3 | 0 | 0 | 0 | 3 | true |
| armeabi-v7a CtsTextTestCases | 1211 | 0 | 4 | 0 | 1215 | true |
| armeabi-v7a CtsTfliteNnapiDelegateTestCases | 64 | 0 | 0 | 0 | 64 | true |
| armeabi-v7a CtsThemeDeviceTestCases | 25 | 0 | 0 | 0 | 25 | true |
| armeabi-v7a CtsThemeHostTestCases | 1 | 0 | 0 | 0 | 1 | true |
| armeabi-v7a CtsToastLegacyTestCases | 8 | 0 | 0 | 0 | 8 | true |
| armeabi-v7a CtsToastTestCases | 3 | 0 | 0 | 0 | 3 | true |
| armeabi-v7a CtsTrustedVoiceHostTestCases | 0 | 1 | 0 | 0 | 1 | true |
| armeabi-v7a CtsTvProviderTestCases | 2 | 0 | 0 | 0 | 2 | true |
| armeabi-v7a CtsTvTestCases | 75 | 0 | 0 | 0 | 75 | true |
| armeabi-v7a CtsUiAutomationTestCases | 11 | 0 | 0 | 0 | 11 | true |
| armeabi-v7a CtsUiRenderingTestCases | 378 | 0 | 0 | 1 | 379 | true |
| armeabi-v7a CtsUiRenderingTestCases27 | 2 | 0 | 0 | 0 | 2 | true |
| armeabi-v7a CtsUidIsolationTestCases | 2 | 0 | 0 | 0 | 2 | true |
| armeabi-v7a CtsUsageStatsTestCases | 36 | 0 | 1 | 1 | 38 | true |
| armeabi-v7a CtsUsbTests | 1 | 0 | 0 | 0 | 1 | true |
| armeabi-v7a CtsUsesLibraryHostTestCases | 1 | 0 | 0 | 0 | 1 | true |
| armeabi-v7a CtsUtilTestCases | 292 | 0 | 0 | 0 | 292 | true |
| armeabi-v7a CtsVideoTestCases | 363 | 0 | 0 | 0 | 363 | true |
| armeabi-v7a CtsViewInspectorAnnotationProcessorTestCases | 16 | 0 | 0 | 0 | 16 | true |
| armeabi-v7a CtsViewTestCases | 1095 | 0 | 4 | 4 | 1103 | true |
| armeabi-v7a CtsViewTestCasesSdk28 | 1 | 0 | 0 | 0 | 1 | true |
| armeabi-v7a CtsVoiceInteractionTestCases | 6 | 0 | 0 | 0 | 6 | true |
| armeabi-v7a CtsVoiceSettingsTestCases | 3 | 0 | 0 | 0 | 3 | true |
| armeabi-v7a CtsVrTestCases | 16 | 0 | 0 | 0 | 16 | true |
| armeabi-v7a CtsWebkitTestCases | 272 | 0 | 0 | 0 | 272 | true |
| armeabi-v7a CtsWidgetTestCases | 2706 | 0 | 0 | 0 | 2706 | true |
| armeabi-v7a CtsWifiBroadcastsHostTestCases | 1 | 0 | 0 | 0 | 1 | true |
| armeabi-v7a CtsWindowManagerDeviceTestCases | 411 | 3 | 204 | 10 | 628 | false |
| armeabi-v7a CtsWindowManagerSdk25TestCases | 1 | 0 | 0 | 0 | 1 | true |
| armeabi-v7a CtsWindowManagerSdk28TestCases | 0 | 0 | 1 | 0 | 1 | true |
| armeabi-v7a CtsWrapNoWrapTestCases | 1 | 0 | 0 | 0 | 1 | true |
| armeabi-v7a CtsWrapWrapDebugMallocDebugTestCases | 1 | 0 | 0 | 0 | 1 | true |
| armeabi-v7a CtsWrapWrapDebugTestCases | 1 | 0 | 0 | 0 | 1 | true |
| armeabi-v7a CtsWrapWrapNoDebugTestCases | 1 | 0 | 0 | 0 | 1 | true |
| armeabi-v7a CtsAppTestCases | ||
| Test | Result | Details |
|---|---|---|
| android.app.cts.SystemFeaturesTest#testWifiFeature |
fail
|
java.lang.AssertionError: expected:<true> but was:<false>
|
| armeabi-v7a CtsHostsideNetworkTests | ||
| Test | Result | Details |
|---|---|---|
| com.android.cts.net.HostsideRestrictBackgroundNetworkTests#testDozeModeMetered_whitelisted |
fail
|
java.lang.AssertionError: on-device tests failed:
|
| com.android.cts.net.HostsideRestrictBackgroundNetworkTests#testDozeModeMetered_enabled |
fail
|
junit.framework.AssertionFailedError: Expected: <null> but was: Unknown failure: cmd: Can't find service: package
|
| com.android.cts.net.HostsideRestrictBackgroundNetworkTests#testDozeModeMetered_enabledButWhitelistedOnNotificationAction |
fail
|
junit.framework.AssertionFailedError: Expected: <null> but was: Unknown failure: cmd: Can't find service: package
|
| com.android.cts.net.HostsideRestrictBackgroundNetworkTests#testDozeModeNonMetered_disabled |
fail
|
junit.framework.AssertionFailedError: Expected: <null> but was: Unknown failure: cmd: Can't find service: package
|
| com.android.cts.net.HostsideRestrictBackgroundNetworkTests#testDozeModeNonMetered_whitelisted |
fail
|
junit.framework.AssertionFailedError: Expected: <null> but was: Unknown failure: cmd: Can't find service: package
|
| com.android.cts.net.HostsideRestrictBackgroundNetworkTests#testDozeModeNonMetered_enabled |
fail
|
junit.framework.AssertionFailedError: Expected: <null> but was: Unknown failure: cmd: Can't find service: package
|
| com.android.cts.net.HostsideRestrictBackgroundNetworkTests#testDozeModeNonMetered_enabledButWhitelistedOnNotificationAction |
fail
|
junit.framework.AssertionFailedError: Expected: <null> but was: Unknown failure: cmd: Can't find service: package
|
| com.android.cts.net.HostsideRestrictBackgroundNetworkTests#testDataAndBatterySaverModes_meteredNetwork |
fail
|
junit.framework.AssertionFailedError: Expected: <null> but was: Unknown failure: cmd: Can't find service: package
|
| com.android.cts.net.HostsideRestrictBackgroundNetworkTests#testDataAndBatterySaverModes_nonMeteredNetwork |
fail
|
junit.framework.AssertionFailedError: Expected: <null> but was: Unknown failure: cmd: Can't find service: package
|
| com.android.cts.net.HostsideRestrictBackgroundNetworkTests#testDozeAndBatterySaverMode_powerSaveWhitelists |
fail
|
junit.framework.AssertionFailedError: Expected: <null> but was: Unknown failure: cmd: Can't find service: package
|
| com.android.cts.net.HostsideRestrictBackgroundNetworkTests#testDozeAndAppIdle_powerSaveWhitelists |
fail
|
junit.framework.AssertionFailedError: Expected: <null> but was: Unknown failure: cmd: Can't find service: package
|
| com.android.cts.net.HostsideRestrictBackgroundNetworkTests#testAppIdleAndDoze_tempPowerSaveWhitelists |
fail
|
junit.framework.AssertionFailedError: Expected: <null> but was: Unknown failure: cmd: Can't find service: package
|
| com.android.cts.net.HostsideRestrictBackgroundNetworkTests#testAppIdleAndBatterySaver_tempPowerSaveWhitelists |
fail
|
junit.framework.AssertionFailedError: Expected: <null> but was: Unknown failure: cmd: Can't find service: package
|
| com.android.cts.net.HostsideRestrictBackgroundNetworkTests#testDozeAndAppIdle_appIdleWhitelist |
fail
|
junit.framework.AssertionFailedError: Expected: <null> but was: Unknown failure: cmd: Can't find service: package
|
| com.android.cts.net.HostsideRestrictBackgroundNetworkTests#testAppIdleAndDoze_tempPowerSaveAndAppIdleWhitelists |
fail
|
junit.framework.AssertionFailedError: Expected: <null> but was: Unknown failure: cmd: Can't find service: package
|
| com.android.cts.net.HostsideRestrictBackgroundNetworkTests#testAppIdleAndBatterySaver_tempPowerSaveAndAppIdleWhitelists |
fail
|
junit.framework.AssertionFailedError: Expected: <null> but was: Unknown failure: cmd: Can't find service: package
|
| com.android.cts.net.HostsideVpnTests#testNoProxy |
fail
|
junit.framework.AssertionFailedError: Expected: <null> but was: Unknown failure: cmd: Can't find service: package
|
| armeabi-v7a CtsJobSchedulerTestCases | ||
| Test | Result | Details |
|---|---|---|
| android.jobscheduler.cts.ConnectivityConstraintTest#testConnectivityConstraintExecutes_withWifi |
fail
|
junit.framework.AssertionFailedError: Wifi must be configured to connect to an access point for this test.
|
| android.jobscheduler.cts.ConnectivityConstraintTest#testUnmeteredConstraintExecutes_withWifi |
fail
|
junit.framework.AssertionFailedError: Wifi must be configured to connect to an access point for this test.
|
| android.jobscheduler.cts.ConnectivityConstraintTest#testConnectivityConstraintExecutes_withWifi_DataSaverOn |
fail
|
junit.framework.AssertionFailedError: Wifi must be configured to connect to an access point for this test.
|
| android.jobscheduler.cts.DeviceStatesTest#testDeviceChangeIdleActiveState |
fail
|
Test failed to run to completion. Reason: 'Test run failed to complete. Expected 3 tests, received 1'. Check device logcat for details
|
| android.jobscheduler.cts.JobThrottlingTest#testBackgroundConnectivityJobsThrottled |
fail
|
junit.framework.AssertionFailedError: Wifi must be configured to connect to an access point for this test.
|
| armeabi-v7a CtsLibcoreTestCases | ||
| Test | Result | Details |
|---|---|---|
| libcore.java.net.ConcurrentCloseTest#test_connect_timeout |
fail
|
junit.framework.ComparisonFailure: expected:<[Socket closed]> but was:<[failed to connect to /192.0.2.0 (port 80) from /192.168.128.9 (port 57868) after 3600000ms: isConnected failed: EHOSTUNREACH (No route to host)]>
|
| libcore.java.net.ConcurrentCloseTest#test_connect |
fail
|
junit.framework.ComparisonFailure: expected:<[Socket closed]> but was:<[Host unreachable]>
|
| libcore.java.net.SocketTimeoutTest#testSocketConnectTimeout |
fail
|
java.net.ConnectException: failed to connect to /192.0.2.0 (port 0) from /192.168.128.9 (port 44598) after 500ms: isConnected failed: EHOSTUNREACH (No route to host)
|
| libcore.java.net.OldSocketTest#test_connectLjava_net_SocketAddressI_setSOTimeout |
fail
|
junit.framework.AssertionFailedError: java.net.ConnectException: failed to connect to /192.0.2.0 (port 0) from /192.168.128.9 (port 44850) after 5000ms: isConnected failed: EHOSTUNREACH (No route to host)
|
| libcore.java.net.SocketTest#testCloseDuringConnect |
fail
|
java.lang.AssertionError: Unexpected result from connectWorker
|
| armeabi-v7a CtsNetApi23TestCases | ||
| Test | Result | Details |
|---|---|---|
| android.net.cts.api23test.ConnectivityManagerApi23Test#testConnectivityChanged_manifestRequestOnlyPreN_shouldReceiveIntent |
fail
|
java.lang.AssertionError
|
| android.net.cts.api23test.ConnectivityManagerApi23Test#testConnectivityChanged_manifestRequestOnly_shouldNotReceiveIntent |
fail
|
java.lang.AssertionError
|
| android.net.cts.api23test.ConnectivityManagerApi23Test#testConnectivityChanged_whenRegistered_shouldReceiveIntent |
fail
|
java.lang.AssertionError
|
| armeabi-v7a CtsNetTestCases | ||
| Test | Result | Details |
|---|---|---|
| android.net.cts.ConnectivityManagerTest#testCreateTcpKeepalive |
fail
|
java.lang.AssertionError
|
| android.net.cts.ConnectivityManagerTest#testGetMultipathPreference |
fail
|
java.lang.AssertionError
|
| android.net.cts.ConnectivityManagerTest#testKeepaliveWifiUnsupported |
fail
|
java.lang.AssertionError
|
| android.net.cts.ConnectivityManagerTest#testRegisterNetworkCallback |
fail
|
java.lang.AssertionError
|
| android.net.cts.ConnectivityManagerTest#testRegisterNetworkCallback_withPendingIntent |
fail
|
java.lang.AssertionError
|
| android.net.cts.ConnectivityManagerTest#testRestrictedNetworks |
fail
|
junit.framework.AssertionFailedError: No exception thrown when restricted network requested.
|
| android.net.cts.ConnectivityManagerTest#testSocketKeepaliveLimitWifi |
fail
|
java.lang.AssertionError
|
| android.net.cts.ConnectivityManagerTest#testSocketKeepaliveUnprivileged |
fail
|
java.lang.AssertionError
|
| android.net.wifi.cts.ScanResultTest#testScanResultMatchesWifiInfo |
fail
|
junit.framework.AssertionFailedError
|
| android.net.wifi.cts.ScanResultTest#testScanResultProperties |
fail
|
junit.framework.AssertionFailedError
|
| android.net.wifi.cts.ScanResultTest#testScanResultTimeStamp |
fail
|
junit.framework.AssertionFailedError
|
| android.net.wifi.cts.WifiEnterpriseConfigTest#testEnterpriseConfigDoesNotPrintPassword |
fail
|
junit.framework.AssertionFailedError
|
| android.net.wifi.cts.WifiEnterpriseConfigTest#testSettersAndGetters |
fail
|
junit.framework.AssertionFailedError
|
| android.net.wifi.cts.WifiInfoTest#testWifiInfoProperties |
fail
|
junit.framework.AssertionFailedError
|
| android.net.wifi.cts.WifiManagerTest#testDeprecatedApis |
fail
|
junit.framework.AssertionFailedError
|
| android.net.wifi.cts.WifiManagerTest#testMaxNumberOfNetworkSuggestionsPerApp |
fail
|
junit.framework.AssertionFailedError
|
| android.net.wifi.cts.WifiManagerTest#testNetworkCarrierProvisioningPermission |
fail
|
junit.framework.AssertionFailedError
|
| android.net.wifi.cts.WifiManagerTest#testNetworkManagedProvisioningPermission |
fail
|
junit.framework.AssertionFailedError
|
| android.net.wifi.cts.WifiManagerTest#testNetworkSettingsPermission |
fail
|
junit.framework.AssertionFailedError
|
| android.net.wifi.cts.WifiManagerTest#testNetworkSetupWizardPermission |
fail
|
junit.framework.AssertionFailedError
|
| android.net.wifi.cts.WifiManagerTest#testNetworkStackPermission |
fail
|
junit.framework.AssertionFailedError
|
| android.net.wifi.cts.WifiManagerTest#testScreenOffDoesNotTurnOffWifiScanningWhenWifiDisabled |
fail
|
junit.framework.AssertionFailedError
|
| android.net.wifi.cts.WifiManagerTest#testScreenOffDoesNotTurnOffWifiScanningWhenWifiEnabled |
fail
|
junit.framework.AssertionFailedError
|
| android.net.wifi.cts.WifiManagerTest#testSignal |
fail
|
junit.framework.AssertionFailedError
|
| android.net.wifi.cts.WifiManagerTest#testStartLocalOnlyHotspotSingleRequestByApps |
fail
|
junit.framework.AssertionFailedError
|
| android.net.wifi.cts.WifiManagerTest#testStartLocalOnlyHotspotSuccess |
fail
|
junit.framework.AssertionFailedError
|
| android.net.wifi.cts.WifiManagerTest#testUpdateWifiUsabilityStatsScorePermission |
fail
|
junit.framework.AssertionFailedError
|
| android.net.wifi.cts.WifiManagerTest#testWifiManagerLock |
fail
|
junit.framework.AssertionFailedError
|
| android.net.wifi.cts.WifiManagerTest#testWifiManagerProperties |
fail
|
junit.framework.AssertionFailedError
|
| android.net.wifi.cts.WifiManagerTest#testWifiManagerScanWhenWifiOffLocationTurnedOn |
fail
|
junit.framework.AssertionFailedError
|
| android.net.wifi.cts.WifiManagerTest#testWifiScanTimestamp |
fail
|
junit.framework.AssertionFailedError
|
| android.net.wifi.cts.WifiManagerTest#testWifiSetDeviceMobilityStatePermission |
fail
|
junit.framework.AssertionFailedError
|
| android.net.wifi.cts.WifiManagerTest#testWifiWatchdog |
fail
|
junit.framework.AssertionFailedError
|
| armeabi-v7a CtsTrustedVoiceHostTestCases | ||
| Test | Result | Details |
|---|---|---|
| android.trustedvoice.cts.TrustedVoiceHostTest#testUnlock |
fail
|
junit.framework.ComparisonFailure: Test string does not match expected:<[TrustedVoiceTestString]> but was:<[]>
|
| armeabi-v7a CtsWindowManagerDeviceTestCases | ||
| Test | Result | Details |
|---|---|---|
| android.server.wm.DisplayTests#testForceDisplayMetrics |
fail
|
Test failed to run to completion. Reason: 'Test run failed to complete. Expected 13 tests, received 0'. Check device logcat for details
|
| android.server.wm.MultiDisplayPolicyTests#testExternalDisplayActivityTurnPrimaryOff |
fail
|
java.lang.RuntimeException: Caught exception
|
| android.server.wm.MultiDisplayActivityLaunchTests#testLaunchExternalDisplayActivityWhilePrimaryOff |
fail
|
java.lang.RuntimeException: Caught exception
|
| Incomplete Modules |
|---|
| armeabi-v7a CtsJobSchedulerTestCases |
| armeabi-v7a CtsWindowManagerDeviceTestCases |