Summary
Suite / PlanCTS / cts
Suite / Build12_r6 / 9265137
Host Info Result/@start xts-Veriton-M490 (Linux - 5.4.0-137-generic)
Start time / End TimeWed Feb 08 18:16:47 CST 2023 / Wed Feb 08 18:45:08 CST 2023
Tests Passed37
Tests Failed5
Modules Done1
Modules Total1
FingerprintSKB/BFX_AT100/BFX-AT100:12/STTC.220724.001/k000c-537r07_cec-20230208:userdebug/release-keys
Security Patch2023-01-01
Release (SDK)12 (31)
ABIsarmeabi-v7a,armeabi

ModulePassedFailedAssumption FailureIgnoredTotal TestsDoneReason
armeabi-v7a CtsHdmiCecHostTestCases375301284true

Failed Tests (5)

armeabi-v7a CtsHdmiCecHostTestCases
TestResultDetails
android.hdmicec.cts.common.HdmiCecPowerStatusTest#cect_PowerStatusWhenOff
fail
expected: 1 but was : 0 at android.hdmicec.cts.common.HdmiCecPowerStatusTest.cect_PowerStatusWhenOff(HdmiCecPowerStatusTest.java:172)
android.hdmicec.cts.common.HdmiCecSystemStandbyTest#cect_HandleBroadcastStandby
fail
value of: trim() expected: mWakefulness=Asleep but was : mWakefulness=Awake at android.hdmicec.cts.common.HdmiCecSystemStandbyTest.checkDeviceAsleepAfterStandbySent(HdmiCecSystemStandbyTest.java:149) at android.hdmicec.cts.common.HdmiCecSystemStandbyTest.cect_HandleBroadcastStandby(HdmiCecSystemStandbyTest.java:83)
android.hdmicec.cts.playback.HdmiCecRoutingControlTest#cect_11_2_2_4_InactiveSourceOnStandby
fail
java.lang.Exception: Could not find message INACTIVE_SOURCE at android.hdmicec.cts.HdmiCecClientWrapper.checkExpectedOutput(HdmiCecClientWrapper.java:576) at android.hdmicec.cts.HdmiCecClientWrapper.checkExpectedOutput(HdmiCecClientWrapper.java:487) at android.hdmicec.cts.playback.HdmiCecRoutingControlTest.cect_11_2_2_4_InactiveSourceOnStandby(HdmiCecRoutingControlTest.java:155) at java.base/jdk.internal.reflect.NativeMethodAccessorImpl.invoke0(Native Method) at java.base/jdk.internal.reflect.NativeMethodAccessorImpl.invoke(NativeMethodAccessorImpl.java:62) at java.base/jdk.internal.reflect.DelegatingMethodAccessorImpl.invoke(DelegatingMethodAccessorImpl.java:43) at java.base/java.lang.reflect.Method.invoke(Method.java:566) at org.junit.runners.model.FrameworkMethod$1.runReflectiveCall(FrameworkMethod.java:59) at org.junit.internal.runners.model.ReflectiveCallable.run(ReflectiveCallable.java:12) at org.junit.runners.model.FrameworkMethod.invokeExplosively(FrameworkMethod.java:61) at org.junit.internal.runners.statements.InvokeMethod.evaluate(InvokeMethod.java:17) at org.junit.internal.runners.statements.RunBefores.evaluate(RunBefores.java:26) at org.junit.internal.runners.statements.RunAfters.evaluate(RunAfters.java:27) at org.junit.rules.ExternalResource$1.evaluate(ExternalResource.java:54) at android.hdmicec.cts.RequiredPropertyRule$3$1.evaluate(RequiredPropertyRule.java:97) at android.hdmicec.cts.RequiredFeatureRule$1.evaluate(RequiredFeatureRule.java:52) at android.hdmicec.cts.RequiredFeatureRule$1.evaluate(RequiredFeatureRule.java:52) at org.junit.rules.RunRules.evaluate(RunRules.java:20) at org.junit.runners.ParentRunner$3.evaluate(ParentRunner.java:306) at org.junit.runners.BlockJUnit4ClassRunner$1.evaluate(BlockJUnit4ClassRunner.java:100) at org.junit.runners.ParentRunner.runLeaf(ParentRunner.java:366) at org.junit.runners.BlockJUnit4ClassRunner.runChild(BlockJUnit4ClassRunner.java:103) at com.android.tradefed.testtype.DeviceJUnit4ClassRunner.runChild(DeviceJUnit4ClassRunner.java:109) at com.android.tradefed.testtype.DeviceJUnit4ClassRunner.runChild(DeviceJUnit4ClassRunner.java:61) at org.junit.runners.ParentRunner$4.run(ParentRunner.java:331) at org.junit.runners.ParentRunner$1.schedule(ParentRunner.java:79) at org.junit.runners.ParentRunner.runChildren(ParentRunner.java:329) at org.junit.runners.ParentRunner$2.evaluate(ParentRunner.java:293) at org.junit.runners.ParentRunner$3.evaluate(ParentRunner.java:306) at org.junit.runners.ParentRunner.run(ParentRunner.java:413) at com.android.tradefed.testtype.DeviceJUnit4ClassRunner.run(DeviceJUnit4ClassRunner.java:145) at org.junit.runner.JUnitCore.run(JUnitCore.java:137) at com.android.tradefed.testtype.HostTest.runJUnit4Tests(HostTest.java:731) at com.android.tradefed.testtype.HostTest.runTestClasses(HostTest.java:615) at com.android.tradefed.testtype.HostTest.run(HostTest.java:563) at com.android.compatibility.common.tradefed.testtype.JarHostTest.run(JarHostTest.java:56) at com.android.tradefed.testtype.suite.GranularRetriableTestWrapper.intraModuleRun(GranularRetriableTestWrapper.java:353) at com.android.tradefed.testtype.suite.GranularRetriableTestWrapper.run(GranularRetriableTestWrapper.java:268) at com.android.tradefed.testtype.suite.ModuleDefinition.run(ModuleDefinition.java:580) at com.android.tradefed.testtype.suite.ITestSuite.runSingleModule(ITestSuite.java:913) at com.android.tradefed.testtype.suite.ITestSuite.run(ITestSuite.java:785) at com.android.tradefed.invoker.InvocationExecution.runTest(InvocationExecution.java:1190) at com.android.tradefed.invoker.InvocationExecution.runTests(InvocationExecution.java:1010) at com.android.tradefed.invoker.TestInvocation.prepareAndRun(TestInvocation.java:596) at com.android.tradefed.invoker.TestInvocation.performInvocation(TestInvocation.java:273) at com.android.tradefed.invoker.TestInvocation.invoke(TestInvocation.java:1308) at com.android.tradefed.command.CommandScheduler$InvocationThread.run(CommandScheduler.java:639)
android.hdmicec.cts.playback.HdmiCecTvPowerToggleTest#cectTvPowerToggleTest_asleep_tvOff
fail
java.lang.Exception: Could not find message TEXT_VIEW_ON at android.hdmicec.cts.HdmiCecClientWrapper.checkExpectedOutput(HdmiCecClientWrapper.java:576) at android.hdmicec.cts.HdmiCecClientWrapper.checkExpectedOutput(HdmiCecClientWrapper.java:487) at android.hdmicec.cts.playback.HdmiCecTvPowerToggleTest.cectTvPowerToggleTest_asleep_tvOff(HdmiCecTvPowerToggleTest.java:204) at java.base/jdk.internal.reflect.NativeMethodAccessorImpl.invoke0(Native Method) at java.base/jdk.internal.reflect.NativeMethodAccessorImpl.invoke(NativeMethodAccessorImpl.java:62) at java.base/jdk.internal.reflect.DelegatingMethodAccessorImpl.invoke(DelegatingMethodAccessorImpl.java:43) at java.base/java.lang.reflect.Method.invoke(Method.java:566) at org.junit.runners.model.FrameworkMethod$1.runReflectiveCall(FrameworkMethod.java:59) at org.junit.internal.runners.model.ReflectiveCallable.run(ReflectiveCallable.java:12) at org.junit.runners.model.FrameworkMethod.invokeExplosively(FrameworkMethod.java:61) at org.junit.internal.runners.statements.InvokeMethod.evaluate(InvokeMethod.java:17) at org.junit.internal.runners.statements.RunBefores.evaluate(RunBefores.java:26) at org.junit.internal.runners.statements.RunAfters.evaluate(RunAfters.java:27) at org.junit.rules.ExternalResource$1.evaluate(ExternalResource.java:54) at android.hdmicec.cts.RequiredPropertyRule$3$1.evaluate(RequiredPropertyRule.java:97) at android.hdmicec.cts.RequiredFeatureRule$1.evaluate(RequiredFeatureRule.java:52) at android.hdmicec.cts.RequiredFeatureRule$1.evaluate(RequiredFeatureRule.java:52) at org.junit.rules.RunRules.evaluate(RunRules.java:20) at org.junit.runners.ParentRunner$3.evaluate(ParentRunner.java:306) at org.junit.runners.BlockJUnit4ClassRunner$1.evaluate(BlockJUnit4ClassRunner.java:100) at org.junit.runners.ParentRunner.runLeaf(ParentRunner.java:366) at org.junit.runners.BlockJUnit4ClassRunner.runChild(BlockJUnit4ClassRunner.java:103) at com.android.tradefed.testtype.DeviceJUnit4ClassRunner.runChild(DeviceJUnit4ClassRunner.java:109) at com.android.tradefed.testtype.DeviceJUnit4ClassRunner.runChild(DeviceJUnit4ClassRunner.java:61) at org.junit.runners.ParentRunner$4.run(ParentRunner.java:331) at org.junit.runners.ParentRunner$1.schedule(ParentRunner.java:79) at org.junit.runners.ParentRunner.runChildren(ParentRunner.java:329) at org.junit.runners.ParentRunner$2.evaluate(ParentRunner.java:293) at org.junit.runners.ParentRunner$3.evaluate(ParentRunner.java:306) at org.junit.runners.ParentRunner.run(ParentRunner.java:413) at com.android.tradefed.testtype.DeviceJUnit4ClassRunner.run(DeviceJUnit4ClassRunner.java:145) at org.junit.runner.JUnitCore.run(JUnitCore.java:137) at com.android.tradefed.testtype.HostTest.runJUnit4Tests(HostTest.java:731) at com.android.tradefed.testtype.HostTest.runTestClasses(HostTest.java:615) at com.android.tradefed.testtype.HostTest.run(HostTest.java:563) at com.android.compatibility.common.tradefed.testtype.JarHostTest.run(JarHostTest.java:56) at com.android.tradefed.testtype.suite.GranularRetriableTestWrapper.intraModuleRun(GranularRetriableTestWrapper.java:353) at com.android.tradefed.testtype.suite.GranularRetriableTestWrapper.run(GranularRetriableTestWrapper.java:268) at com.android.tradefed.testtype.suite.ModuleDefinition.run(ModuleDefinition.java:580) at com.android.tradefed.testtype.suite.ITestSuite.runSingleModule(ITestSuite.java:913) at com.android.tradefed.testtype.suite.ITestSuite.run(ITestSuite.java:785) at com.android.tradefed.invoker.InvocationExecution.runTest(InvocationExecution.java:1190) at com.android.tradefed.invoker.InvocationExecution.runTests(InvocationExecution.java:1010) at com.android.tradefed.invoker.TestInvocation.prepareAndRun(TestInvocation.java:596) at com.android.tradefed.invoker.TestInvocation.performInvocation(TestInvocation.java:273) at com.android.tradefed.invoker.TestInvocation.invoke(TestInvocation.java:1308) at com.android.tradefed.command.CommandScheduler$InvocationThread.run(CommandScheduler.java:639)
android.hdmicec.cts.playback.HdmiCecTvPowerToggleTest#cectTvPowerToggleTest_asleep_tvOn
fail
java.lang.Exception: Could not find message STANDBY at android.hdmicec.cts.HdmiCecClientWrapper.checkExpectedOutput(HdmiCecClientWrapper.java:576) at android.hdmicec.cts.HdmiCecClientWrapper.checkExpectedOutput(HdmiCecClientWrapper.java:487) at android.hdmicec.cts.playback.HdmiCecTvPowerToggleTest.cectTvPowerToggleTest_asleep_tvOn(HdmiCecTvPowerToggleTest.java:170) at java.base/jdk.internal.reflect.NativeMethodAccessorImpl.invoke0(Native Method) at java.base/jdk.internal.reflect.NativeMethodAccessorImpl.invoke(NativeMethodAccessorImpl.java:62) at java.base/jdk.internal.reflect.DelegatingMethodAccessorImpl.invoke(DelegatingMethodAccessorImpl.java:43) at java.base/java.lang.reflect.Method.invoke(Method.java:566) at org.junit.runners.model.FrameworkMethod$1.runReflectiveCall(FrameworkMethod.java:59) at org.junit.internal.runners.model.ReflectiveCallable.run(ReflectiveCallable.java:12) at org.junit.runners.model.FrameworkMethod.invokeExplosively(FrameworkMethod.java:61) at org.junit.internal.runners.statements.InvokeMethod.evaluate(InvokeMethod.java:17) at org.junit.internal.runners.statements.RunBefores.evaluate(RunBefores.java:26) at org.junit.internal.runners.statements.RunAfters.evaluate(RunAfters.java:27) at org.junit.rules.ExternalResource$1.evaluate(ExternalResource.java:54) at android.hdmicec.cts.RequiredPropertyRule$3$1.evaluate(RequiredPropertyRule.java:97) at android.hdmicec.cts.RequiredFeatureRule$1.evaluate(RequiredFeatureRule.java:52) at android.hdmicec.cts.RequiredFeatureRule$1.evaluate(RequiredFeatureRule.java:52) at org.junit.rules.RunRules.evaluate(RunRules.java:20) at org.junit.runners.ParentRunner$3.evaluate(ParentRunner.java:306) at org.junit.runners.BlockJUnit4ClassRunner$1.evaluate(BlockJUnit4ClassRunner.java:100) at org.junit.runners.ParentRunner.runLeaf(ParentRunner.java:366) at org.junit.runners.BlockJUnit4ClassRunner.runChild(BlockJUnit4ClassRunner.java:103) at com.android.tradefed.testtype.DeviceJUnit4ClassRunner.runChild(DeviceJUnit4ClassRunner.java:109) at com.android.tradefed.testtype.DeviceJUnit4ClassRunner.runChild(DeviceJUnit4ClassRunner.java:61) at org.junit.runners.ParentRunner$4.run(ParentRunner.java:331) at org.junit.runners.ParentRunner$1.schedule(ParentRunner.java:79) at org.junit.runners.ParentRunner.runChildren(ParentRunner.java:329) at org.junit.runners.ParentRunner$2.evaluate(ParentRunner.java:293) at org.junit.runners.ParentRunner$3.evaluate(ParentRunner.java:306) at org.junit.runners.ParentRunner.run(ParentRunner.java:413) at com.android.tradefed.testtype.DeviceJUnit4ClassRunner.run(DeviceJUnit4ClassRunner.java:145) at org.junit.runner.JUnitCore.run(JUnitCore.java:137) at com.android.tradefed.testtype.HostTest.runJUnit4Tests(HostTest.java:731) at com.android.tradefed.testtype.HostTest.runTestClasses(HostTest.java:615) at com.android.tradefed.testtype.HostTest.run(HostTest.java:563) at com.android.compatibility.common.tradefed.testtype.JarHostTest.run(JarHostTest.java:56) at com.android.tradefed.testtype.suite.GranularRetriableTestWrapper.intraModuleRun(GranularRetriableTestWrapper.java:353) at com.android.tradefed.testtype.suite.GranularRetriableTestWrapper.run(GranularRetriableTestWrapper.java:268) at com.android.tradefed.testtype.suite.ModuleDefinition.run(ModuleDefinition.java:580) at com.android.tradefed.testtype.suite.ITestSuite.runSingleModule(ITestSuite.java:913) at com.android.tradefed.testtype.suite.ITestSuite.run(ITestSuite.java:785) at com.android.tradefed.invoker.InvocationExecution.runTest(InvocationExecution.java:1190) at com.android.tradefed.invoker.InvocationExecution.runTests(InvocationExecution.java:1010) at com.android.tradefed.invoker.TestInvocation.prepareAndRun(TestInvocation.java:596) at com.android.tradefed.invoker.TestInvocation.performInvocation(TestInvocation.java:273) at com.android.tradefed.invoker.TestInvocation.invoke(TestInvocation.java:1308) at com.android.tradefed.command.CommandScheduler$InvocationThread.run(CommandScheduler.java:639)

armeabi-v7a CtsHdmiCecHostTestCases
TestResultDetails
android.hdmicec.cts.audio.HdmiCecAudioReturnChannelControlTest#No Tests
IGNORED
android.hdmicec.cts.audio.HdmiCecInvalidMessagesTest#No Tests
IGNORED
android.hdmicec.cts.audio.HdmiCecLogicalAddressTest#No Tests
IGNORED
android.hdmicec.cts.audio.HdmiCecRemoteControlPassThroughTest#No Tests
IGNORED
android.hdmicec.cts.audio.HdmiCecSystemAudioModeTest#No Tests
IGNORED
android.hdmicec.cts.common.HdmiCecDeviceTypeTest#checkHdmiCecDeviceType
pass
android.hdmicec.cts.common.HdmiCecFeatureAbortTest#cect_hf4_2_11_featureAbortBehavior
ASSUMPTION_FAILURE
org.junit.AssumptionViolatedException: got: <false>, expected: is <true>
android.hdmicec.cts.common.HdmiCecInvalidMessagesTest#cect_12_2_DirectlyAddressedReceivedAsBroadcast_givePhysicalAddress
pass
android.hdmicec.cts.common.HdmiCecInvalidMessagesTest#cect_12_2_DirectlyAddressedReceivedAsBroadcast_giveOsdName
pass
android.hdmicec.cts.common.HdmiCecInvalidMessagesTest#cect_12_2_DirectlyAddressedReceivedAsBroadcast_userControlPressed
pass
android.hdmicec.cts.common.HdmiCecInvalidMessagesTest#cect_12_2_DirectlyAddressedReceivedAsBroadcast_getCecVersion
pass
android.hdmicec.cts.common.HdmiCecInvalidMessagesTest#cect_12_1_BroadcastReceivedAsDirectlyAddressed
ASSUMPTION_FAILURE
org.junit.AssumptionViolatedException: Language should be editable for this test
android.hdmicec.cts.common.HdmiCecInvalidMessagesTest#cect_12_2_DirectlyAddressedReceivedAsBroadcast_giveDeviceVendorId
pass
android.hdmicec.cts.common.HdmiCecInvalidMessagesTest#cect_12_2_DirectlyAddressedReceivedAsBroadcast_givePowerStatus
pass
android.hdmicec.cts.common.HdmiCecLogicalAddressTest#cect_RebootLogicalAddress
pass
android.hdmicec.cts.common.HdmiCecPhysicalAddressTest#cect_10_1_2_1_RebootPhysicalAddress
pass
android.hdmicec.cts.common.HdmiCecPollingTest#cect_11_2_6_1_Ack
pass
android.hdmicec.cts.common.HdmiCecPollingTest#cect_hf4_2_10_Ack
ASSUMPTION_FAILURE
org.junit.AssumptionViolatedException: got: <false>, expected: is <true>
android.hdmicec.cts.common.HdmiCecPowerStatusTest#cect_hf4_6_21_broadcastsWhenGoingToStandby
ASSUMPTION_FAILURE
org.junit.AssumptionViolatedException: got: <false>, expected: is <true>
android.hdmicec.cts.common.HdmiCecPowerStatusTest#cect_hf4_6_20_broadcastsWhenTurningOn
ASSUMPTION_FAILURE
org.junit.AssumptionViolatedException: got: <false>, expected: is <true>
android.hdmicec.cts.common.HdmiCecPowerStatusTest#cect_hf4_6_10_userControlPressed_powerOff
pass
android.hdmicec.cts.common.HdmiCecPowerStatusTest#cect_hf4_6_8_userControlPressed_powerOn
pass
android.hdmicec.cts.common.HdmiCecPowerStatusTest#cect_PowerStatusWhenOff
fail
expected: 1
android.hdmicec.cts.common.HdmiCecPowerStatusTest#cect_PowerStatusWhenOn
pass
android.hdmicec.cts.common.HdmiCecStartupTest#hf_7_5_verifyStartupMessages
ASSUMPTION_FAILURE
org.junit.AssumptionViolatedException: got: <false>, expected: is <true>
android.hdmicec.cts.common.HdmiCecStartupTest#cectVerifyStartupMessages_Cec14b
pass
android.hdmicec.cts.common.HdmiCecSystemAudioControlTest#cect_VolumeUpDownUserControlPressedWhenSystemAudioControlOn
ASSUMPTION_FAILURE
org.junit.AssumptionViolatedException: Skip for playback devices (b/172539380)
android.hdmicec.cts.common.HdmiCecSystemAudioControlTest#cect_GiveSystemAudioModeStatus
pass
android.hdmicec.cts.common.HdmiCecSystemAudioControlTest#cect_MuteUserControlPressedWhenSystemAudioControlOn
ASSUMPTION_FAILURE
org.junit.AssumptionViolatedException: Skip for playback devices (b/172539380)
android.hdmicec.cts.common.HdmiCecSystemInformationTest#cect_11_2_6_2_GivePhysicalAddress
pass
android.hdmicec.cts.common.HdmiCecSystemInformationTest#cect_reportFeatures_deviceTypeContainedInAllDeviceTypes
ASSUMPTION_FAILURE
org.junit.AssumptionViolatedException: got: <false>, expected: is <true>
android.hdmicec.cts.common.HdmiCecSystemInformationTest#cect_hf4_2_12_GiveCecVersion
ASSUMPTION_FAILURE
org.junit.AssumptionViolatedException: got: <false>, expected: is <true>
android.hdmicec.cts.common.HdmiCecSystemInformationTest#cect_11_2_6_6_GiveCecVersion
pass
android.hdmicec.cts.common.HdmiCecSystemStandbyTest#cect_HandleBroadcastStandby
fail
value of: trim()
android.hdmicec.cts.common.HdmiCecSystemStandbyTest#cect_11_2_3_4_NoBroadcastStandby
pass
android.hdmicec.cts.common.HdmiCecSystemStandbyTest#cect_HandleAddressedStandby
pass
android.hdmicec.cts.common.HdmiCecVendorCommandsTest#cect_11_2_9_1_GiveDeviceVendorId
pass
android.hdmicec.cts.common.HdmiCecVendorCommandsTest#cect_11_2_9_2_DeviceVendorIdOnInit
pass
android.hdmicec.cts.playback.HdmiCecDeviceOsdNameTest#cect_11_2_11_1a_GiveOsdNameTest
pass
android.hdmicec.cts.playback.HdmiCecDeviceOsdNameTest#cect_11_2_11_1b_UpdateAndGiveOsdNameTest
pass
android.hdmicec.cts.playback.HdmiCecDeviceOsdNameTest#cect_11_2_11_2_UnregisteredDeviceGiveOsdNameTest
pass
android.hdmicec.cts.playback.HdmiCecOneTouchPlayTest#cect_PairingActivity_OneTouchPlay
pass
android.hdmicec.cts.playback.HdmiCecOneTouchPlayTest#cect_11_2_1_1_OneTouchPlay
pass
android.hdmicec.cts.playback.HdmiCecPowerStatusTest#cect_hf4_6_7_setStreamPath_powerOn
pass
android.hdmicec.cts.playback.HdmiCecRemoteControlPassThroughTest#cect_11_2_13_2_UserControlPressAndHold
pass
android.hdmicec.cts.playback.HdmiCecRemoteControlPassThroughTest#cect_11_2_13_1_UserControlPressAndRelease
pass
android.hdmicec.cts.playback.HdmiCecRoutingControlTest#cect_11_2_2_2_RequestActiveSource
pass
android.hdmicec.cts.playback.HdmiCecRoutingControlTest#cect_11_2_2_4_InactiveSourceOnStandby
fail
java.lang.Exception: Could not find message INACTIVE_SOURCE
android.hdmicec.cts.playback.HdmiCecRoutingControlTest#cect_11_1_2_2_RequestActiveSource
pass
android.hdmicec.cts.playback.HdmiCecRoutingControlTest#cect_11_2_2_1_SetStreamPathToDut
pass
android.hdmicec.cts.playback.HdmiCecStartupTest#No Tests
IGNORED
android.hdmicec.cts.playback.HdmiCecSystemInformationTest#cect_11_2_6_3_SetValidMenuLanguage
ASSUMPTION_FAILURE
org.junit.AssumptionViolatedException: got: <false>, expected: is <true>
android.hdmicec.cts.playback.HdmiCecSystemInformationTest#cect_11_2_6_7_GetMenuLanguage
pass
android.hdmicec.cts.playback.HdmiCecSystemInformationTest#cect_11_2_6_5_SetValidMenuLanguageFromInvalidSource
ASSUMPTION_FAILURE
org.junit.AssumptionViolatedException: got: <false>, expected: is <true>
android.hdmicec.cts.playback.HdmiCecSystemInformationTest#cect_11_2_6_4_SetInvalidMenuLanguage
ASSUMPTION_FAILURE
org.junit.AssumptionViolatedException: got: <false>, expected: is <true>
android.hdmicec.cts.playback.HdmiCecSystemInformationTest#setMenuLanguageIsDisabled
pass
android.hdmicec.cts.playback.HdmiCecSystemInformationTest#setMenuLanguageNotHandledWhenDisabled
pass
android.hdmicec.cts.playback.HdmiCecTvPowerToggleTest#cectTvPowerToggleTest_awake_activeSource_tvOn
pass
android.hdmicec.cts.playback.HdmiCecTvPowerToggleTest#cectTvPowerToggleTest_asleep_tvOff
fail
java.lang.Exception: Could not find message TEXT_VIEW_ON
android.hdmicec.cts.playback.HdmiCecTvPowerToggleTest#cectTvPowerToggleTest_awake_noActiveSource_tvOn
pass
android.hdmicec.cts.playback.HdmiCecTvPowerToggleTest#cectTvPowerToggleTest_asleep_tvOn
fail
java.lang.Exception: Could not find message STANDBY
android.hdmicec.cts.tv.HdmiCecAudioReturnChannelControlTest#cect_11_1_17_5_NonAdjacentDeviceArcInitiation
ASSUMPTION_FAILURE
org.junit.AssumptionViolatedException: Required property ro.hdmi.device_type = 0 is not present in [4] of device SKBFXUT409LU
android.hdmicec.cts.tv.HdmiCecAudioReturnChannelControlTest#cect_11_1_17_2_4_ReportArcInitiatedTerminated
IGNORED
android.hdmicec.cts.tv.HdmiCecAudioReturnChannelControlTest#cect_11_1_17_1_DutSendsRequestArcInitiation
IGNORED
android.hdmicec.cts.tv.HdmiCecAudioReturnChannelControlTest#cect_11_1_17_3_DutSendsRequestArcTermination
IGNORED
android.hdmicec.cts.tv.HdmiCecAudioReturnChannelControlTest#cect_11_1_17_2_ReportArcInitiated
IGNORED
android.hdmicec.cts.tv.HdmiCecRemoteControlPassThroughTest#cect_11_1_13_2_RemoteControlMessagesToPlayback
ASSUMPTION_FAILURE
org.junit.AssumptionViolatedException: Required property ro.hdmi.device_type = 0 is not present in [4] of device SKBFXUT409LU
android.hdmicec.cts.tv.HdmiCecRemoteControlPassThroughTest#cect_11_1_13_5_RemoteControlPassthroughWithMultipleDevices
ASSUMPTION_FAILURE
org.junit.AssumptionViolatedException: Required property ro.hdmi.device_type = 0 is not present in [4] of device SKBFXUT409LU
android.hdmicec.cts.tv.HdmiCecRemoteControlPassThroughTest#cect_11_1_13_4_RemoteControlMessagesToAudioSystem
ASSUMPTION_FAILURE
org.junit.AssumptionViolatedException: Required property ro.hdmi.device_type = 0 is not present in [4] of device SKBFXUT409LU
android.hdmicec.cts.tv.HdmiCecRemoteControlPassThroughTest#cect_11_1_13_1_RemoteControlMessagesToRecorder
ASSUMPTION_FAILURE
org.junit.AssumptionViolatedException: Required property ro.hdmi.device_type = 0 is not present in [4] of device SKBFXUT409LU
android.hdmicec.cts.tv.HdmiCecRemoteControlPassThroughTest#cect_11_1_13_3_RemoteControlMessagesToTuner
ASSUMPTION_FAILURE
org.junit.AssumptionViolatedException: Required property ro.hdmi.device_type = 0 is not present in [4] of device SKBFXUT409LU
android.hdmicec.cts.tv.HdmiCecRoutingControlTest#cect_11_1_2_1_DutSendsSetStreamPathMessage
ASSUMPTION_FAILURE
org.junit.AssumptionViolatedException: Required property ro.hdmi.device_type = 0 is not present in [4] of device SKBFXUT409LU
android.hdmicec.cts.tv.HdmiCecRoutingControlTest#cect_11_1_2_3_DutDoesRespondToRequestActiveSourceMessage
ASSUMPTION_FAILURE
org.junit.AssumptionViolatedException: Required property ro.hdmi.device_type = 0 is not present in [4] of device SKBFXUT409LU
android.hdmicec.cts.tv.HdmiCecRoutingControlTest#cect_11_1_2_4_DutAcceptsInactiveSourceMessage
ASSUMPTION_FAILURE
org.junit.AssumptionViolatedException: Required property ro.hdmi.device_type = 0 is not present in [4] of device SKBFXUT409LU
android.hdmicec.cts.tv.HdmiCecRoutingControlTest#cect_11_1_2_2_DutDoesNotRespondToRequestActiveSourceMessage
ASSUMPTION_FAILURE
org.junit.AssumptionViolatedException: Required property ro.hdmi.device_type = 0 is not present in [4] of device SKBFXUT409LU
android.hdmicec.cts.tv.HdmiCecSystemAudioControlTest#cect_11_1_15_1_DutSendsSystemAudioModeRequest
ASSUMPTION_FAILURE
org.junit.AssumptionViolatedException: Required property ro.hdmi.device_type = 0 is not present in [4] of device SKBFXUT409LU
android.hdmicec.cts.tv.HdmiCecSystemAudioControlTest#cect_11_1_15_8_DutUnmutesForSetSystemAudioModeOff
IGNORED
android.hdmicec.cts.tv.HdmiCecSystemAudioControlTest#cect_11_1_15_7_DutMutesForSetSystemAudioModeOn
IGNORED
android.hdmicec.cts.tv.HdmiCecSystemAudioControlTest#cect_11_1_15_5_DutResponseWhenSystemAudioModeToOff
ASSUMPTION_FAILURE
org.junit.AssumptionViolatedException: Required property ro.hdmi.device_type = 0 is not present in [4] of device SKBFXUT409LU
android.hdmicec.cts.tv.HdmiCecSystemInformationTest#cect_11_1_6_5_DutRespondsToGetMenuLanguage
ASSUMPTION_FAILURE
org.junit.AssumptionViolatedException: Required property ro.hdmi.device_type = 0 is not present in [4] of device SKBFXUT409LU
android.hdmicec.cts.tv.HdmiCecTvOneTouchPlayTest#cect_11_1_1_1_RespondToImageViewOn
ASSUMPTION_FAILURE
org.junit.AssumptionViolatedException: Required property ro.hdmi.device_type = 0 is not present in [4] of device SKBFXUT409LU
android.hdmicec.cts.tv.HdmiCecTvOneTouchPlayTest#cect_11_1_1_5_DutBroadcastsActiveSourceWhenChangingToInternal
ASSUMPTION_FAILURE
org.junit.AssumptionViolatedException: Required property ro.hdmi.device_type = 0 is not present in [4] of device SKBFXUT409LU
android.hdmicec.cts.tv.HdmiCecTvOneTouchPlayTest#cect_11_1_1_2_RespondToTextViewOn
ASSUMPTION_FAILURE
org.junit.AssumptionViolatedException: Required property ro.hdmi.device_type = 0 is not present in [4] of device SKBFXUT409LU
android.hdmicec.cts.tv.HdmiCecTvStandbyTest#cect_11_1_3_1_BroadcastStandby
ASSUMPTION_FAILURE
org.junit.AssumptionViolatedException: Required property ro.hdmi.device_type = 0 is not present in [4] of device SKBFXUT409LU