TEXT: 
============================================
================= Results ==================
=============== Consumed Time ==============
    armeabi-v7a GtsMediaTestCases: 6h 53m 14s
    armeabi-v7a GtsExoPlayerTestCases: 58m 27s
    armeabi-v7a GtsGmscoreHostTestCases: 47m 8s
    armeabi-v7a GtsStatsdHostTestCases: 7m 48s
    armeabi-v7a GtsEdiHostTestCases: 5m 59s
    armeabi-v7a GtsDevicePolicyGmsInstrumentationTestCases: 2m 39s
    armeabi-v7a GtsStagedInstallHostTestCases: 2m 24s
    armeabi-v7a GtsPlayStoreHostTestCases: 2m 24s
    armeabi-v7a GtsSecurityHostTestCases: 2m 9s
    armeabi-v7a GtsFeaturesTestCases: 1m 55s
    armeabi-v7a CtsEdiHostTestCases: 1m 51s
    armeabi-v7a GtsRollbackManagerTest: 1m 48s
    armeabi-v7a GtsArtManagerHostTestCases: 1m 39s
    armeabi-v7a GtsOsTestCases: 1m 18s
    armeabi-v7a GtsPackageManagerHostTestCases: 1m 13s
    armeabi-v7a GtsDevicePolicyTestCases: 1m 4s
    armeabi-v7a GtsPermissionTestCases: 57s
    armeabi-v7a GtsPermissionUiTestCases: 46s
    armeabi-v7a GtsBootStatsTestCases: 42s
    armeabi-v7a GtsUnofficialApisUsageTestCases: 42s
    armeabi-v7a GtsHealthConnectTests: 42s
    armeabi-v7a GtsSuspendAppsTestCases: 41s
    armeabi-v7a GtsAppTestCases: 40s
    armeabi-v7a GtsNotificationTestCases: 37s
    armeabi-v7a GtsNetTestCases: 36s
    armeabi-v7a GtsContentTestCases: 36s
    armeabi-v7a GtsPackageInstallTestCases: 35s
    armeabi-v7a GtsLocationTestCases: 33s
    armeabi-v7a GtsDuoReadyTestCases: 33s
    armeabi-v7a GtsDozeDeviceTestCases: 32s
    armeabi-v7a GtsPlacementTestCases: 32s
    armeabi-v7a GtsNetworkWatchlistTestCases: 28s
    armeabi-v7a GtsYouTubeTestCases: 27s
    armeabi-v7a GtsMbaPrivilegedPermissionTestCases: 27s
    armeabi-v7a GtsBackupTestCases: 26s
    armeabi-v7a GtsDeviceConfigTestCases: 26s
    armeabi-v7a GtsTvTestCases: 23s
    armeabi-v7a GtsBackupHostTestCases: 22s
    armeabi-v7a GtsPrintTestCases: 22s
    armeabi-v7a GtsTelephonyTestCases: 22s
    armeabi-v7a GtsPersonalSafetyTestCases: 21s
    armeabi-v7a GtsLensTestCases: 21s
    armeabi-v7a GtsPlayAutoInstallTestCases: 21s
    armeabi-v7a GtsWellbeingTestCases: 20s
    armeabi-v7a GtsNmgiarcTestCases: 20s
    armeabi-v7a GtsLargeApkHostTestCases: 20s
    armeabi-v7a GtsTelecomManagerTests: 20s
    armeabi-v7a GtsUsageStatsTestCases: 20s
    armeabi-v7a GtsTetheringTestCases: 19s
    armeabi-v7a GtsWebViewTestCases: 19s
    armeabi-v7a GtsNoPermissionTestCases25: 19s
    armeabi-v7a GtsOemLockServiceTestCases: 19s
    armeabi-v7a GtsAssistIntentTestCases: 18s
    armeabi-v7a GtsRlzTestCases: 18s
    armeabi-v7a GtsContextHubPermissionDeviceTestCases: 18s
    armeabi-v7a GtsCameraTestCases: 18s
    armeabi-v7a GtsAndroidAutoDeviceTestCases: 18s
    armeabi-v7a GtsNoPermissionTestCases: 18s
    armeabi-v7a GtsWallpaperTestCases: 17s
    armeabi-v7a GtsAfwTestCases: 17s
    armeabi-v7a GtsViewTestCases: 17s
    armeabi-v7a GtsRegulationComplianceTestCases: 17s
    armeabi-v7a GtsContactsTest: 16s
    armeabi-v7a GtsSuspendAppsPermissionTestCases: 16s
    armeabi-v7a GtsSettingsTestCases: 16s
    armeabi-v7a GtsIncidentManagerTestCases: 16s
    armeabi-v7a GtsPackageInstallerTapjackingTestCases: 16s
    armeabi-v7a GtsAppBlacklistDeviceTestCases: 16s
    armeabi-v7a GtsCalendarTests: 15s
    armeabi-v7a GtsDialerAudioTestCases: 15s
    armeabi-v7a GtsStorageTestCases: 15s
    armeabi-v7a GtsThemingTestCases: 15s
    armeabi-v7a GtsAdminTestCases: 15s
    armeabi-v7a GtsWellbeingPermissionPolicyTestCases: 15s
    armeabi-v7a GtsSimAppDialogTestCases: 15s
    armeabi-v7a GtsTelephonyNumberVerificationHostCases: 15s
    armeabi-v7a GtsSupervisionTestCases: 15s
    armeabi-v7a GtsPackageRoleEnforcementTests: 15s
    armeabi-v7a GtsContactsAppDeviceTestCases: 14s
    armeabi-v7a GtsSpeechServicesTestCases: 14s
    armeabi-v7a GtsTvBugReportTestCases: 14s
    armeabi-v7a GtsAppVisibilityDeviceTestCases: 14s
    armeabi-v7a GtsIntelligenceTestCases: 14s
    armeabi-v7a GtsPackageUninstallTestCases: 14s
    armeabi-v7a GtsPropertiesTestCases: 14s
    armeabi-v7a GtsInstallPackagesWhitelistDeviceTestCases: 13s
    armeabi-v7a GtsEntertainmentSpaceDeviceTestCases: 13s
    armeabi-v7a GtsCNGCoreTestCases: 13s
    armeabi-v7a GtsModuleMetadataTestCases: 13s
    armeabi-v7a GtsMemoryTestCases: 13s
    armeabi-v7a GtsPartnerBookmarksTestCases: 13s
    armeabi-v7a GtsSetupWizardNoPermissionTestCases: 13s
    armeabi-v7a GtsPackageNameCertPairsDeviceTestCases: 13s
    armeabi-v7a GtsSafetyCenterTestCases: 13s
    armeabi-v7a GtsNetStatsHostTestCases: 13s
    armeabi-v7a GtsPrivacyTestCases: 13s
    armeabi-v7a GtsCallLogTestCases: 13s
    armeabi-v7a GtsFilesByGoogleTestCases: 13s
    armeabi-v7a GtsLocationHostTestCases: 13s
    armeabi-v7a GtsVoiceInteractionHostTestCases: 13s
    armeabi-v7a GtsSmartBatteryDeviceTestCases: 13s
    armeabi-v7a GtsSsaidHostTestCases: 12s
    armeabi-v7a GtsCastHostTestCases: 11s
    armeabi-v7a GtsIncrementalInstallProxyHostTestCases: 10s
    armeabi-v7a GtsSensorHostTestCases: 10s
    armeabi-v7a GtsNetworkStackHostTestCases: 9s
    armeabi-v7a GtsPermissionControllerHostTestCases: 7s
    armeabi-v7a GtsSetupWizardHostTestCases: 6s
    armeabi-v7a GtsAssistantHostTestCases: 6s
    armeabi-v7a GtsTvHostTestCases: 4s
    armeabi-v7a GtsMemoryHostTestCases: 4s
    armeabi-v7a GtsSettingsHostTestCases: 3s
    armeabi-v7a GtsInstantAppsHostTestCases: 3s
    armeabi-v7a GtsWebViewHostTestCases: 3s
    armeabi-v7a GtsGraphicsHostTestCases: 2s
    armeabi-v7a GtsContentHostTestCases: 2s
    armeabi-v7a GtsDozeHostSideTestCases: 2s
    armeabi-v7a GtsKidsHomeHostTestCases: 2s
    armeabi-v7a GtsWellbeingHostTestCases: 1s
    armeabi-v7a GtsPreserveLegacyStorageHostTest: 1s
    armeabi-v7a GtsAssistantMicHostTestCases: 1s
    armeabi-v7a GtsUserspaceRebootHostSideTestCases: 1s
    armeabi-v7a GtsSearchHostTestCases: 1s
    armeabi-v7a GtsEntertainmentSpaceHostTestCases: 1s
    armeabi-v7a GtsVndkDependencyTestCases: 1s
    armeabi-v7a GtsLinkerConfigTestCases: 1s
    armeabi-v7a GtsScreenshotHostTestCases: 1s
    armeabi-v7a GtsGameOverlayTestCases: 1s
    armeabi-v7a CtsClasspathDeviceInfoTestCases: 972 ms
    armeabi-v7a GtsHomeHostTestCases: 971 ms
    armeabi-v7a GtsBootHealthHostTestCases: 949 ms
    armeabi-v7a CtsScopedStorageHostTest: 0 ms
Total aggregated tests run time: 9h 45m 27s
============== TOP 109 Slow Modules ==============
    armeabi-v7a GtsRollbackManagerTest: 0.01 tests/sec [1 tests / 108745 msec]
    armeabi-v7a GtsExoPlayerTestCases: 0.01 tests/sec [42 tests / 3507284 msec]
    armeabi-v7a GtsEdiHostTestCases: 0.02 tests/sec [7 tests / 359571 msec]
    armeabi-v7a GtsMediaTestCases: 0.02 tests/sec [571 tests / 24794991 msec]
    armeabi-v7a GtsBootStatsTestCases: 0.02 tests/sec [1 tests / 42889 msec]
    armeabi-v7a GtsPlayStoreHostTestCases: 0.03 tests/sec [5 tests / 144178 msec]
    armeabi-v7a CtsEdiHostTestCases: 0.04 tests/sec [4 tests / 111463 msec]
    armeabi-v7a GtsStagedInstallHostTestCases: 0.05 tests/sec [7 tests / 144934 msec]
    armeabi-v7a GtsLargeApkHostTestCases: 0.05 tests/sec [1 tests / 20536 msec]
    armeabi-v7a GtsAppTestCases: 0.05 tests/sec [2 tests / 40987 msec]
    armeabi-v7a GtsContextHubPermissionDeviceTestCases: 0.05 tests/sec [1 tests / 18717 msec]
    armeabi-v7a GtsPackageInstallerTapjackingTestCases: 0.06 tests/sec [1 tests / 16141 msec]
    armeabi-v7a GtsAppBlacklistDeviceTestCases: 0.06 tests/sec [1 tests / 16049 msec]
    armeabi-v7a GtsDialerAudioTestCases: 0.06 tests/sec [1 tests / 15793 msec]
    armeabi-v7a GtsStorageTestCases: 0.06 tests/sec [1 tests / 15765 msec]
    armeabi-v7a GtsThemingTestCases: 0.06 tests/sec [1 tests / 15718 msec]
    armeabi-v7a GtsPermissionUiTestCases: 0.07 tests/sec [3 tests / 46072 msec]
    armeabi-v7a GtsTelephonyNumberVerificationHostCases: 0.07 tests/sec [1 tests / 15280 msec]
    armeabi-v7a GtsPackageRoleEnforcementTests: 0.07 tests/sec [1 tests / 15061 msec]
    armeabi-v7a GtsContactsAppDeviceTestCases: 0.07 tests/sec [1 tests / 14850 msec]
    armeabi-v7a GtsTvBugReportTestCases: 0.07 tests/sec [1 tests / 14306 msec]
    armeabi-v7a GtsArtManagerHostTestCases: 0.07 tests/sec [7 tests / 99511 msec]
    armeabi-v7a GtsIntelligenceTestCases: 0.07 tests/sec [1 tests / 14210 msec]
    armeabi-v7a GtsUnofficialApisUsageTestCases: 0.07 tests/sec [3 tests / 42567 msec]
    armeabi-v7a GtsPackageUninstallTestCases: 0.07 tests/sec [1 tests / 14189 msec]
    armeabi-v7a GtsPropertiesTestCases: 0.07 tests/sec [1 tests / 14033 msec]
    armeabi-v7a GtsInstallPackagesWhitelistDeviceTestCases: 0.07 tests/sec [1 tests / 13971 msec]
    armeabi-v7a GtsEntertainmentSpaceDeviceTestCases: 0.07 tests/sec [1 tests / 13903 msec]
    armeabi-v7a GtsCNGCoreTestCases: 0.07 tests/sec [1 tests / 13890 msec]
    armeabi-v7a GtsModuleMetadataTestCases: 0.07 tests/sec [1 tests / 13839 msec]
    armeabi-v7a GtsMemoryTestCases: 0.07 tests/sec [1 tests / 13831 msec]
    armeabi-v7a GtsPartnerBookmarksTestCases: 0.07 tests/sec [1 tests / 13792 msec]
    armeabi-v7a GtsSetupWizardNoPermissionTestCases: 0.07 tests/sec [1 tests / 13758 msec]
    armeabi-v7a GtsPackageNameCertPairsDeviceTestCases: 0.07 tests/sec [1 tests / 13746 msec]
    armeabi-v7a GtsSafetyCenterTestCases: 0.07 tests/sec [1 tests / 13689 msec]
    armeabi-v7a GtsNetStatsHostTestCases: 0.07 tests/sec [1 tests / 13650 msec]
    armeabi-v7a GtsPrivacyTestCases: 0.07 tests/sec [1 tests / 13590 msec]
    armeabi-v7a GtsCallLogTestCases: 0.07 tests/sec [1 tests / 13477 msec]
    armeabi-v7a GtsFilesByGoogleTestCases: 0.07 tests/sec [1 tests / 13345 msec]
    armeabi-v7a GtsSmartBatteryDeviceTestCases: 0.08 tests/sec [1 tests / 13290 msec]
    armeabi-v7a GtsStatsdHostTestCases: 0.08 tests/sec [39 tests / 468774 msec]
    armeabi-v7a GtsCastHostTestCases: 0.09 tests/sec [1 tests / 11641 msec]
    armeabi-v7a GtsNoPermissionTestCases25: 0.10 tests/sec [2 tests / 19151 msec]
    armeabi-v7a GtsNetworkWatchlistTestCases: 0.10 tests/sec [3 tests / 28627 msec]
    armeabi-v7a GtsAssistIntentTestCases: 0.11 tests/sec [2 tests / 18867 msec]
    armeabi-v7a GtsAndroidAutoDeviceTestCases: 0.11 tests/sec [2 tests / 18442 msec]
    armeabi-v7a GtsNetTestCases: 0.11 tests/sec [4 tests / 36520 msec]
    armeabi-v7a GtsNoPermissionTestCases: 0.11 tests/sec [2 tests / 18254 msec]
    armeabi-v7a GtsGmscoreHostTestCases: 0.11 tests/sec [319 tests / 2828633 msec]
    armeabi-v7a GtsDeviceConfigTestCases: 0.11 tests/sec [3 tests / 26270 msec]
    armeabi-v7a GtsViewTestCases: 0.12 tests/sec [2 tests / 17108 msec]
    armeabi-v7a GtsHealthConnectTests: 0.12 tests/sec [5 tests / 42279 msec]
    armeabi-v7a GtsCalendarTests: 0.13 tests/sec [2 tests / 15873 msec]
    armeabi-v7a GtsWellbeingPermissionPolicyTestCases: 0.13 tests/sec [2 tests / 15565 msec]
    armeabi-v7a GtsSupervisionTestCases: 0.13 tests/sec [2 tests / 15262 msec]
    armeabi-v7a GtsPrintTestCases: 0.13 tests/sec [3 tests / 22641 msec]
    armeabi-v7a GtsAppVisibilityDeviceTestCases: 0.14 tests/sec [2 tests / 14285 msec]
    armeabi-v7a GtsUsageStatsTestCases: 0.15 tests/sec [3 tests / 20360 msec]
    armeabi-v7a GtsLocationHostTestCases: 0.15 tests/sec [2 tests / 13332 msec]
    armeabi-v7a GtsCameraTestCases: 0.16 tests/sec [3 tests / 18450 msec]
    armeabi-v7a GtsPackageManagerHostTestCases: 0.16 tests/sec [12 tests / 73007 msec]
    armeabi-v7a GtsRegulationComplianceTestCases: 0.18 tests/sec [3 tests / 17061 msec]
    armeabi-v7a GtsYouTubeTestCases: 0.18 tests/sec [5 tests / 27995 msec]
    armeabi-v7a GtsContactsTest: 0.18 tests/sec [3 tests / 16767 msec]
    armeabi-v7a GtsSensorHostTestCases: 0.18 tests/sec [2 tests / 10861 msec]
    armeabi-v7a GtsSettingsTestCases: 0.19 tests/sec [3 tests / 16216 msec]
    armeabi-v7a GtsNotificationTestCases: 0.19 tests/sec [7 tests / 37206 msec]
    armeabi-v7a GtsSimAppDialogTestCases: 0.20 tests/sec [3 tests / 15372 msec]
    armeabi-v7a GtsVoiceInteractionHostTestCases: 0.23 tests/sec [3 tests / 13330 msec]
    armeabi-v7a GtsSuspendAppsPermissionTestCases: 0.24 tests/sec [4 tests / 16559 msec]
    armeabi-v7a GtsSsaidHostTestCases: 0.24 tests/sec [3 tests / 12312 msec]
    armeabi-v7a GtsAdminTestCases: 0.26 tests/sec [4 tests / 15674 msec]
    armeabi-v7a GtsOemLockServiceTestCases: 0.26 tests/sec [5 tests / 19059 msec]
    armeabi-v7a GtsDevicePolicyGmsInstrumentationTestCases: 0.28 tests/sec [44 tests / 159858 msec]
    armeabi-v7a GtsPackageInstallTestCases: 0.28 tests/sec [10 tests / 35196 msec]
    armeabi-v7a GtsAfwTestCases: 0.28 tests/sec [5 tests / 17546 msec]
    armeabi-v7a GtsIncidentManagerTestCases: 0.31 tests/sec [5 tests / 16176 msec]
    armeabi-v7a GtsSecurityHostTestCases: 0.32 tests/sec [41 tests / 129018 msec]
    armeabi-v7a GtsRlzTestCases: 0.32 tests/sec [6 tests / 18826 msec]
    armeabi-v7a GtsWallpaperTestCases: 0.33 tests/sec [6 tests / 17961 msec]
    armeabi-v7a GtsNmgiarcTestCases: 0.34 tests/sec [7 tests / 20567 msec]
    armeabi-v7a GtsTelecomManagerTests: 0.34 tests/sec [7 tests / 20467 msec]
    armeabi-v7a GtsTvTestCases: 0.34 tests/sec [8 tests / 23312 msec]
    armeabi-v7a GtsSpeechServicesTestCases: 0.34 tests/sec [5 tests / 14567 msec]
    armeabi-v7a GtsTetheringTestCases: 0.35 tests/sec [7 tests / 19912 msec]
    armeabi-v7a GtsWebViewTestCases: 0.35 tests/sec [7 tests / 19894 msec]
    armeabi-v7a GtsSuspendAppsTestCases: 0.36 tests/sec [15 tests / 41653 msec]
    armeabi-v7a GtsPlayAutoInstallTestCases: 0.38 tests/sec [8 tests / 21271 msec]
    armeabi-v7a GtsOsTestCases: 0.38 tests/sec [30 tests / 78783 msec]
    armeabi-v7a GtsDozeDeviceTestCases: 0.43 tests/sec [14 tests / 32452 msec]
    armeabi-v7a GtsFeaturesTestCases: 0.46 tests/sec [53 tests / 115618 msec]
    armeabi-v7a GtsLensTestCases: 0.47 tests/sec [10 tests / 21466 msec]
    armeabi-v7a GtsMbaPrivilegedPermissionTestCases: 0.48 tests/sec [13 tests / 27097 msec]
    armeabi-v7a GtsPersonalSafetyTestCases: 0.55 tests/sec [12 tests / 21703 msec]
    armeabi-v7a GtsLocationTestCases: 0.57 tests/sec [19 tests / 33435 msec]
    armeabi-v7a GtsPermissionTestCases: 0.63 tests/sec [36 tests / 57544 msec]
    armeabi-v7a GtsDevicePolicyTestCases: 0.68 tests/sec [44 tests / 64771 msec]
    armeabi-v7a GtsNetworkStackHostTestCases: 0.81 tests/sec [8 tests / 9846 msec]
    armeabi-v7a GtsDuoReadyTestCases: 0.85 tests/sec [28 tests / 33011 msec]
    armeabi-v7a GtsContentTestCases: 0.88 tests/sec [32 tests / 36349 msec]
    armeabi-v7a GtsPlacementTestCases: 0.90 tests/sec [29 tests / 32272 msec]
    armeabi-v7a GtsBackupTestCases: 1.05 tests/sec [28 tests / 26559 msec]
    armeabi-v7a GtsPermissionControllerHostTestCases: 1.24 tests/sec [9 tests / 7286 msec]
    armeabi-v7a GtsAssistantHostTestCases: 1.31 tests/sec [8 tests / 6118 msec]
    armeabi-v7a GtsWellbeingTestCases: 1.63 tests/sec [34 tests / 20819 msec]
    armeabi-v7a GtsBackupHostTestCases: 2.20 tests/sec [50 tests / 22761 msec]
    armeabi-v7a GtsSetupWizardHostTestCases: 2.58 tests/sec [18 tests / 6975 msec]
    armeabi-v7a GtsTelephonyTestCases: 3.49 tests/sec [78 tests / 22375 msec]
    armeabi-v7a GtsIncrementalInstallProxyHostTestCases: 3.49 tests/sec [38 tests / 10881 msec]
============== Modules Preparation Times ==============
    armeabi-v7a GtsViewTestCases => prep = 3794 ms || clean = 1328 ms
    armeabi-v7a GtsArtManagerHostTestCases => prep = 3720 ms || clean = 2012 ms
    armeabi-v7a GtsPrivacyTestCases => prep = 3882 ms || clean = 1373 ms
    armeabi-v7a GtsOsTestCases => prep = 10953 ms || clean = 3520 ms
    armeabi-v7a GtsAndroidAutoDeviceTestCases => prep = 5237 ms || clean = 1453 ms
    armeabi-v7a GtsLinkerConfigTestCases => prep = 0 ms || clean = 752 ms
    armeabi-v7a GtsWellbeingPermissionPolicyTestCases => prep = 3848 ms || clean = 1431 ms
    armeabi-v7a GtsUsageStatsTestCases => prep = 7673 ms || clean = 2072 ms
    armeabi-v7a GtsAfwTestCases => prep = 3716 ms || clean = 1389 ms
    armeabi-v7a GtsStorageTestCases => prep = 5485 ms || clean = 1682 ms
    armeabi-v7a GtsVndkDependencyTestCases => prep = 0 ms || clean = 776 ms
    armeabi-v7a GtsDozeDeviceTestCases => prep = 4637 ms || clean = 1439 ms
    armeabi-v7a GtsPackageManagerHostTestCases => prep = 0 ms || clean = 770 ms
    armeabi-v7a GtsKidsHomeHostTestCases => prep = 0 ms || clean = 781 ms
    armeabi-v7a GtsDeviceConfigTestCases => prep = 1585 ms || clean = 1441 ms
    armeabi-v7a GtsThemingTestCases => prep = 4474 ms || clean = 1448 ms
    armeabi-v7a GtsAppVisibilityDeviceTestCases => prep = 5084 ms || clean = 2007 ms
    armeabi-v7a GtsPermissionControllerHostTestCases => prep = 256 ms || clean = 939 ms
    armeabi-v7a GtsUnofficialApisUsageTestCases => prep = 444 ms || clean = 738 ms
    armeabi-v7a GtsLocationHostTestCases => prep = 7 ms || clean = 811 ms
    armeabi-v7a CtsEdiHostTestCases => prep = 0 ms || clean = 728 ms
    armeabi-v7a GtsDevicePolicyTestCases => prep = 8493 ms || clean = 1499 ms
    armeabi-v7a GtsPreserveLegacyStorageHostTest => prep = 12214 ms || clean = 936 ms
    armeabi-v7a GtsHealthConnectTests => prep = 4919 ms || clean = 1500 ms
    armeabi-v7a GtsBootHealthHostTestCases => prep = 0 ms || clean = 740 ms
    armeabi-v7a GtsYouTubeTestCases => prep = 44794 ms || clean = 1799 ms
    armeabi-v7a GtsBackupTestCases => prep = 13854 ms || clean = 3959 ms
    armeabi-v7a GtsSetupWizardNoPermissionTestCases => prep = 3788 ms || clean = 1468 ms
    armeabi-v7a GtsSetupWizardHostTestCases => prep = 3819 ms || clean = 1342 ms
    armeabi-v7a GtsInstantAppsHostTestCases => prep = 0 ms || clean = 858 ms
    armeabi-v7a CtsClasspathDeviceInfoTestCases => prep = 0 ms || clean = 790 ms
    armeabi-v7a GtsCastHostTestCases => prep = 3809 ms || clean = 928 ms
    armeabi-v7a GtsWebViewHostTestCases => prep = 0 ms || clean = 957 ms
    armeabi-v7a GtsRollbackManagerTest => prep = 0 ms || clean = 1626 ms
    armeabi-v7a GtsAssistIntentTestCases => prep = 11348 ms || clean = 2988 ms
    armeabi-v7a GtsPermissionUiTestCases => prep = 7021 ms || clean = 2189 ms
    armeabi-v7a GtsPackageInstallTestCases => prep = 4947 ms || clean = 1778 ms
    armeabi-v7a GtsMemoryHostTestCases => prep = 5309 ms || clean = 1581 ms
    armeabi-v7a GtsTetheringTestCases => prep = 3923 ms || clean = 1432 ms
    armeabi-v7a GtsGmscoreHostTestCases => prep = 11623 ms || clean = 4395 ms
    armeabi-v7a GtsCNGCoreTestCases => prep = 4256 ms || clean = 1443 ms
    armeabi-v7a GtsPermissionTestCases => prep = 7183 ms || clean = 2286 ms
    armeabi-v7a GtsPackageNameCertPairsDeviceTestCases => prep = 4924 ms || clean = 1540 ms
    armeabi-v7a GtsEntertainmentSpaceDeviceTestCases => prep = 4198 ms || clean = 1429 ms
    armeabi-v7a GtsCalendarTests => prep = 3999 ms || clean = 1443 ms
    armeabi-v7a GtsAppBlacklistDeviceTestCases => prep = 5455 ms || clean = 1559 ms
    armeabi-v7a GtsBackupHostTestCases => prep = 18446 ms || clean = 6060 ms
    armeabi-v7a GtsAppTestCases => prep = 19958 ms || clean = 4288 ms
    armeabi-v7a GtsContactsTest => prep = 7159 ms || clean = 1507 ms
    armeabi-v7a GtsTelephonyTestCases => prep = 7250 ms || clean = 2053 ms
    armeabi-v7a GtsTvBugReportTestCases => prep = 4006 ms || clean = 1530 ms
    armeabi-v7a GtsSensorHostTestCases => prep = 0 ms || clean = 835 ms
    armeabi-v7a GtsIncidentManagerTestCases => prep = 4099 ms || clean = 1463 ms
    armeabi-v7a GtsDevicePolicyGmsInstrumentationTestCases => prep = 8650 ms || clean = 1410 ms
    armeabi-v7a GtsOemLockServiceTestCases => prep = 12191 ms || clean = 1587 ms
    armeabi-v7a GtsWellbeingHostTestCases => prep = 2360 ms || clean = 1527 ms
    armeabi-v7a GtsCameraTestCases => prep = 4173 ms || clean = 1467 ms
    armeabi-v7a GtsSimAppDialogTestCases => prep = 3865 ms || clean = 1430 ms
    armeabi-v7a GtsNetStatsHostTestCases => prep = 7607 ms || clean = 2476 ms
    armeabi-v7a GtsAdminTestCases => prep = 3856 ms || clean = 1384 ms
    armeabi-v7a GtsVoiceInteractionHostTestCases => prep = 7 ms || clean = 723 ms
    armeabi-v7a GtsWellbeingTestCases => prep = 5188 ms || clean = 1417 ms
    armeabi-v7a GtsContextHubPermissionDeviceTestCases => prep = 5102 ms || clean = 1553 ms
    armeabi-v7a GtsIntelligenceTestCases => prep = 3869 ms || clean = 1390 ms
    armeabi-v7a GtsNmgiarcTestCases => prep = 5175 ms || clean = 1569 ms
    armeabi-v7a GtsLocationTestCases => prep = 8228 ms || clean = 1635 ms
    armeabi-v7a GtsPackageInstallerTapjackingTestCases => prep = 5018 ms || clean = 2201 ms
    armeabi-v7a GtsPropertiesTestCases => prep = 4451 ms || clean = 1388 ms
    armeabi-v7a GtsSsaidHostTestCases => prep = 3773 ms || clean = 2302 ms
    armeabi-v7a GtsPackageUninstallTestCases => prep = 5110 ms || clean = 2117 ms
    armeabi-v7a GtsPlacementTestCases => prep = 5321 ms || clean = 1630 ms
    armeabi-v7a GtsSecurityHostTestCases => prep = 698 ms || clean = 1134 ms
    armeabi-v7a GtsAssistantHostTestCases => prep = 5074 ms || clean = 1316 ms
    armeabi-v7a GtsEdiHostTestCases => prep = 4574 ms || clean = 1499 ms
    armeabi-v7a GtsPlayStoreHostTestCases => prep = 7322 ms || clean = 4052 ms
    armeabi-v7a GtsPartnerBookmarksTestCases => prep = 3829 ms || clean = 1339 ms
    armeabi-v7a GtsPlayAutoInstallTestCases => prep = 3970 ms || clean = 1404 ms
    armeabi-v7a GtsFeaturesTestCases => prep = 2973 ms || clean = 1806 ms
    armeabi-v7a GtsNotificationTestCases => prep = 1745 ms || clean = 1515 ms
    armeabi-v7a GtsNetTestCases => prep = 6185 ms || clean = 1590 ms
    armeabi-v7a GtsSearchHostTestCases => prep = 7 ms || clean = 696 ms
    armeabi-v7a GtsRegulationComplianceTestCases => prep = 3803 ms || clean = 1334 ms
    armeabi-v7a GtsSuspendAppsPermissionTestCases => prep = 5211 ms || clean = 2037 ms
    armeabi-v7a GtsNoPermissionTestCases => prep = 4832 ms || clean = 1728 ms
    armeabi-v7a GtsSafetyCenterTestCases => prep = 3946 ms || clean = 1399 ms
    armeabi-v7a GtsSpeechServicesTestCases => prep = 3936 ms || clean = 1389 ms
    armeabi-v7a GtsNetworkStackHostTestCases => prep = 8 ms || clean = 775 ms
    armeabi-v7a GtsSupervisionTestCases => prep = 3940 ms || clean = 1385 ms
    armeabi-v7a GtsPackageRoleEnforcementTests => prep = 4078 ms || clean = 1445 ms
    armeabi-v7a GtsInstallPackagesWhitelistDeviceTestCases => prep = 5402 ms || clean = 1645 ms
    armeabi-v7a GtsStagedInstallHostTestCases => prep = 10007 ms || clean = 2584 ms
    armeabi-v7a GtsExoPlayerTestCases => prep = 6028 ms || clean = 1851 ms
    armeabi-v7a GtsMbaPrivilegedPermissionTestCases => prep = 4010 ms || clean = 1488 ms
    armeabi-v7a GtsContentHostTestCases => prep = 3864 ms || clean = 1444 ms
    armeabi-v7a GtsBootStatsTestCases => prep = 0 ms || clean = 1962 ms
    armeabi-v7a GtsStatsdHostTestCases => prep = 12293 ms || clean = 1455 ms
    armeabi-v7a GtsDuoReadyTestCases => prep = 6357 ms || clean = 1851 ms
    armeabi-v7a GtsModuleMetadataTestCases => prep = 4084 ms || clean = 1406 ms
    armeabi-v7a GtsNoPermissionTestCases25 => prep = 5523 ms || clean = 1723 ms
    armeabi-v7a GtsSettingsTestCases => prep = 3871 ms || clean = 1497 ms
    armeabi-v7a GtsSettingsHostTestCases => prep = 0 ms || clean = 1404 ms
    armeabi-v7a GtsScreenshotHostTestCases => prep = 7 ms || clean = 726 ms
    armeabi-v7a GtsTvHostTestCases => prep = 0 ms || clean = 958 ms
    armeabi-v7a GtsLensTestCases => prep = 4349 ms || clean = 1485 ms
    armeabi-v7a GtsLargeApkHostTestCases => prep = 0 ms || clean = 989 ms
    armeabi-v7a GtsSuspendAppsTestCases => prep = 8271 ms || clean = 3375 ms
    armeabi-v7a GtsCallLogTestCases => prep = 4174 ms || clean = 1497 ms
    armeabi-v7a GtsPrintTestCases => prep = 4832 ms || clean = 1461 ms
    armeabi-v7a GtsEntertainmentSpaceHostTestCases => prep = 0 ms || clean = 725 ms
    armeabi-v7a GtsGraphicsHostTestCases => prep = 0 ms || clean = 740 ms
    armeabi-v7a GtsRlzTestCases => prep = 3763 ms || clean = 1527 ms
    armeabi-v7a GtsTvTestCases => prep = 5069 ms || clean = 2489 ms
    armeabi-v7a GtsSmartBatteryDeviceTestCases => prep = 4204 ms || clean = 1408 ms
    armeabi-v7a GtsWallpaperTestCases => prep = 3864 ms || clean = 1388 ms
    armeabi-v7a GtsContactsAppDeviceTestCases => prep = 4266 ms || clean = 1522 ms
    armeabi-v7a GtsWebViewTestCases => prep = 3929 ms || clean = 1361 ms
    armeabi-v7a GtsPersonalSafetyTestCases => prep = 4092 ms || clean = 1448 ms
    armeabi-v7a GtsGameOverlayTestCases => prep = 0 ms || clean = 716 ms
    armeabi-v7a GtsUserspaceRebootHostSideTestCases => prep = 0 ms || clean = 739 ms
    armeabi-v7a GtsMediaTestCases => prep = 14756 ms || clean = 5746 ms
    armeabi-v7a GtsMemoryTestCases => prep = 6057 ms || clean = 1619 ms
    armeabi-v7a GtsHomeHostTestCases => prep = 127 ms || clean = 778 ms
    armeabi-v7a GtsNetworkWatchlistTestCases => prep = 4613 ms || clean = 1487 ms
    armeabi-v7a GtsTelecomManagerTests => prep = 3942 ms || clean = 1459 ms
    armeabi-v7a GtsIncrementalInstallProxyHostTestCases => prep = 1907 ms || clean = 2288 ms
    armeabi-v7a GtsDozeHostSideTestCases => prep = 3869 ms || clean = 1309 ms
    armeabi-v7a GtsFilesByGoogleTestCases => prep = 3785 ms || clean = 1447 ms
    armeabi-v7a GtsTelephonyNumberVerificationHostCases => prep = 0 ms || clean = 944 ms
    armeabi-v7a GtsContentTestCases => prep = 5476 ms || clean = 1538 ms
    armeabi-v7a GtsAssistantMicHostTestCases => prep = 4042 ms || clean = 1307 ms
    armeabi-v7a GtsDialerAudioTestCases => prep = 5507 ms || clean = 1750 ms
Total preparation time: 10m 22s  ||  Total tear down time: 3m 32s
=======================================================
=============== Summary ===============
Total Run time: 47m 16s
131/132 modules completed
Module(s) with run failure(s):
    armeabi-v7a CtsScopedStorageHostTest: There were 4 failures:
  com.android.tradefed.targetprep.TargetSetupError[APK_INSTALLATION_FAILED|520001|DEPENDENCY_ISSUE]: Failed to install android.scopedstorage.cts.testapp.A.withres with [/data/tmp/b4ce2492-836b-4d44-910a-221d6bdb6af3/android-gts/testcases/CtsScopedStorageHostTest/CtsScopedStorageTestAppA.apk] on SKBFXYZO0DKW. Reason: 'INSTALL_FAILED_OLDER_SDK: Failed parse during installPackageLI: /data/app/vmdl27925661.tmp/base.apk (at Binary XML file line #18): Requires newer sdk version #30 (current version is #29)' [SKBFXYZO0DKW bfx-at100:bfx-at100 QTT5.200429.010]
	at com.android.tradefed.targetprep.TestAppInstallSetup.installSinglePackage(TestAppInstallSetup.java:558)
	at com.android.tradefed.targetprep.TestAppInstallSetup.installer(TestAppInstallSetup.java:525)
	at com.android.tradefed.targetprep.TestAppInstallSetup.setUp(TestAppInstallSetup.java:413)
	at com.android.tradefed.testtype.suite.ModuleDefinition.runPreparerSetup(ModuleDefinition.java:999)
	at com.android.tradefed.testtype.suite.ModuleDefinition.runTargetPreparation(ModuleDefinition.java:1432)
	at com.android.tradefed.testtype.suite.ModuleDefinition.runPreparation(ModuleDefinition.java:958)
	at com.android.tradefed.testtype.suite.ModuleDefinition.run(ModuleDefinition.java:484)
	at com.android.tradefed.testtype.suite.ITestSuite.runSingleModule(ITestSuite.java:937)
	at com.android.tradefed.testtype.suite.ITestSuite.run(ITestSuite.java:817)
	at com.android.tradefed.invoker.shard.TestsPoolPoller.run(TestsPoolPoller.java:161)
	at com.android.tradefed.invoker.InvocationExecution.runTest(InvocationExecution.java:1336)
	at com.android.tradefed.invoker.InvocationExecution.runTests(InvocationExecution.java:1115)
	at com.android.tradefed.invoker.TestInvocation.prepareAndRun(TestInvocation.java:617)
	at com.android.tradefed.invoker.TestInvocation.performInvocation(TestInvocation.java:275)
	at com.android.tradefed.invoker.TestInvocation.invoke(TestInvocation.java:1335)
	at com.android.tradefed.command.CommandScheduler$InvocationThread.run(CommandScheduler.java:678)

  com.android.tradefed.targetprep.TargetSetupError[APK_INSTALLATION_FAILED|520001|DEPENDENCY_ISSUE]: Failed to install android.scopedstorage.cts.testapp.A.withres with [/data/tmp/b4ce2492-836b-4d44-910a-221d6bdb6af3/android-gts/testcases/CtsScopedStorageHostTest/CtsScopedStorageTestAppA.apk] on SKBFX9C72A9. Reason: 'INSTALL_FAILED_OLDER_SDK: Failed parse during installPackageLI: /data/app/vmdl1467677354.tmp/base.apk (at Binary XML file line #18): Requires newer sdk version #30 (current version is #29)' [SKBFX9C72A9 bfx-at100:bfx-at100 QTT5.200429.010]
	at com.android.tradefed.targetprep.TestAppInstallSetup.installSinglePackage(TestAppInstallSetup.java:558)
	at com.android.tradefed.targetprep.TestAppInstallSetup.installer(TestAppInstallSetup.java:525)
	at com.android.tradefed.targetprep.TestAppInstallSetup.setUp(TestAppInstallSetup.java:413)
	at com.android.tradefed.testtype.suite.ModuleDefinition.runPreparerSetup(ModuleDefinition.java:999)
	at com.android.tradefed.testtype.suite.ModuleDefinition.runTargetPreparation(ModuleDefinition.java:1432)
	at com.android.tradefed.testtype.suite.ModuleDefinition.runPreparation(ModuleDefinition.java:958)
	at com.android.tradefed.testtype.suite.ModuleDefinition.run(ModuleDefinition.java:484)
	at com.android.tradefed.testtype.suite.ITestSuite.runSingleModule(ITestSuite.java:937)
	at com.android.tradefed.testtype.suite.ITestSuite.run(ITestSuite.java:817)
	at com.android.tradefed.invoker.shard.TestsPoolPoller.run(TestsPoolPoller.java:161)
	at com.android.tradefed.invoker.InvocationExecution.runTest(InvocationExecution.java:1336)
	at com.android.tradefed.invoker.InvocationExecution.runTests(InvocationExecution.java:1115)
	at com.android.tradefed.invoker.TestInvocation.prepareAndRun(TestInvocation.java:617)
	at com.android.tradefed.invoker.TestInvocation.performInvocation(TestInvocation.java:275)
	at com.android.tradefed.invoker.TestInvocation.invoke(TestInvocation.java:1335)
	at com.android.tradefed.command.CommandScheduler$InvocationThread.run(CommandScheduler.java:678)

  com.android.tradefed.targetprep.TargetSetupError[APK_INSTALLATION_FAILED|520001|DEPENDENCY_ISSUE]: Failed to install android.scopedstorage.cts.testapp.A.withres with [/data/tmp/b4ce2492-836b-4d44-910a-221d6bdb6af3/android-gts/testcases/CtsScopedStorageHostTest/CtsScopedStorageTestAppA.apk] on SKBFX9C72A9. Reason: 'INSTALL_FAILED_OLDER_SDK: Failed parse during installPackageLI: /data/app/vmdl293535427.tmp/base.apk (at Binary XML file line #18): Requires newer sdk version #30 (current version is #29)' [SKBFX9C72A9 bfx-at100:bfx-at100 QTT5.200429.010]
	at com.android.tradefed.targetprep.TestAppInstallSetup.installSinglePackage(TestAppInstallSetup.java:558)
	at com.android.tradefed.targetprep.TestAppInstallSetup.installer(TestAppInstallSetup.java:525)
	at com.android.tradefed.targetprep.TestAppInstallSetup.setUp(TestAppInstallSetup.java:413)
	at com.android.tradefed.testtype.suite.ModuleDefinition.runPreparerSetup(ModuleDefinition.java:999)
	at com.android.tradefed.testtype.suite.ModuleDefinition.runTargetPreparation(ModuleDefinition.java:1432)
	at com.android.tradefed.testtype.suite.ModuleDefinition.runPreparation(ModuleDefinition.java:958)
	at com.android.tradefed.testtype.suite.ModuleDefinition.run(ModuleDefinition.java:484)
	at com.android.tradefed.testtype.suite.ITestSuite.runSingleModule(ITestSuite.java:937)
	at com.android.tradefed.testtype.suite.ITestSuite.run(ITestSuite.java:817)
	at com.android.tradefed.invoker.shard.TestsPoolPoller.run(TestsPoolPoller.java:161)
	at com.android.tradefed.invoker.InvocationExecution.runTest(InvocationExecution.java:1336)
	at com.android.tradefed.invoker.InvocationExecution.runTests(InvocationExecution.java:1115)
	at com.android.tradefed.invoker.TestInvocation.prepareAndRun(TestInvocation.java:617)
	at com.android.tradefed.invoker.TestInvocation.performInvocation(TestInvocation.java:275)
	at com.android.tradefed.invoker.TestInvocation.invoke(TestInvocation.java:1335)
	at com.android.tradefed.command.CommandScheduler$InvocationThread.run(CommandScheduler.java:678)

  com.android.tradefed.targetprep.TargetSetupError[APK_INSTALLATION_FAILED|520001|DEPENDENCY_ISSUE]: Failed to install android.scopedstorage.cts.testapp.A.withres with [/data/tmp/b4ce2492-836b-4d44-910a-221d6bdb6af3/android-gts/testcases/CtsScopedStorageHostTest/CtsScopedStorageTestAppA.apk] on SKBFX9C72A9. Reason: 'INSTALL_FAILED_OLDER_SDK: Failed parse during installPackageLI: /data/app/vmdl53144764.tmp/base.apk (at Binary XML file line #18): Requires newer sdk version #30 (current version is #29)' [SKBFX9C72A9 bfx-at100:bfx-at100 QTT5.200429.010]
	at com.android.tradefed.targetprep.TestAppInstallSetup.installSinglePackage(TestAppInstallSetup.java:558)
	at com.android.tradefed.targetprep.TestAppInstallSetup.installer(TestAppInstallSetup.java:525)
	at com.android.tradefed.targetprep.TestAppInstallSetup.setUp(TestAppInstallSetup.java:413)
	at com.android.tradefed.testtype.suite.ModuleDefinition.runPreparerSetup(ModuleDefinition.java:999)
	at com.android.tradefed.testtype.suite.ModuleDefinition.runTargetPreparation(ModuleDefinition.java:1432)
	at com.android.tradefed.testtype.suite.ModuleDefinition.runPreparation(ModuleDefinition.java:958)
	at com.android.tradefed.testtype.suite.ModuleDefinition.run(ModuleDefinition.java:484)
	at com.android.tradefed.testtype.suite.ITestSuite.runSingleModule(ITestSuite.java:937)
	at com.android.tradefed.testtype.suite.ITestSuite.run(ITestSuite.java:817)
	at com.android.tradefed.invoker.shard.TestsPoolPoller.run(TestsPoolPoller.java:161)
	at com.android.tradefed.invoker.InvocationExecution.runTest(InvocationExecution.java:1336)
	at com.android.tradefed.invoker.InvocationExecution.runTests(InvocationExecution.java:1115)
	at com.android.tradefed.invoker.TestInvocation.prepareAndRun(TestInvocation.java:617)
	at com.android.tradefed.invoker.TestInvocation.performInvocation(TestInvocation.java:275)
	at com.android.tradefed.invoker.TestInvocation.invoke(TestInvocation.java:1335)
	at com.android.tradefed.command.CommandScheduler$InvocationThread.run(CommandScheduler.java:678)

Total Tests       : 2034
PASSED            : 1315
FAILED            : 13
IGNORED           : 12
ASSUMPTION_FAILURE: 630
IMPORTANT: Some modules failed to run to completion, tests counts may be inaccurate.
Shard 0 used: [SKBFX9C72A9]
Shard 1 used: [SKBFXYZO0DKW]
============== End of Results ==============
============================================
