Summary
Suite / PlanCTS / cts
Suite / Build10_r9 / 7506083
Host Info Result/@start jason-VirtualBox (Linux - 4.15.0-142-generic)
Start time / End TimeThu Sep 16 09:28:07 CST 2021 / Thu Sep 16 09:29:53 CST 2021
Tests Passed0
Tests Failed1
Modules Done1
Modules Total1
FingerprintSKB/BFX_UA300/BFX-UA300:10/QT/19.531.16-20210825:user/release-keys
Security Patch2021-07-05
Release (SDK)10 (29)
ABIsarmeabi-v7a,armeabi

ModulePassedFailedAssumption FailureIgnoredTotal TestsDone
armeabi-v7a CtsAppSecurityHostTestCases01001true

Failed Tests (1)

armeabi-v7a CtsAppSecurityHostTestCases
TestResultDetails
android.appsecurity.cts.PermissionsHostTest#testGrantPreviouslyRevokedWithPrejudiceShowsPrompt23
fail
java.lang.AssertionError: Expected: (an instance of java.lang.AssertionError and has message that a string containing "Process crashed") but: was null at org.hamcrest.MatcherAssert.assertThat(MatcherAssert.java:18) at org.junit.Assert.assertThat(Assert.java:956) at org.junit.Assert.assertThat(Assert.java:923) at android.appsecurity.cts.MatcherUtils.assertOrRethrow(MatcherUtils.java:117) at android.appsecurity.cts.MatcherUtils.assertThrows(MatcherUtils.java:107) at android.appsecurity.cts.PermissionsHostTest.runThrowingTest(PermissionsHostTest.java:560) at android.appsecurity.cts.PermissionsHostTest.testGrantPreviouslyRevokedWithPrejudiceShowsPrompt23(PermissionsHostTest.java:269) at sun.reflect.NativeMethodAccessorImpl.invoke0(java.base@9-internal/Native Method) at sun.reflect.NativeMethodAccessorImpl.invoke(java.base@9-internal/NativeMethodAccessorImpl.java:62) at sun.reflect.DelegatingMethodAccessorImpl.invoke(java.base@9-internal/DelegatingMethodAccessorImpl.java:43) at java.lang.reflect.Method.invoke(java.base@9-internal/Method.java:531) at junit.framework.TestCase.runTest(TestCase.java:176) at junit.framework.TestCase.runBare(TestCase.java:141) at com.android.tradefed.testtype.DeviceTestResult$1.protect(DeviceTestResult.java:90) at com.android.tradefed.testtype.DeviceTestResult.runProtected(DeviceTestResult.java:65) at com.android.tradefed.testtype.DeviceTestResult.run(DeviceTestResult.java:94) at junit.framework.TestCase.run(TestCase.java:129) at com.android.tradefed.testtype.DeviceTestCase.run(DeviceTestCase.java:181) at com.android.tradefed.testtype.JUnitRunUtil.runTest(JUnitRunUtil.java:53) at com.android.tradefed.testtype.JUnitRunUtil.runTest(JUnitRunUtil.java:37) at com.android.tradefed.testtype.DeviceTestCase.run(DeviceTestCase.java:146) at com.android.tradefed.testtype.HostTest.runRemoteTest(HostTest.java:608) at com.android.tradefed.testtype.HostTest.runTestClasses(HostTest.java:535) at com.android.tradefed.testtype.HostTest.run(HostTest.java:525) at com.android.compatibility.common.tradefed.testtype.JarHostTest.run(JarHostTest.java:53) at com.android.tradefed.testtype.suite.GranularRetriableTestWrapper.intraModuleRun(GranularRetriableTestWrapper.java:413) at com.android.tradefed.testtype.suite.GranularRetriableTestWrapper.run(GranularRetriableTestWrapper.java:229) at com.android.tradefed.testtype.suite.ModuleDefinition.run(ModuleDefinition.java:466) at com.android.tradefed.testtype.suite.ITestSuite.runSingleModule(ITestSuite.java:691) at com.android.tradefed.testtype.suite.ITestSuite.run(ITestSuite.java:592) at com.android.tradefed.invoker.InvocationExecution.runTests(InvocationExecution.java:480) at com.android.tradefed.invoker.TestInvocation.prepareAndRun(TestInvocation.java:380) at com.android.tradefed.invoker.TestInvocation.performInvocation(TestInvocation.java:230) at com.android.tradefed.invoker.TestInvocation.invoke(TestInvocation.java:754) at com.android.tradefed.command.CommandScheduler$InvocationThread.run(CommandScheduler.java:594)

armeabi-v7a CtsAppSecurityHostTestCases
TestResultDetails
android.appsecurity.cts.PermissionsHostTest#testGrantPreviouslyRevokedWithPrejudiceShowsPrompt23
fail
java.lang.AssertionError: