12-12 15:00:56 D/Configuration: Resolve and download remote files from @Option
12-12 15:00:56 I/TestInvocation: Invocation was started with cmd: cts -m CtsAppTestCases -t android.app.cts.DownloadManagerTest#testDownloadManagerSupportsHttpsWithExternalWebServer -s SKBFXYVX173T
12-12 15:00:56 D/InvocationExecution: Skip linking external directory as FileProperty was set.
12-12 15:00:56 D/RunUtil: Running command [adb, version] with timeout: 2m 0s
12-12 15:00:56 D/TestInvocation: Fetch build duration: 15 ms
12-12 15:00:56 D/ArtifactsAnalyzer: Build analysis report: BuildAnalysis [mDeviceImageChanged=true, mHasTestsArtifacts=true, mHasChangesInTests=false, imageDigests={}, artifactDigests={}]
12-12 15:00:56 D/ArtifactsAnalyzer: Analysis report after test analysis: BuildAnalysis [mDeviceImageChanged=true, mHasTestsArtifacts=true, mHasChangesInTests=true, imageDigests={}, artifactDigests={testsdir=null}]
12-12 15:00:56 D/RunUtil: Running command [adb, -s, SKBFXYVX173T, shell, getprop, ro.build.version.sdk] with timeout: 45s
12-12 15:00:56 D/GlobalTestFilter: Setting up global filters
12-12 15:00:56 D/InvocationExecution: IShardHelper selected: com.android.tradefed.invoker.shard.StrictShardHelper@a288aed
12-12 15:00:56 D/BackgroundDeviceAction: Waiting for device SKBFXYVX173T online before starting.
12-12 15:00:56 D/BackgroundDeviceAction: Device SKBFXYVX173T now online.
12-12 15:00:56 D/BackgroundDeviceAction: Starting logcat for SKBFXYVX173T.
12-12 15:00:56 I/TestInvocation: Starting invocation for 'cts' with '[ DeviceBuildInfo{bid=13441469, serial=SKBFXYVX173T} on device 'SKBFXYVX173T'] 
12-12 15:00:56 D/FileUtil: Creating temp directory at /tmp/13441469/cts with prefix "inv_"
12-12 15:00:56 D/RunUtil: Running command [chmod, ug+rwx, /tmp/13441469/cts/inv_12648427467095576587] with timeout: 10s
12-12 15:00:56 D/FileSystemLogSaver: Using log file directory /tmp/13441469/cts/inv_12648427467095576587
12-12 15:00:56 D/FileUtil: Creating temp directory at /tmp/13441469/cts/inv_12648427467095576587 with prefix "inv_"
12-12 15:00:56 I/LogFileSaver: Using log file directory /tmp/13441469/cts/inv_12648427467095576587/inv_2368518573660175600
12-12 15:00:56 D/CertificationSuiteResultReporter: Initializing result directory
12-12 15:00:56 D/CertificationSuiteResultReporter: Results Directory: /tmp/xts-root-dir-fa5dd1c2-3ba7-4cdd-9904-a00e7a84339f/android-cts/results/2025.12.12_15.00.56
12-12 15:00:56 D/CertificationSuiteResultReporter: Created log dir /tmp/xts-root-dir-fa5dd1c2-3ba7-4cdd-9904-a00e7a84339f/android-cts/logs/2025.12.12_15.00.56
12-12 15:00:56 D/FileUtil: Creating temp directory at /tmp/xts-root-dir-fa5dd1c2-3ba7-4cdd-9904-a00e7a84339f/android-cts/logs/2025.12.12_15.00.56 with prefix "inv_"
12-12 15:00:56 I/LogFileSaver: Using log file directory /tmp/xts-root-dir-fa5dd1c2-3ba7-4cdd-9904-a00e7a84339f/android-cts/logs/2025.12.12_15.00.56/inv_18424983443859154131
12-12 15:00:56 D/CompatibilityProtoResultReporter: Proto Results Directory: /tmp/xts-root-dir-fa5dd1c2-3ba7-4cdd-9904-a00e7a84339f/android-cts/results/2025.12.12_15.00.56/proto
12-12 15:00:56 D/FileUtil: Creating temp file at /tmp/xts-root-dir-fa5dd1c2-3ba7-4cdd-9904-a00e7a84339f/android-cts/results/2025.12.12_15.00.56/proto with prefix "tmp-proto" suffix ""
12-12 15:00:56 D/CompatibilityProtoResultReporter: Proto Results Directory: /tmp/xts-root-dir-fa5dd1c2-3ba7-4cdd-9904-a00e7a84339f/android-cts/results/2025.12.12_15.00.56/proto
12-12 15:00:56 D/LogFileSaver: Log data for tradefed-expanded-config is already compressed, skipping compression
12-12 15:00:56 D/FileUtil: Creating temp file at /tmp/xts-root-dir-fa5dd1c2-3ba7-4cdd-9904-a00e7a84339f/android-cts/logs/2025.12.12_15.00.56/inv_18424983443859154131 with prefix "tradefed-expanded-config_" suffix ".xml"
12-12 15:00:56 I/LogFileSaver: Saved log file /tmp/xts-root-dir-fa5dd1c2-3ba7-4cdd-9904-a00e7a84339f/android-cts/logs/2025.12.12_15.00.56/inv_18424983443859154131/tradefed-expanded-config_15252011073713345259.xml. [size=34765, elapsed=1ms]
12-12 15:00:56 D/CertificationSuiteResultReporter: Saved logs for tradefed-expanded-config in /tmp/xts-root-dir-fa5dd1c2-3ba7-4cdd-9904-a00e7a84339f/android-cts/logs/2025.12.12_15.00.56/inv_18424983443859154131/tradefed-expanded-config_15252011073713345259.xml
12-12 15:00:56 D/LogFileSaver: Log data for tradefed-expanded-config is already compressed, skipping compression
12-12 15:00:56 D/FileUtil: Creating temp file at /tmp/13441469/cts/inv_12648427467095576587/inv_2368518573660175600 with prefix "tradefed-expanded-config_" suffix ".xml"
12-12 15:00:56 I/LogFileSaver: Saved log file /tmp/13441469/cts/inv_12648427467095576587/inv_2368518573660175600/tradefed-expanded-config_7919139164401403076.xml. [size=34765, elapsed=1ms]
12-12 15:00:56 D/InvocationExecution: Starting device pre invocation setup for : 'SKBFXYVX173T'
12-12 15:00:56 D/DefaultConnection: Instance type for connection: GCE
12-12 15:00:56 D/DefaultConnection: Instance type for connection: GCE. Evaluating for connection type.
12-12 15:00:56 D/NativeDevice: Using connection: com.android.tradefed.device.connection.DefaultConnection@7d920c5d (SKBFXYVX173T)
12-12 15:00:56 I/CommandInterrupter: Interrupt allowed
12-12 15:00:56 D/InvocationExecution: Starting setup for device: 'SKBFXYVX173T'
12-12 15:00:56 D/InvocationExecution: starting preparer 'com.android.compatibility.common.tradefed.targetprep.DeviceFileCollector@73537c29' on device: 'SKBFXYVX173T'
12-12 15:00:56 D/RunUtil: Running command [adb, -s, SKBFXYVX173T, shell, getprop, ro.treble.enabled] with timeout: 45s
12-12 15:00:56 D/NativeDevice: Using 'ls' to check doesFileExist(/sys/fs/selinux/policy)
12-12 15:00:56 D/RunUtil: Running command [adb, -s, SKBFXYVX173T, shell, ls, '/sys/fs/selinux/policy'] with timeout: 2m 0s
12-12 15:00:57 D/InvocationExecution: done with preparer 'com.android.compatibility.common.tradefed.targetprep.DeviceFileCollector@73537c29' on device: 'SKBFXYVX173T' in 159 ms
12-12 15:00:57 D/InvocationExecution: starting preparer 'com.android.compatibility.common.tradefed.targetprep.DeviceFileCollector@1f7e6cb5' on device: 'SKBFXYVX173T'
12-12 15:00:57 D/NativeDevice: Using property ro.treble.enabled=true from cache.
12-12 15:00:57 D/NativeDevice: Using 'ls' to check doesFileExist(/proc/config.gz)
12-12 15:00:57 D/RunUtil: Running command [adb, -s, SKBFXYVX173T, shell, ls, '/proc/config.gz'] with timeout: 2m 0s
12-12 15:00:57 D/InvocationExecution: done with preparer 'com.android.compatibility.common.tradefed.targetprep.DeviceFileCollector@1f7e6cb5' on device: 'SKBFXYVX173T' in 70 ms
12-12 15:00:57 D/InvocationExecution: starting preparer 'com.android.compatibility.common.tradefed.targetprep.DynamicConfigPusher@33c63d68' on device: 'SKBFXYVX173T'
12-12 15:00:57 I/UrlReplacement: UrlReplacement file [/home/dev2-google01/android-cts/android-cts-12_r16-linux_x86-arm/android-cts/tools/UrlReplacement.xml] does not exist
12-12 15:00:57 D/InvocationExecution: done with preparer 'com.android.compatibility.common.tradefed.targetprep.DynamicConfigPusher@33c63d68' on device: 'SKBFXYVX173T' in 483 ms
12-12 15:00:57 D/InvocationExecution: starting preparer 'com.android.compatibility.common.tradefed.targetprep.StayAwakePreparer@27a36f17' on device: 'SKBFXYVX173T'
12-12 15:00:57 D/InvocationExecution: done with preparer 'com.android.compatibility.common.tradefed.targetprep.StayAwakePreparer@27a36f17' on device: 'SKBFXYVX173T' in 108 ms
12-12 15:00:57 D/InvocationExecution: starting preparer 'com.android.compatibility.common.tradefed.targetprep.PackageDisabler@7ec4519b' on device: 'SKBFXYVX173T'
12-12 15:00:57 D/InvocationExecution: done with preparer 'com.android.compatibility.common.tradefed.targetprep.PackageDisabler@7ec4519b' on device: 'SKBFXYVX173T' in 101 ms
12-12 15:00:57 D/InvocationExecution: starting preparer 'com.android.compatibility.common.tradefed.targetprep.SettingsPreparer@18b47d76' on device: 'SKBFXYVX173T'
12-12 15:00:57 D/SettingsPreparer: Setting verifier_verify_adb_installs to value 0
12-12 15:00:57 D/InvocationExecution: done with preparer 'com.android.compatibility.common.tradefed.targetprep.SettingsPreparer@18b47d76' on device: 'SKBFXYVX173T' in 64 ms
12-12 15:00:57 D/InvocationExecution: starting preparer 'com.android.compatibility.common.tradefed.targetprep.SettingsPreparer@7b3e1848' on device: 'SKBFXYVX173T'
12-12 15:00:57 D/SettingsPreparer: Setting hide_error_dialogs to value 1
12-12 15:00:57 D/InvocationExecution: done with preparer 'com.android.compatibility.common.tradefed.targetprep.SettingsPreparer@7b3e1848' on device: 'SKBFXYVX173T' in 65 ms
12-12 15:00:57 D/InvocationExecution: starting preparer 'com.android.compatibility.common.tradefed.targetprep.ApkPreconditionCheck@b828d33' on device: 'SKBFXYVX173T'
12-12 15:00:57 D/SearchArtifactUtil: Searching for file CtsPreconditions.apk. Search directories: [/tmp/xts-root-dir-fa5dd1c2-3ba7-4cdd-9904-a00e7a84339f/android-cts/testcases, /tmp/tf-workfolder16635743860164734351]
12-12 15:00:58 D/SearchArtifactUtil: Found file /tmp/xts-root-dir-fa5dd1c2-3ba7-4cdd-9904-a00e7a84339f/android-cts/testcases/CtsPreconditions.apk in search directory /tmp/xts-root-dir-fa5dd1c2-3ba7-4cdd-9904-a00e7a84339f/android-cts/testcases.
12-12 15:00:58 I/NativeDeviceStateMonitor: Device SKBFXYVX173T is already ONLINE
12-12 15:00:58 I/NativeDeviceStateMonitor: Waiting 360000 ms for device SKBFXYVX173T boot complete
12-12 15:00:58 I/DeviceStateMonitor: Waiting 359961 ms for device SKBFXYVX173T package manager
12-12 15:00:58 I/NativeDeviceStateMonitor: Waiting 359899 ms for device SKBFXYVX173T external store
12-12 15:00:58 I/ApkInstrumentationPreparer: Instrumenting package: com.android.preconditions.cts
12-12 15:00:58 D/NativeDevice: Using property ro.build.version.sdk=31 from cache.
12-12 15:00:58 D/RunUtil: Running command [adb, -s, SKBFXYVX173T, shell, getprop, ro.build.version.codename] with timeout: 45s
12-12 15:00:58 D/NativeDevice: Using property ro.build.version.sdk=31 from cache.
12-12 15:00:58 D/NativeDevice: Using property ro.build.version.codename=REL from cache.
12-12 15:00:58 D/AndroidJUnitTest: Disabled test storage as it's not supported on that branch.
12-12 15:00:58 D/NativeDevice: Using property ro.build.version.sdk=31 from cache.
12-12 15:00:58 D/NativeDevice: Using property ro.build.version.codename=REL from cache.
12-12 15:00:58 D/NativeDevice: Using property ro.build.version.sdk=31 from cache.
12-12 15:00:58 D/CtsPreconditions.apk: Uploading CtsPreconditions.apk onto device 'SKBFXYVX173T'
12-12 15:00:58 D/DeviceImpl: Uploading file onto device 'SKBFXYVX173T'
12-12 15:00:59 D/RunUtil: Running command [aapt, dump, badging, /tmp/xts-root-dir-fa5dd1c2-3ba7-4cdd-9904-a00e7a84339f/android-cts/testcases/CtsPreconditions.apk] with timeout: 1m 0s
12-12 15:00:59 D/RunUtil: Running command [aapt, dump, xmltree, /tmp/xts-root-dir-fa5dd1c2-3ba7-4cdd-9904-a00e7a84339f/android-cts/testcases/CtsPreconditions.apk, AndroidManifest.xml] with timeout: 1m 0s
12-12 15:00:59 D/RunUtil: Running command [adb, -s, SKBFXYVX173T, shell, appops, write-settings] with timeout: 2m 0s
12-12 15:01:00 D/ListInstrumentationParser: instrumentation:com.android.preconditions.cts/androidx.test.runner.AndroidJUnitRunner (target=com.android.preconditions.cts)
12-12 15:01:00 D/ListInstrumentationParser: 
12-12 15:01:00 I/InstrumentationTest: No runner name specified. Using: androidx.test.runner.AndroidJUnitRunner.
12-12 15:01:00 D/NativeDevice: Using property ro.build.version.sdk=31 from cache.
12-12 15:01:00 D/NativeDevice: Using property ro.build.version.sdk=31 from cache.
12-12 15:01:00 D/NativeDevice: Using property ro.build.version.codename=REL from cache.
12-12 15:01:00 D/InstrumentationTest: Initializing com.android.tradefed.device.metric.CountTestCasesCollector for instrumentation.
12-12 15:01:00 I/RemoteAndroidTestRunner: Running am instrument -w -r --no-isolated-storage  -e newRunListenerMode true -e timeout_msec 300000 com.android.preconditions.cts/androidx.test.runner.AndroidJUnitRunner on foxconn-bfx_at100-SKBFXYVX173T
12-12 15:01:02 D/TestDevice: Uninstalling com.android.preconditions.cts with extra args 
12-12 15:01:02 D/ApkInstrumentationPreparer: Target preparation successful
12-12 15:01:02 D/InvocationExecution: done with preparer 'com.android.compatibility.common.tradefed.targetprep.ApkPreconditionCheck@b828d33' on device: 'SKBFXYVX173T' in 4s
12-12 15:01:02 D/InvocationExecution: starting preparer 'com.android.compatibility.common.tradefed.targetprep.WifiCheck@4cd1559c' on device: 'SKBFXYVX173T'
12-12 15:01:03 I/NativeDevice: "enable-root" set to false; ignoring 'adb root' request
12-12 15:01:03 I/NativeDeviceStateMonitor: Device SKBFXYVX173T is already ONLINE
12-12 15:01:03 I/NativeDeviceStateMonitor: Waiting 359999 ms for device SKBFXYVX173T boot complete
12-12 15:01:03 I/DeviceStateMonitor: Waiting 359931 ms for device SKBFXYVX173T package manager
12-12 15:01:03 I/NativeDeviceStateMonitor: Waiting 359781 ms for device SKBFXYVX173T external store
12-12 15:01:03 D/NativeDevice: Using property ro.build.version.sdk=31 from cache.
12-12 15:01:03 D/NativeDevice: Using property ro.build.version.codename=REL from cache.
12-12 15:01:03 D/NativeDevice: Using property ro.build.version.sdk=31 from cache.
12-12 15:01:03 D/WifiUtil.apk7705698490868266906.apk: Uploading WifiUtil.apk7705698490868266906.apk onto device 'SKBFXYVX173T'
12-12 15:01:03 D/DeviceImpl: Uploading file onto device 'SKBFXYVX173T'
12-12 15:01:04 D/RunUtil: Running command [aapt, dump, badging, /tmp/WifiUtil.apk7705698490868266906.apk] with timeout: 1m 0s
12-12 15:01:04 D/RunUtil: Running command [aapt, dump, xmltree, /tmp/WifiUtil.apk7705698490868266906.apk, AndroidManifest.xml] with timeout: 1m 0s
12-12 15:01:04 D/RunUtil: Running command [adb, -s, SKBFXYVX173T, shell, appops, write-settings] with timeout: 2m 0s
12-12 15:01:06 I/WifiCheck: Wifi is connected
12-12 15:01:06 D/InvocationExecution: done with preparer 'com.android.compatibility.common.tradefed.targetprep.WifiCheck@4cd1559c' on device: 'SKBFXYVX173T' in 3s
12-12 15:01:06 D/InvocationExecution: starting preparer 'com.android.tradefed.targetprep.RunCommandTargetPreparer@14e2ed78' on device: 'SKBFXYVX173T'
12-12 15:01:06 D/RunUtil: Running command [adb, -s, SKBFXYVX173T, shell, rm, -rf, /sdcard/device-info-files] with timeout: 2m 0s
12-12 15:01:06 D/RunUtil: Running command [adb, -s, SKBFXYVX173T, shell, rm, -rf, /sdcard/report-log-files] with timeout: 2m 0s
12-12 15:01:06 D/RunUtil: Running command [adb, -s, SKBFXYVX173T, shell, locksettings, set-disabled, true] with timeout: 2m 0s
12-12 15:01:07 D/InvocationExecution: done with preparer 'com.android.tradefed.targetprep.RunCommandTargetPreparer@14e2ed78' on device: 'SKBFXYVX173T' in 1s
12-12 15:01:07 D/InvocationExecution: starting preparer 'com.android.compatibility.common.tradefed.targetprep.DeviceInfoCollector@2854dfaf' on device: 'SKBFXYVX173T'
12-12 15:01:07 D/RunUtil: Running command [adb, -s, SKBFXYVX173T, shell, getprop, ro.product.model] with timeout: 45s
12-12 15:01:07 D/RunUtil: Running command [adb, -s, SKBFXYVX173T, shell, getprop, ro.product.device] with timeout: 45s
12-12 15:01:07 D/RunUtil: Running command [adb, -s, SKBFXYVX173T, shell, getprop, ro.build.id] with timeout: 45s
12-12 15:01:07 D/RunUtil: Running command [adb, -s, SKBFXYVX173T, shell, getprop, ro.bootimage.build.fingerprint] with timeout: 45s
12-12 15:01:07 D/NativeDevice: Using property ro.build.version.sdk=31 from cache.
12-12 15:01:07 D/RunUtil: Running command [adb, -s, SKBFXYVX173T, shell, getprop, ro.product.manufacturer] with timeout: 45s
12-12 15:01:07 D/RunUtil: Running command [adb, -s, SKBFXYVX173T, shell, getprop, ro.serialno] with timeout: 45s
12-12 15:01:07 D/RunUtil: Running command [adb, -s, SKBFXYVX173T, shell, getprop, ro.build.version.security_patch] with timeout: 45s
12-12 15:01:07 D/RunUtil: Running command [adb, -s, SKBFXYVX173T, shell, getprop, ro.product.cpu.abilist32] with timeout: 45s
12-12 15:01:07 D/RunUtil: Running command [adb, -s, SKBFXYVX173T, shell, getprop, ro.build.reference.fingerprint] with timeout: 45s
12-12 15:01:07 D/RunUtil: Running command [adb, -s, SKBFXYVX173T, shell, getprop, ro.product.cpu.abi] with timeout: 45s
12-12 15:01:08 D/RunUtil: Running command [adb, -s, SKBFXYVX173T, shell, getprop, ro.product.cpu.abilist64] with timeout: 45s
12-12 15:01:08 D/RunUtil: Running command [adb, -s, SKBFXYVX173T, shell, getprop, ro.product.name] with timeout: 45s
12-12 15:01:08 D/RunUtil: Running command [adb, -s, SKBFXYVX173T, shell, getprop, ro.build.tags] with timeout: 45s
12-12 15:01:08 D/RunUtil: Running command [adb, -s, SKBFXYVX173T, shell, getprop, ro.build.version.incremental] with timeout: 45s
12-12 15:01:08 D/RunUtil: Running command [adb, -s, SKBFXYVX173T, shell, getprop, ro.product.brand] with timeout: 45s
12-12 15:01:08 D/RunUtil: Running command [adb, -s, SKBFXYVX173T, shell, getprop, ro.build.fingerprint] with timeout: 45s
12-12 15:01:08 D/RunUtil: Running command [adb, -s, SKBFXYVX173T, shell, getprop, ro.vendor.build.fingerprint] with timeout: 45s
12-12 15:01:08 D/RunUtil: Running command [adb, -s, SKBFXYVX173T, shell, getprop, ro.build.version.base_os] with timeout: 45s
12-12 15:01:08 D/RunUtil: Running command [adb, -s, SKBFXYVX173T, shell, getprop, ro.product.cpu.abilist] with timeout: 45s
12-12 15:01:08 D/RunUtil: Running command [adb, -s, SKBFXYVX173T, shell, getprop, ro.product.board] with timeout: 45s
12-12 15:01:08 D/RunUtil: Running command [adb, -s, SKBFXYVX173T, shell, getprop, ro.build.type] with timeout: 45s
12-12 15:01:08 D/RunUtil: Running command [adb, -s, SKBFXYVX173T, shell, getprop, ro.build.version.release] with timeout: 45s
12-12 15:01:08 D/RunUtil: Running command [adb, -s, SKBFXYVX173T, shell, getprop, ro.product.cpu.abi2] with timeout: 45s
12-12 15:01:08 D/SearchArtifactUtil: Searching for file CtsDeviceInfo.apk. Search directories: [/tmp/xts-root-dir-fa5dd1c2-3ba7-4cdd-9904-a00e7a84339f/android-cts/testcases, /tmp/tf-workfolder16635743860164734351]
12-12 15:01:08 D/SearchArtifactUtil: Found file /tmp/xts-root-dir-fa5dd1c2-3ba7-4cdd-9904-a00e7a84339f/android-cts/testcases/CtsDeviceInfo.apk in search directory /tmp/xts-root-dir-fa5dd1c2-3ba7-4cdd-9904-a00e7a84339f/android-cts/testcases.
12-12 15:01:08 I/NativeDeviceStateMonitor: Device SKBFXYVX173T is already ONLINE
12-12 15:01:08 I/NativeDeviceStateMonitor: Waiting 360000 ms for device SKBFXYVX173T boot complete
12-12 15:01:08 I/DeviceStateMonitor: Waiting 359963 ms for device SKBFXYVX173T package manager
12-12 15:01:08 I/NativeDeviceStateMonitor: Waiting 359900 ms for device SKBFXYVX173T external store
12-12 15:01:09 I/ApkInstrumentationPreparer: Instrumenting package: com.android.compatibility.common.deviceinfo
12-12 15:01:09 D/NativeDevice: Using property ro.build.version.sdk=31 from cache.
12-12 15:01:09 D/NativeDevice: Using property ro.build.version.codename=REL from cache.
12-12 15:01:09 D/NativeDevice: Using property ro.build.version.sdk=31 from cache.
12-12 15:01:09 D/NativeDevice: Using property ro.build.version.codename=REL from cache.
12-12 15:01:09 D/AndroidJUnitTest: Disabled test storage as it's not supported on that branch.
12-12 15:01:09 D/NativeDevice: Using property ro.build.version.sdk=31 from cache.
12-12 15:01:09 D/NativeDevice: Using property ro.build.version.codename=REL from cache.
12-12 15:01:09 D/NativeDevice: Using property ro.build.version.sdk=31 from cache.
12-12 15:01:09 D/CtsDeviceInfo.apk: Uploading CtsDeviceInfo.apk onto device 'SKBFXYVX173T'
12-12 15:01:09 D/DeviceImpl: Uploading file onto device 'SKBFXYVX173T'
12-12 15:01:10 D/RunUtil: Running command [aapt, dump, badging, /tmp/xts-root-dir-fa5dd1c2-3ba7-4cdd-9904-a00e7a84339f/android-cts/testcases/CtsDeviceInfo.apk] with timeout: 1m 0s
12-12 15:01:10 D/RunUtil: Running command [aapt, dump, xmltree, /tmp/xts-root-dir-fa5dd1c2-3ba7-4cdd-9904-a00e7a84339f/android-cts/testcases/CtsDeviceInfo.apk, AndroidManifest.xml] with timeout: 1m 0s
12-12 15:01:10 D/RunUtil: Running command [adb, -s, SKBFXYVX173T, shell, appops, write-settings] with timeout: 2m 0s
12-12 15:01:11 D/ListInstrumentationParser: instrumentation:com.android.compatibility.common.deviceinfo/androidx.test.runner.AndroidJUnitRunner (target=com.android.compatibility.common.deviceinfo)
12-12 15:01:11 D/ListInstrumentationParser: instrumentation:com.android.tradefed.utils.wifi/.WifiUtil (target=com.android.tradefed.utils.wifi)
12-12 15:01:11 D/ListInstrumentationParser: 
12-12 15:01:11 I/InstrumentationTest: No runner name specified. Using: androidx.test.runner.AndroidJUnitRunner.
12-12 15:01:11 D/NativeDevice: Using property ro.build.version.sdk=31 from cache.
12-12 15:01:11 D/NativeDevice: Using property ro.build.version.sdk=31 from cache.
12-12 15:01:11 D/NativeDevice: Using property ro.build.version.codename=REL from cache.
12-12 15:01:11 D/InstrumentationTest: Initializing com.android.tradefed.device.metric.CountTestCasesCollector for instrumentation.
12-12 15:01:11 I/RemoteAndroidTestRunner: Running am instrument -w -r --no-isolated-storage  -e newRunListenerMode true -e timeout_msec 300000 com.android.compatibility.common.deviceinfo/androidx.test.runner.AndroidJUnitRunner on foxconn-bfx_at100-SKBFXYVX173T
12-12 15:01:27 D/TestDevice: Uninstalling com.android.compatibility.common.deviceinfo with extra args 
12-12 15:01:27 D/ApkInstrumentationPreparer: Target preparation successful
12-12 15:01:27 D/NativeDevice: Using property ro.build.version.sdk=31 from cache.
12-12 15:01:27 D/NativeDevice: Using 'ls' to check doesFileExist(/storage/emulated/0/device-info-files/)
12-12 15:01:27 D/RunUtil: Running command [adb, -s, SKBFXYVX173T, shell, ls, '/storage/emulated/0/device-info-files/'] with timeout: 2m 0s
12-12 15:01:28 D/FileUtil: Creating temp file at /tmp/13441469/cts/inv_12648427467095576587/inv_2368518573660175600 with prefix "ClientIdDeviceInfo.deviceinfo.json_" suffix ".txt.gz"
12-12 15:01:28 I/LogFileSaver: Saved gzip log file /tmp/13441469/cts/inv_12648427467095576587/inv_2368518573660175600/ClientIdDeviceInfo.deviceinfo.json_2159665020199145005.txt.gz. [size=10, elapsed=1ms]
12-12 15:01:28 D/FileUtil: Creating temp file at /tmp/13441469/cts/inv_12648427467095576587/inv_2368518573660175600 with prefix "ScreenDeviceInfo.deviceinfo.json_" suffix ".txt.gz"
12-12 15:01:28 I/LogFileSaver: Saved gzip log file /tmp/13441469/cts/inv_12648427467095576587/inv_2368518573660175600/ScreenDeviceInfo.deviceinfo.json_9139935792344782808.txt.gz. [size=10, elapsed=0ms]
12-12 15:01:28 D/FileUtil: Creating temp file at /tmp/13441469/cts/inv_12648427467095576587/inv_2368518573660175600 with prefix "MediaDeviceInfo.deviceinfo.json_" suffix ".txt.gz"
12-12 15:01:28 I/LogFileSaver: Saved gzip log file /tmp/13441469/cts/inv_12648427467095576587/inv_2368518573660175600/MediaDeviceInfo.deviceinfo.json_4731122637860826175.txt.gz. [size=10, elapsed=0ms]
12-12 15:01:28 D/FileUtil: Creating temp file at /tmp/xts-root-dir-fa5dd1c2-3ba7-4cdd-9904-a00e7a84339f/android-cts/logs/2025.12.12_15.00.56/inv_18424983443859154131 with prefix "framework_compatibility_matrix.xml_" suffix ".txt.gz"
12-12 15:01:28 I/LogFileSaver: Saved gzip log file /tmp/xts-root-dir-fa5dd1c2-3ba7-4cdd-9904-a00e7a84339f/android-cts/logs/2025.12.12_15.00.56/inv_18424983443859154131/framework_compatibility_matrix.xml_16249004530716804628.txt.gz. [size=10, elapsed=3ms]
12-12 15:01:28 D/CertificationSuiteResultReporter: Saved logs for framework_compatibility_matrix.xml in /tmp/xts-root-dir-fa5dd1c2-3ba7-4cdd-9904-a00e7a84339f/android-cts/logs/2025.12.12_15.00.56/inv_18424983443859154131/framework_compatibility_matrix.xml_16249004530716804628.txt.gz
12-12 15:01:28 D/FileUtil: Creating temp file at /tmp/13441469/cts/inv_12648427467095576587/inv_2368518573660175600 with prefix "framework_compatibility_matrix.xml_" suffix ".txt.gz"
12-12 15:01:28 I/LogFileSaver: Saved gzip log file /tmp/13441469/cts/inv_12648427467095576587/inv_2368518573660175600/framework_compatibility_matrix.xml_1095257614329713955.txt.gz. [size=10, elapsed=3ms]
12-12 15:01:28 D/FileUtil: Creating temp file at /tmp/13441469/cts/inv_12648427467095576587/inv_2368518573660175600 with prefix "GenericDeviceInfo.deviceinfo.json_" suffix ".txt.gz"
12-12 15:01:28 I/LogFileSaver: Saved gzip log file /tmp/13441469/cts/inv_12648427467095576587/inv_2368518573660175600/GenericDeviceInfo.deviceinfo.json_18407270413269638608.txt.gz. [size=10, elapsed=0ms]
12-12 15:01:28 D/FileUtil: Creating temp file at /tmp/13441469/cts/inv_12648427467095576587/inv_2368518573660175600 with prefix "GraphicsDeviceInfo.deviceinfo.json_" suffix ".txt.gz"
12-12 15:01:28 I/LogFileSaver: Saved gzip log file /tmp/13441469/cts/inv_12648427467095576587/inv_2368518573660175600/GraphicsDeviceInfo.deviceinfo.json_16181015456228627843.txt.gz. [size=10, elapsed=0ms]
12-12 15:01:28 D/FileUtil: Creating temp file at /tmp/13441469/cts/inv_12648427467095576587/inv_2368518573660175600 with prefix "MediaDrmDeviceInfo.deviceinfo.json_" suffix ".txt.gz"
12-12 15:01:28 I/LogFileSaver: Saved gzip log file /tmp/13441469/cts/inv_12648427467095576587/inv_2368518573660175600/MediaDrmDeviceInfo.deviceinfo.json_17599886908759793793.txt.gz. [size=10, elapsed=1ms]
12-12 15:01:28 D/FileUtil: Creating temp file at /tmp/13441469/cts/inv_12648427467095576587/inv_2368518573660175600 with prefix "VulkanDeviceInfo.deviceinfo.json_" suffix ".txt.gz"
12-12 15:01:28 I/LogFileSaver: Saved gzip log file /tmp/13441469/cts/inv_12648427467095576587/inv_2368518573660175600/VulkanDeviceInfo.deviceinfo.json_6316329828424348950.txt.gz. [size=10, elapsed=0ms]
12-12 15:01:28 D/FileUtil: Creating temp file at /tmp/xts-root-dir-fa5dd1c2-3ba7-4cdd-9904-a00e7a84339f/android-cts/logs/2025.12.12_15.00.56/inv_18424983443859154131 with prefix "device_compatibility_matrix.xml_" suffix ".txt.gz"
12-12 15:01:28 I/LogFileSaver: Saved gzip log file /tmp/xts-root-dir-fa5dd1c2-3ba7-4cdd-9904-a00e7a84339f/android-cts/logs/2025.12.12_15.00.56/inv_18424983443859154131/device_compatibility_matrix.xml_4316451819157821257.txt.gz. [size=10, elapsed=1ms]
12-12 15:01:28 D/CertificationSuiteResultReporter: Saved logs for device_compatibility_matrix.xml in /tmp/xts-root-dir-fa5dd1c2-3ba7-4cdd-9904-a00e7a84339f/android-cts/logs/2025.12.12_15.00.56/inv_18424983443859154131/device_compatibility_matrix.xml_4316451819157821257.txt.gz
12-12 15:01:28 D/FileUtil: Creating temp file at /tmp/13441469/cts/inv_12648427467095576587/inv_2368518573660175600 with prefix "device_compatibility_matrix.xml_" suffix ".txt.gz"
12-12 15:01:28 I/LogFileSaver: Saved gzip log file /tmp/13441469/cts/inv_12648427467095576587/inv_2368518573660175600/device_compatibility_matrix.xml_4520713866232588104.txt.gz. [size=10, elapsed=0ms]
12-12 15:01:28 D/FileUtil: Creating temp file at /tmp/13441469/cts/inv_12648427467095576587/inv_2368518573660175600 with prefix "AppStandbyDeviceInfo.deviceinfo.json_" suffix ".txt.gz"
12-12 15:01:28 I/LogFileSaver: Saved gzip log file /tmp/13441469/cts/inv_12648427467095576587/inv_2368518573660175600/AppStandbyDeviceInfo.deviceinfo.json_17102290043780560519.txt.gz. [size=10, elapsed=1ms]
12-12 15:01:28 D/FileUtil: Creating temp file at /tmp/13441469/cts/inv_12648427467095576587/inv_2368518573660175600 with prefix "MemoryDeviceInfo.deviceinfo.json_" suffix ".txt.gz"
12-12 15:01:28 I/LogFileSaver: Saved gzip log file /tmp/13441469/cts/inv_12648427467095576587/inv_2368518573660175600/MemoryDeviceInfo.deviceinfo.json_15928715544248764075.txt.gz. [size=10, elapsed=1ms]
12-12 15:01:28 D/FileUtil: Creating temp file at /tmp/13441469/cts/inv_12648427467095576587/inv_2368518573660175600 with prefix "CameraDeviceInfo.deviceinfo.json_" suffix ".txt.gz"
12-12 15:01:28 I/LogFileSaver: Saved gzip log file /tmp/13441469/cts/inv_12648427467095576587/inv_2368518573660175600/CameraDeviceInfo.deviceinfo.json_1650176012531330210.txt.gz. [size=10, elapsed=0ms]
12-12 15:01:28 D/FileUtil: Creating temp file at /tmp/13441469/cts/inv_12648427467095576587/inv_2368518573660175600 with prefix "LocaleDeviceInfo.deviceinfo.json_" suffix ".txt.gz"
12-12 15:01:28 I/LogFileSaver: Saved gzip log file /tmp/13441469/cts/inv_12648427467095576587/inv_2368518573660175600/LocaleDeviceInfo.deviceinfo.json_17491540201034831706.txt.gz. [size=10, elapsed=0ms]
12-12 15:01:28 D/FileUtil: Creating temp file at /tmp/13441469/cts/inv_12648427467095576587/inv_2368518573660175600 with prefix "FeatureDeviceInfo.deviceinfo.json_" suffix ".txt.gz"
12-12 15:01:28 I/LogFileSaver: Saved gzip log file /tmp/13441469/cts/inv_12648427467095576587/inv_2368518573660175600/FeatureDeviceInfo.deviceinfo.json_737230172812222372.txt.gz. [size=10, elapsed=0ms]
12-12 15:01:28 D/FileUtil: Creating temp file at /tmp/13441469/cts/inv_12648427467095576587/inv_2368518573660175600 with prefix "VintfDeviceInfo.deviceinfo.json_" suffix ".txt.gz"
12-12 15:01:28 I/LogFileSaver: Saved gzip log file /tmp/13441469/cts/inv_12648427467095576587/inv_2368518573660175600/VintfDeviceInfo.deviceinfo.json_9393345413580177759.txt.gz. [size=10, elapsed=0ms]
12-12 15:01:28 D/FileUtil: Creating temp file at /tmp/13441469/cts/inv_12648427467095576587/inv_2368518573660175600 with prefix "UserDeviceInfo.deviceinfo.json_" suffix ".txt.gz"
12-12 15:01:28 I/LogFileSaver: Saved gzip log file /tmp/13441469/cts/inv_12648427467095576587/inv_2368518573660175600/UserDeviceInfo.deviceinfo.json_9334521104817448117.txt.gz. [size=10, elapsed=0ms]
12-12 15:01:28 D/FileUtil: Creating temp file at /tmp/13441469/cts/inv_12648427467095576587/inv_2368518573660175600 with prefix "PackageDeviceInfo.deviceinfo.json_" suffix ".txt.gz"
12-12 15:01:28 I/LogFileSaver: Saved gzip log file /tmp/13441469/cts/inv_12648427467095576587/inv_2368518573660175600/PackageDeviceInfo.deviceinfo.json_14937549350906633109.txt.gz. [size=25689, elapsed=4ms]
12-12 15:01:28 D/FileUtil: Creating temp file at /tmp/xts-root-dir-fa5dd1c2-3ba7-4cdd-9904-a00e7a84339f/android-cts/logs/2025.12.12_15.00.56/inv_18424983443859154131 with prefix "framework_manifest.xml_" suffix ".txt.gz"
12-12 15:01:28 I/LogFileSaver: Saved gzip log file /tmp/xts-root-dir-fa5dd1c2-3ba7-4cdd-9904-a00e7a84339f/android-cts/logs/2025.12.12_15.00.56/inv_18424983443859154131/framework_manifest.xml_5734066054983547.txt.gz. [size=10, elapsed=1ms]
12-12 15:01:28 D/CertificationSuiteResultReporter: Saved logs for framework_manifest.xml in /tmp/xts-root-dir-fa5dd1c2-3ba7-4cdd-9904-a00e7a84339f/android-cts/logs/2025.12.12_15.00.56/inv_18424983443859154131/framework_manifest.xml_5734066054983547.txt.gz
12-12 15:01:28 D/FileUtil: Creating temp file at /tmp/13441469/cts/inv_12648427467095576587/inv_2368518573660175600 with prefix "framework_manifest.xml_" suffix ".txt.gz"
12-12 15:01:28 I/LogFileSaver: Saved gzip log file /tmp/13441469/cts/inv_12648427467095576587/inv_2368518573660175600/framework_manifest.xml_8498226955069770818.txt.gz. [size=10, elapsed=0ms]
12-12 15:01:28 D/FileUtil: Creating temp file at /tmp/13441469/cts/inv_12648427467095576587/inv_2368518573660175600 with prefix "ConfigurationDeviceInfo.deviceinfo.json_" suffix ".txt.gz"
12-12 15:01:28 I/LogFileSaver: Saved gzip log file /tmp/13441469/cts/inv_12648427467095576587/inv_2368518573660175600/ConfigurationDeviceInfo.deviceinfo.json_2906306012274285984.txt.gz. [size=10, elapsed=1ms]
12-12 15:01:28 D/FileUtil: Creating temp file at /tmp/xts-root-dir-fa5dd1c2-3ba7-4cdd-9904-a00e7a84339f/android-cts/logs/2025.12.12_15.00.56/inv_18424983443859154131 with prefix "device_manifest.xml_" suffix ".txt.gz"
12-12 15:01:28 I/LogFileSaver: Saved gzip log file /tmp/xts-root-dir-fa5dd1c2-3ba7-4cdd-9904-a00e7a84339f/android-cts/logs/2025.12.12_15.00.56/inv_18424983443859154131/device_manifest.xml_16354328884717745405.txt.gz. [size=10, elapsed=1ms]
12-12 15:01:28 D/CertificationSuiteResultReporter: Saved logs for device_manifest.xml in /tmp/xts-root-dir-fa5dd1c2-3ba7-4cdd-9904-a00e7a84339f/android-cts/logs/2025.12.12_15.00.56/inv_18424983443859154131/device_manifest.xml_16354328884717745405.txt.gz
12-12 15:01:28 D/FileUtil: Creating temp file at /tmp/13441469/cts/inv_12648427467095576587/inv_2368518573660175600 with prefix "device_manifest.xml_" suffix ".txt.gz"
12-12 15:01:28 I/LogFileSaver: Saved gzip log file /tmp/13441469/cts/inv_12648427467095576587/inv_2368518573660175600/device_manifest.xml_9077080225999079278.txt.gz. [size=10, elapsed=0ms]
12-12 15:01:28 D/FileUtil: Creating temp file at /tmp/13441469/cts/inv_12648427467095576587/inv_2368518573660175600 with prefix "StorageDeviceInfo.deviceinfo.json_" suffix ".txt.gz"
12-12 15:01:28 I/LogFileSaver: Saved gzip log file /tmp/13441469/cts/inv_12648427467095576587/inv_2368518573660175600/StorageDeviceInfo.deviceinfo.json_9996052433679745759.txt.gz. [size=10, elapsed=1ms]
12-12 15:01:28 D/FileUtil: Creating temp file at /tmp/13441469/cts/inv_12648427467095576587/inv_2368518573660175600 with prefix "CpuDeviceInfo.deviceinfo.json_" suffix ".txt.gz"
12-12 15:01:28 I/LogFileSaver: Saved gzip log file /tmp/13441469/cts/inv_12648427467095576587/inv_2368518573660175600/CpuDeviceInfo.deviceinfo.json_5017216979447251215.txt.gz. [size=10, elapsed=1ms]
12-12 15:01:28 D/FileUtil: Creating temp file at /tmp/13441469/cts/inv_12648427467095576587/inv_2368518573660175600 with prefix "SensorDeviceInfo.deviceinfo.json_" suffix ".txt.gz"
12-12 15:01:28 I/LogFileSaver: Saved gzip log file /tmp/13441469/cts/inv_12648427467095576587/inv_2368518573660175600/SensorDeviceInfo.deviceinfo.json_18208559843649735940.txt.gz. [size=10, elapsed=0ms]
12-12 15:01:28 D/InvocationExecution: done with preparer 'com.android.compatibility.common.tradefed.targetprep.DeviceInfoCollector@2854dfaf' on device: 'SKBFXYVX173T' in 21s
12-12 15:01:28 D/InvocationExecution: starting preparer 'com.android.compatibility.common.tradefed.targetprep.ReportLogCollector@327b381' on device: 'SKBFXYVX173T'
12-12 15:01:28 D/InvocationExecution: done with preparer 'com.android.compatibility.common.tradefed.targetprep.ReportLogCollector@327b381' on device: 'SKBFXYVX173T' in 1 ms
12-12 15:01:28 D/InvocationExecution: starting preparer 'com.android.tradefed.targetprep.RunCommandTargetPreparer@614abb0a' on device: 'SKBFXYVX173T'
12-12 15:01:28 D/RunUtil: Running command [adb, -s, SKBFXYVX173T, shell, settings, put, global, package_verifier_enable, 0] with timeout: 2m 0s
12-12 15:01:29 D/InvocationExecution: done with preparer 'com.android.tradefed.targetprep.RunCommandTargetPreparer@614abb0a' on device: 'SKBFXYVX173T' in 92 ms
12-12 15:01:29 D/InvocationExecution: starting preparer 'com.android.tradefed.targetprep.RunCommandTargetPreparer@23296cb9' on device: 'SKBFXYVX173T'
12-12 15:01:29 D/RunUtil: Running command [adb, -s, SKBFXYVX173T, shell, settings, put, global, verifier_engprod, 1] with timeout: 2m 0s
12-12 15:01:29 D/InvocationExecution: done with preparer 'com.android.tradefed.targetprep.RunCommandTargetPreparer@23296cb9' on device: 'SKBFXYVX173T' in 68 ms
12-12 15:01:29 D/InvocationExecution: starting preparer 'com.android.compatibility.common.tradefed.targetprep.PropertyCheck@4947ef2b' on device: 'SKBFXYVX173T'
12-12 15:01:29 D/NativeDevice: Using property ro.build.type=user from cache.
12-12 15:01:29 D/InvocationExecution: done with preparer 'com.android.compatibility.common.tradefed.targetprep.PropertyCheck@4947ef2b' on device: 'SKBFXYVX173T' in 1 ms
12-12 15:01:29 D/InvocationExecution: starting preparer 'com.android.compatibility.common.tradefed.targetprep.PropertyCheck@6147ab77' on device: 'SKBFXYVX173T'
12-12 15:01:29 D/RunUtil: Running command [adb, -s, SKBFXYVX173T, shell, getprop, ro.product.locale] with timeout: 45s
12-12 15:01:29 W/PropertyCheck: Expected "en-US" but found "ko-KR" for property: ro.product.locale
12-12 15:01:29 D/InvocationExecution: done with preparer 'com.android.compatibility.common.tradefed.targetprep.PropertyCheck@6147ab77' on device: 'SKBFXYVX173T' in 42 ms
12-12 15:01:29 D/InvocationExecution: starting preparer 'com.android.compatibility.common.tradefed.targetprep.PropertyCheck@5ffed07c' on device: 'SKBFXYVX173T'
12-12 15:01:29 D/RunUtil: Running command [adb, -s, SKBFXYVX173T, shell, getprop, persist.sys.test_harness] with timeout: 45s
12-12 15:01:29 W/PropertyCheck: Property "persist.sys.test_harness" not found on device, cannot verify value "false" 
12-12 15:01:29 D/InvocationExecution: done with preparer 'com.android.compatibility.common.tradefed.targetprep.PropertyCheck@5ffed07c' on device: 'SKBFXYVX173T' in 43 ms
12-12 15:01:29 D/InvocationExecution: Done with setup of device: 'SKBFXYVX173T'
12-12 15:01:29 D/RunUtil: Running command [adb, -s, SKBFXYVX173T, shell, uname, -a] with timeout: 2m 0s
12-12 15:01:29 I/InvocationExecution: Device SKBFXYVX173T kernel information: 'Linux localhost 4.9.269-abk000c-552r40-20251209 #1 SMP PREEMPT Tue Dec 9 16:32:20 KST 2025 armv8l'
12-12 15:01:29 D/RunUtil: Running command [adb, -s, SKBFXYVX173T, shell, getprop, ro.system.build.fingerprint] with timeout: 45s
12-12 15:01:29 I/InvocationExecution: Device SKBFXYVX173T system image build information: 'SKB/BFX_AT100/BFX-AT100:12/STTC.220724.001/15.552.40-20251209:user/release-keys'
12-12 15:01:29 D/NativeDevice: Using property ro.vendor.build.fingerprint=SKB/BFX_AT100/BFX-AT100:12/STTC.220724.001/15.552.40-20251209:user/release-keys from cache.
12-12 15:01:29 I/InvocationExecution: Device SKBFXYVX173T vendor image build information: 'SKB/BFX_AT100/BFX-AT100:12/STTC.220724.001/15.552.40-20251209:user/release-keys'
12-12 15:01:29 D/InvocationExecution: Total setup duration: 32s'
12-12 15:01:29 D/LogFileSaver: Log data for device_logcat_setup_SKBFXYVX173T is already compressed, skipping compression
12-12 15:01:29 D/FileUtil: Creating temp file at /tmp/xts-root-dir-fa5dd1c2-3ba7-4cdd-9904-a00e7a84339f/android-cts/logs/2025.12.12_15.00.56/inv_18424983443859154131 with prefix "device_logcat_setup_SKBFXYVX173T_" suffix ".txt"
12-12 15:01:29 I/LogFileSaver: Saved log file /tmp/xts-root-dir-fa5dd1c2-3ba7-4cdd-9904-a00e7a84339f/android-cts/logs/2025.12.12_15.00.56/inv_18424983443859154131/device_logcat_setup_SKBFXYVX173T_1424475834209580644.txt. [size=1357786, elapsed=6ms]
12-12 15:01:29 D/CertificationSuiteResultReporter: Saved logs for device_logcat_setup_SKBFXYVX173T in /tmp/xts-root-dir-fa5dd1c2-3ba7-4cdd-9904-a00e7a84339f/android-cts/logs/2025.12.12_15.00.56/inv_18424983443859154131/device_logcat_setup_SKBFXYVX173T_1424475834209580644.txt
12-12 15:01:29 D/LogFileSaver: Log data for device_logcat_setup_SKBFXYVX173T is already compressed, skipping compression
12-12 15:01:29 D/FileUtil: Creating temp file at /tmp/13441469/cts/inv_12648427467095576587/inv_2368518573660175600 with prefix "device_logcat_setup_SKBFXYVX173T_" suffix ".txt"
12-12 15:01:29 I/LogFileSaver: Saved log file /tmp/13441469/cts/inv_12648427467095576587/inv_2368518573660175600/device_logcat_setup_SKBFXYVX173T_2527316750540502974.txt. [size=1357786, elapsed=5ms]
12-12 15:01:29 D/TestDevice: No snapuserd notification in progress for BLOCK_BEFORE_TEST
12-12 15:01:29 D/PrettyPrintDelimiter: 
===============================
===== TEST PHASE STARTING =====
===============================
12-12 15:01:29 D/RunUtil: Running command [adb, -s, SKBFXYVX173T, shell, cmd, device_state, print-states] with timeout: 2m 0s
12-12 15:01:29 D/NativeDevice: Using property ro.product.cpu.abilist=armeabi-v7a,armeabi from cache.
12-12 15:01:29 D/ITestSuite: abi 'armeabi' is supported by device but not by this suite build ([arm64-v8a, armeabi-v7a]), tests will not run against it.
12-12 15:01:29 D/BaseTestSuite: Initializing ModuleRepo
ABIs:[{armeabi-v7a, bitness=32}]
Test Args:[com.android.tradefed.testtype.AndroidJUnitTest:exclude-annotation:com.android.compatibility.common.util.CtsDownstreamingTest, com.android.compatibility.common.tradefed.testtype.JarHostTest:exclude-annotation:com.android.compatibility.common.util.CtsDownstreamingTest, com.android.tradefed.testtype.HostTest:exclude-annotation:com.android.compatibility.common.util.CtsDownstreamingTest, com.android.tradefed.testtype.AndroidJUnitTest:exclude-annotation:android.platform.test.annotations.AsbSecurityTest, com.android.compatibility.common.tradefed.testtype.JarHostTest:exclude-annotation:android.platform.test.annotations.AsbSecurityTest, com.android.tradefed.testtype.AndroidJUnitTest:exclude-annotation:android.platform.test.annotations.AppModeInstant, com.android.compatibility.common.tradefed.testtype.JarHostTest:exclude-annotation:android.platform.test.annotations.AppModeInstant, com.android.tradefed.testtype.HostTest:exclude-annotation:android.platform.test.annotations.AppModeInstant]
Module Args:[]
Includes: {armeabi-v7a CtsAppTestCases=[CtsAppTestCases android.app.cts.DownloadManagerTest#testDownloadManagerSupportsHttpsWithExternalWebServer], armeabi-v7a CtsAppTestCases[instant]=[CtsAppTestCases[instant] android.app.cts.DownloadManagerTest#testDownloadManagerSupportsHttpsWithExternalWebServer], armeabi-v7a CtsAppTestCases[run-on-clone-profile]=[CtsAppTestCases[run-on-clone-profile] android.app.cts.DownloadManagerTest#testDownloadManagerSupportsHttpsWithExternalWebServer], armeabi-v7a CtsAppTestCases[run-on-secondary-user]=[CtsAppTestCases[run-on-secondary-user] android.app.cts.DownloadManagerTest#testDownloadManagerSupportsHttpsWithExternalWebServer], armeabi-v7a CtsAppTestCases[run-on-work-profile]=[CtsAppTestCases[run-on-work-profile] android.app.cts.DownloadManagerTest#testDownloadManagerSupportsHttpsWithExternalWebServer], armeabi-v7a CtsAppTestCases[run-on-private-profile]=[CtsAppTestCases[run-on-private-profile] android.app.cts.DownloadManagerTest#testDownloadManagerSupportsHttpsWithExternalWebServer]}
Excludes: {x86 CtsPerfettoTestCases=[x86 CtsPerfettoTestCases PerfettoTest#TestFtraceProducer], arm64-v8a CtsRenderscriptLegacyTestCases=[arm64-v8a CtsRenderscriptLegacyTestCases], x86_64 CtsRenderscriptLegacyTestCases=[x86_64 CtsRenderscriptLegacyTestCases], mips64 CtsRenderscriptLegacyTestCases=[mips64 CtsRenderscriptLegacyTestCases], x86_64 CtsLiblogTestCases=[x86_64 CtsLiblogTestCases liblog#event_log_tags], arm64-v8a CtsMediaBitstreamsTestCases=[arm64-v8a CtsMediaBitstreamsTestCases], x86_64 CtsMediaBitstreamsTestCases=[x86_64 CtsMediaBitstreamsTestCases], mips64 CtsMediaBitstreamsTestCases=[mips64 CtsMediaBitstreamsTestCases], arm64-v8a CtsWrapWrapDebugMallocDebugTestCases=[arm64-v8a CtsWrapWrapDebugMallocDebugTestCases]}
12-12 15:01:29 D/BaseTestSuite: Foldable states: [foldable:0:DEFAULT]
12-12 15:01:29 D/BaseTestSuite: Loading tests from [/tmp/xts-root-dir-fa5dd1c2-3ba7-4cdd-9904-a00e7a84339f/android-cts/testcases]
12-12 15:01:33 D/ITestSuite: No remote build info, skipping stageTestArtifacts
12-12 15:01:33 D/ITestSuite: Resource not found for allowed preparers: /suite/google-allowed-preparers.txt
12-12 15:01:33 D/ITestSuite: [Total Unique Modules = 2]
12-12 15:01:33 I/ITestSuite: SKBFXYVX173T running 2 modules: [armeabi-v7a CtsAppTestCases[instant], armeabi-v7a CtsAppTestCases]
12-12 15:01:33 D/TradefedFeatureClient: invoking feature 'skipFeature'
12-12 15:01:33 D/TradefedFeatureClient: Using reference id from metrics.
12-12 15:01:33 D/TradefedFeatureClient: name: "skipFeature"
reference_id: "e1199f6f-68a4-44b9-928c-978dcff5e7f6"

12-12 15:01:34 D/TradefedFeatureServer: Executing com.android.tradefed.result.skipped.SkipFeature@286eeefc with [name: "skipFeature"
reference_id: "e1199f6f-68a4-44b9-928c-978dcff5e7f6"
]
12-12 15:01:34 D/TradefedFeatureClient: Feature name: skipFeature. response: multi_part_response {
  response_part {
    key: "delimiter"
    value: "\\+,"
  }
  response_part {
    key: "presubmit"
    value: "false"
  }
  response_part {
    key: "skipModules"
  }
  response_part {
    key: "imageDigests"
  }
}

12-12 15:01:34 D/BaseTestSuite: Filters for 'armeabi-v7a CtsAppTestCases[instant]': []
12-12 15:01:34 D/FileUtil: Creating temp file at /tmp/tf-workfolder16635743860164734351 with prefix "CtsAppTestCases" suffix ".xml"
12-12 15:01:34 D/LogFileSaver: Log data for module-configuration is already compressed, skipping compression
12-12 15:01:34 D/FileUtil: Creating temp file at /tmp/xts-root-dir-fa5dd1c2-3ba7-4cdd-9904-a00e7a84339f/android-cts/logs/2025.12.12_15.00.56/inv_18424983443859154131 with prefix "module-configuration_" suffix ".xml"
12-12 15:01:34 I/LogFileSaver: Saved log file /tmp/xts-root-dir-fa5dd1c2-3ba7-4cdd-9904-a00e7a84339f/android-cts/logs/2025.12.12_15.00.56/inv_18424983443859154131/module-configuration_10266784366161497815.xml. [size=3279, elapsed=0ms]
12-12 15:01:34 D/CertificationSuiteResultReporter: Saved logs for module-configuration in /tmp/xts-root-dir-fa5dd1c2-3ba7-4cdd-9904-a00e7a84339f/android-cts/logs/2025.12.12_15.00.56/inv_18424983443859154131/module-configuration_10266784366161497815.xml
12-12 15:01:34 D/LogFileSaver: Log data for module-configuration is already compressed, skipping compression
12-12 15:01:34 D/FileUtil: Creating temp file at /tmp/13441469/cts/inv_12648427467095576587/inv_2368518573660175600 with prefix "module-configuration_" suffix ".xml"
12-12 15:01:34 I/LogFileSaver: Saved log file /tmp/13441469/cts/inv_12648427467095576587/inv_2368518573660175600/module-configuration_12538434972083347712.xml (type:HARNESS_CONFIG). [size=3279, elapsed=1ms]
12-12 15:01:34 I/ITestSuite: Running system status checker before module execution: armeabi-v7a CtsAppTestCases[instant]
12-12 15:01:34 D/NativeDevice: Using property ro.build.version.sdk=31 from cache.
12-12 15:01:34 D/NativeDevice: Using property ro.build.version.sdk=31 from cache.
12-12 15:01:34 D/NativeDevice: Using property ro.build.version.sdk=31 from cache.
12-12 15:01:34 I/UserChecker: Current user 0 is already user type CURRENT, no action.
12-12 15:01:34 D/DeviceSettingChecker: Begin preExecutionCheck for checking device setting
12-12 15:01:34 E/TestDevice: Unable to get setting from string:   "audiocaps": {
12-12 15:01:34 E/TestDevice: Unable to get setting from string:     "continuousAudio": false,
12-12 15:01:34 E/TestDevice: Unable to get setting from string:     "aaudio":true,
12-12 15:01:34 E/TestDevice: Unable to get setting from string:     "uiAudioBufferDelayOffset":60,
12-12 15:01:34 E/TestDevice: Unable to get setting from string:     "pcm": {
12-12 15:01:34 E/TestDevice: Unable to get setting from string:       "mixing": true,
12-12 15:01:34 E/TestDevice: Unable to get setting from string:       "transition": ease
12-12 15:01:34 E/TestDevice: Unable to get setting from string:     },
12-12 15:01:34 E/TestDevice: Unable to get setting from string:     "ddplus": {
12-12 15:01:34 E/TestDevice: Unable to get setting from string:       "mixing": false,
12-12 15:01:34 E/TestDevice: Unable to get setting from string:       "transition": mute
12-12 15:01:34 E/TestDevice: Unable to get setting from string:     },
12-12 15:01:34 E/TestDevice: Unable to get setting from string:     "atmos": {
12-12 15:01:34 E/TestDevice: Unable to get setting from string:       "enabled": true,
12-12 15:01:34 E/TestDevice: Unable to get setting from string:       "mixing": false,
12-12 15:01:34 E/TestDevice: Unable to get setting from string:       "transition": mute
12-12 15:01:34 E/TestDevice: Unable to get setting from string:     }
12-12 15:01:34 E/TestDevice: Unable to get setting from string:   }
12-12 15:01:34 E/TestDevice: Unable to get setting from string: }
12-12 15:01:34 E/TestDevice: Unable to get setting from string: 
12-12 15:01:34 E/TestDevice: Unable to get setting from string:   "vp9Disabled": "true",
12-12 15:01:34 E/TestDevice: Unable to get setting from string:   "hdrOutputType": "always",
12-12 15:01:34 E/TestDevice: Unable to get setting from string:   "minVideoFramesForPlaybackStart": "50"
12-12 15:01:34 E/TestDevice: Unable to get setting from string: }
12-12 15:01:34 E/TestDevice: Unable to get setting from string: 
12-12 15:01:34 D/NativeDevice: Using property ro.build.version.sdk=31 from cache.
12-12 15:01:34 D/NativeDevice: Using property ro.build.version.sdk=31 from cache.
12-12 15:01:34 D/NativeDevice: Using property ro.build.type=user from cache.
12-12 15:01:34 I/DeviceBaselineChecker: Enable device baselines  in 0 millis.
12-12 15:01:34 D/ModuleDefinition: Running module armeabi-v7a CtsAppTestCases[instant]
12-12 15:01:34 D/ModuleDefinition: Running setup preparer: LocationCheck
12-12 15:01:34 I/LocationCheck: Verifying location setting
12-12 15:01:35 D/ModuleDefinition: Running setup preparer: SuiteApkInstaller
12-12 15:01:35 D/TestAppInstallSetup: Using abi armeabi-v7a from abi option.
12-12 15:01:35 D/NativeDevice: Using property ro.build.version.sdk=31 from cache.
12-12 15:01:35 D/NativeDevice: Using property ro.build.version.sdk=31 from cache.
12-12 15:01:35 D/NativeDevice: Using property ro.build.version.codename=REL from cache.
12-12 15:01:35 D/NativeDevice: Using property ro.build.version.sdk=31 from cache.
12-12 15:01:35 D/RunUtil: Running command [adb, -s, SKBFXYVX173T, shell, pm, list, features] with timeout: 2m 0s
12-12 15:01:35 D/NativeDevice: Using property ro.build.version.sdk=31 from cache.
12-12 15:01:35 D/NativeDevice: Using property ro.build.version.codename=REL from cache.
12-12 15:01:35 D/SearchArtifactUtil: Searching for file CtsSimpleApp.apk. Search directories: [/tmp/xts-root-dir-fa5dd1c2-3ba7-4cdd-9904-a00e7a84339f/android-cts/testcases, /tmp/xts-root-dir-fa5dd1c2-3ba7-4cdd-9904-a00e7a84339f/android-cts/testcases, /tmp/tf-workfolder16635743860164734351]
12-12 15:01:35 W/SearchArtifactUtil: we have a module name: CtsAppTestCases but no directory found in /tmp/xts-root-dir-fa5dd1c2-3ba7-4cdd-9904-a00e7a84339f/android-cts/testcases.
12-12 15:01:35 D/SearchArtifactUtil: Found file /tmp/xts-root-dir-fa5dd1c2-3ba7-4cdd-9904-a00e7a84339f/android-cts/testcases/CtsSimpleApp.apk in search directory /tmp/xts-root-dir-fa5dd1c2-3ba7-4cdd-9904-a00e7a84339f/android-cts/testcases.
12-12 15:01:35 D/RunUtil: Running command [aapt2, dump, badging, /tmp/xts-root-dir-fa5dd1c2-3ba7-4cdd-9904-a00e7a84339f/android-cts/testcases/CtsSimpleApp.apk] with timeout: 1m 0s
12-12 15:01:35 D/RunUtil: Running command [aapt2, dump, xmltree, /tmp/xts-root-dir-fa5dd1c2-3ba7-4cdd-9904-a00e7a84339f/android-cts/testcases/CtsSimpleApp.apk, --file, AndroidManifest.xml] with timeout: 1m 0s
12-12 15:01:35 D/TestAppInstallSetup: Installing apk com.android.cts.launcherapps.simpleapp with [/tmp/xts-root-dir-fa5dd1c2-3ba7-4cdd-9904-a00e7a84339f/android-cts/testcases/CtsSimpleApp.apk] ...
12-12 15:01:35 D/NativeDevice: Using property ro.build.version.sdk=31 from cache.
12-12 15:01:35 D/CtsSimpleApp.apk: Uploading CtsSimpleApp.apk onto device 'SKBFXYVX173T'
12-12 15:01:35 D/DeviceImpl: Uploading file onto device 'SKBFXYVX173T'
12-12 15:01:35 D/RunUtil: Running command [aapt, dump, badging, /tmp/xts-root-dir-fa5dd1c2-3ba7-4cdd-9904-a00e7a84339f/android-cts/testcases/CtsSimpleApp.apk] with timeout: 1m 0s
12-12 15:01:35 D/RunUtil: Running command [aapt, dump, xmltree, /tmp/xts-root-dir-fa5dd1c2-3ba7-4cdd-9904-a00e7a84339f/android-cts/testcases/CtsSimpleApp.apk, AndroidManifest.xml] with timeout: 1m 0s
12-12 15:01:35 D/RunUtil: Running command [adb, -s, SKBFXYVX173T, shell, appops, write-settings] with timeout: 2m 0s
12-12 15:01:36 D/SearchArtifactUtil: Searching for file CtsAppTestStubs.apk. Search directories: [/tmp/xts-root-dir-fa5dd1c2-3ba7-4cdd-9904-a00e7a84339f/android-cts/testcases, /tmp/xts-root-dir-fa5dd1c2-3ba7-4cdd-9904-a00e7a84339f/android-cts/testcases, /tmp/tf-workfolder16635743860164734351]
12-12 15:01:36 W/SearchArtifactUtil: we have a module name: CtsAppTestCases but no directory found in /tmp/xts-root-dir-fa5dd1c2-3ba7-4cdd-9904-a00e7a84339f/android-cts/testcases.
12-12 15:01:36 D/SearchArtifactUtil: Found file /tmp/xts-root-dir-fa5dd1c2-3ba7-4cdd-9904-a00e7a84339f/android-cts/testcases/CtsAppTestStubs.apk in search directory /tmp/xts-root-dir-fa5dd1c2-3ba7-4cdd-9904-a00e7a84339f/android-cts/testcases.
12-12 15:01:36 D/RunUtil: Running command [aapt2, dump, badging, /tmp/xts-root-dir-fa5dd1c2-3ba7-4cdd-9904-a00e7a84339f/android-cts/testcases/CtsAppTestStubs.apk] with timeout: 1m 0s
12-12 15:01:36 D/RunUtil: Running command [aapt2, dump, xmltree, /tmp/xts-root-dir-fa5dd1c2-3ba7-4cdd-9904-a00e7a84339f/android-cts/testcases/CtsAppTestStubs.apk, --file, AndroidManifest.xml] with timeout: 1m 0s
12-12 15:01:36 D/TestAppInstallSetup: Installing apk android.app.stubs with [/tmp/xts-root-dir-fa5dd1c2-3ba7-4cdd-9904-a00e7a84339f/android-cts/testcases/CtsAppTestStubs.apk] ...
12-12 15:01:36 D/NativeDevice: Using property ro.build.version.sdk=31 from cache.
12-12 15:01:36 D/CtsAppTestStubs.apk: Uploading CtsAppTestStubs.apk onto device 'SKBFXYVX173T'
12-12 15:01:36 D/DeviceImpl: Uploading file onto device 'SKBFXYVX173T'
12-12 15:01:38 D/RunUtil: Running command [aapt, dump, badging, /tmp/xts-root-dir-fa5dd1c2-3ba7-4cdd-9904-a00e7a84339f/android-cts/testcases/CtsAppTestStubs.apk] with timeout: 1m 0s
12-12 15:01:38 D/RunUtil: Running command [aapt, dump, xmltree, /tmp/xts-root-dir-fa5dd1c2-3ba7-4cdd-9904-a00e7a84339f/android-cts/testcases/CtsAppTestStubs.apk, AndroidManifest.xml] with timeout: 1m 0s
12-12 15:01:38 D/RunUtil: Running command [adb, -s, SKBFXYVX173T, shell, appops, write-settings] with timeout: 2m 0s
12-12 15:01:38 D/SearchArtifactUtil: Searching for file CtsAppTestStubsApp1.apk. Search directories: [/tmp/xts-root-dir-fa5dd1c2-3ba7-4cdd-9904-a00e7a84339f/android-cts/testcases, /tmp/xts-root-dir-fa5dd1c2-3ba7-4cdd-9904-a00e7a84339f/android-cts/testcases, /tmp/tf-workfolder16635743860164734351]
12-12 15:01:38 W/SearchArtifactUtil: we have a module name: CtsAppTestCases but no directory found in /tmp/xts-root-dir-fa5dd1c2-3ba7-4cdd-9904-a00e7a84339f/android-cts/testcases.
12-12 15:01:38 D/SearchArtifactUtil: Found file /tmp/xts-root-dir-fa5dd1c2-3ba7-4cdd-9904-a00e7a84339f/android-cts/testcases/CtsAppTestStubsApp1.apk in search directory /tmp/xts-root-dir-fa5dd1c2-3ba7-4cdd-9904-a00e7a84339f/android-cts/testcases.
12-12 15:01:38 D/RunUtil: Running command [aapt2, dump, badging, /tmp/xts-root-dir-fa5dd1c2-3ba7-4cdd-9904-a00e7a84339f/android-cts/testcases/CtsAppTestStubsApp1.apk] with timeout: 1m 0s
12-12 15:01:38 D/RunUtil: Running command [aapt2, dump, xmltree, /tmp/xts-root-dir-fa5dd1c2-3ba7-4cdd-9904-a00e7a84339f/android-cts/testcases/CtsAppTestStubsApp1.apk, --file, AndroidManifest.xml] with timeout: 1m 0s
12-12 15:01:39 D/TestAppInstallSetup: Installing apk com.android.app1 with [/tmp/xts-root-dir-fa5dd1c2-3ba7-4cdd-9904-a00e7a84339f/android-cts/testcases/CtsAppTestStubsApp1.apk] ...
12-12 15:01:39 D/NativeDevice: Using property ro.build.version.sdk=31 from cache.
12-12 15:01:39 D/CtsAppTestStubsApp1.apk: Uploading CtsAppTestStubsApp1.apk onto device 'SKBFXYVX173T'
12-12 15:01:39 D/DeviceImpl: Uploading file onto device 'SKBFXYVX173T'
12-12 15:01:41 D/RunUtil: Running command [aapt, dump, badging, /tmp/xts-root-dir-fa5dd1c2-3ba7-4cdd-9904-a00e7a84339f/android-cts/testcases/CtsAppTestStubsApp1.apk] with timeout: 1m 0s
12-12 15:01:41 D/RunUtil: Running command [aapt, dump, xmltree, /tmp/xts-root-dir-fa5dd1c2-3ba7-4cdd-9904-a00e7a84339f/android-cts/testcases/CtsAppTestStubsApp1.apk, AndroidManifest.xml] with timeout: 1m 0s
12-12 15:01:41 D/RunUtil: Running command [adb, -s, SKBFXYVX173T, shell, appops, write-settings] with timeout: 2m 0s
12-12 15:01:41 D/SearchArtifactUtil: Searching for file CtsAppTestStubsApp3.apk. Search directories: [/tmp/xts-root-dir-fa5dd1c2-3ba7-4cdd-9904-a00e7a84339f/android-cts/testcases, /tmp/xts-root-dir-fa5dd1c2-3ba7-4cdd-9904-a00e7a84339f/android-cts/testcases, /tmp/tf-workfolder16635743860164734351]
12-12 15:01:41 W/SearchArtifactUtil: we have a module name: CtsAppTestCases but no directory found in /tmp/xts-root-dir-fa5dd1c2-3ba7-4cdd-9904-a00e7a84339f/android-cts/testcases.
12-12 15:01:41 D/SearchArtifactUtil: Found file /tmp/xts-root-dir-fa5dd1c2-3ba7-4cdd-9904-a00e7a84339f/android-cts/testcases/CtsAppTestStubsApp3.apk in search directory /tmp/xts-root-dir-fa5dd1c2-3ba7-4cdd-9904-a00e7a84339f/android-cts/testcases.
12-12 15:01:41 D/RunUtil: Running command [aapt2, dump, badging, /tmp/xts-root-dir-fa5dd1c2-3ba7-4cdd-9904-a00e7a84339f/android-cts/testcases/CtsAppTestStubsApp3.apk] with timeout: 1m 0s
12-12 15:01:41 D/RunUtil: Running command [aapt2, dump, xmltree, /tmp/xts-root-dir-fa5dd1c2-3ba7-4cdd-9904-a00e7a84339f/android-cts/testcases/CtsAppTestStubsApp3.apk, --file, AndroidManifest.xml] with timeout: 1m 0s
12-12 15:01:41 D/TestAppInstallSetup: Installing apk com.android.app3 with [/tmp/xts-root-dir-fa5dd1c2-3ba7-4cdd-9904-a00e7a84339f/android-cts/testcases/CtsAppTestStubsApp3.apk] ...
12-12 15:01:41 D/NativeDevice: Using property ro.build.version.sdk=31 from cache.
12-12 15:01:41 D/CtsAppTestStubsApp3.apk: Uploading CtsAppTestStubsApp3.apk onto device 'SKBFXYVX173T'
12-12 15:01:41 D/DeviceImpl: Uploading file onto device 'SKBFXYVX173T'
12-12 15:01:43 D/RunUtil: Running command [aapt, dump, badging, /tmp/xts-root-dir-fa5dd1c2-3ba7-4cdd-9904-a00e7a84339f/android-cts/testcases/CtsAppTestStubsApp3.apk] with timeout: 1m 0s
12-12 15:01:43 D/RunUtil: Running command [aapt, dump, xmltree, /tmp/xts-root-dir-fa5dd1c2-3ba7-4cdd-9904-a00e7a84339f/android-cts/testcases/CtsAppTestStubsApp3.apk, AndroidManifest.xml] with timeout: 1m 0s
12-12 15:01:43 D/RunUtil: Running command [adb, -s, SKBFXYVX173T, shell, appops, write-settings] with timeout: 2m 0s
12-12 15:01:43 D/SearchArtifactUtil: Searching for file CtsAppTestStubsApp2.apk. Search directories: [/tmp/xts-root-dir-fa5dd1c2-3ba7-4cdd-9904-a00e7a84339f/android-cts/testcases, /tmp/xts-root-dir-fa5dd1c2-3ba7-4cdd-9904-a00e7a84339f/android-cts/testcases, /tmp/tf-workfolder16635743860164734351]
12-12 15:01:43 W/SearchArtifactUtil: we have a module name: CtsAppTestCases but no directory found in /tmp/xts-root-dir-fa5dd1c2-3ba7-4cdd-9904-a00e7a84339f/android-cts/testcases.
12-12 15:01:43 D/SearchArtifactUtil: Found file /tmp/xts-root-dir-fa5dd1c2-3ba7-4cdd-9904-a00e7a84339f/android-cts/testcases/CtsAppTestStubsApp2.apk in search directory /tmp/xts-root-dir-fa5dd1c2-3ba7-4cdd-9904-a00e7a84339f/android-cts/testcases.
12-12 15:01:43 D/RunUtil: Running command [aapt2, dump, badging, /tmp/xts-root-dir-fa5dd1c2-3ba7-4cdd-9904-a00e7a84339f/android-cts/testcases/CtsAppTestStubsApp2.apk] with timeout: 1m 0s
12-12 15:01:43 D/RunUtil: Running command [aapt2, dump, xmltree, /tmp/xts-root-dir-fa5dd1c2-3ba7-4cdd-9904-a00e7a84339f/android-cts/testcases/CtsAppTestStubsApp2.apk, --file, AndroidManifest.xml] with timeout: 1m 0s
12-12 15:01:43 D/TestAppInstallSetup: Installing apk com.android.app2 with [/tmp/xts-root-dir-fa5dd1c2-3ba7-4cdd-9904-a00e7a84339f/android-cts/testcases/CtsAppTestStubsApp2.apk] ...
12-12 15:01:43 D/NativeDevice: Using property ro.build.version.sdk=31 from cache.
12-12 15:01:43 D/CtsAppTestStubsApp2.apk: Uploading CtsAppTestStubsApp2.apk onto device 'SKBFXYVX173T'
12-12 15:01:44 D/DeviceImpl: Uploading file onto device 'SKBFXYVX173T'
12-12 15:01:46 D/RunUtil: Running command [aapt, dump, badging, /tmp/xts-root-dir-fa5dd1c2-3ba7-4cdd-9904-a00e7a84339f/android-cts/testcases/CtsAppTestStubsApp2.apk] with timeout: 1m 0s
12-12 15:01:46 D/RunUtil: Running command [aapt, dump, xmltree, /tmp/xts-root-dir-fa5dd1c2-3ba7-4cdd-9904-a00e7a84339f/android-cts/testcases/CtsAppTestStubsApp2.apk, AndroidManifest.xml] with timeout: 1m 0s
12-12 15:01:46 D/RunUtil: Running command [adb, -s, SKBFXYVX173T, shell, appops, write-settings] with timeout: 2m 0s
12-12 15:01:46 D/SearchArtifactUtil: Searching for file CtsAppTestStubsApi30.apk. Search directories: [/tmp/xts-root-dir-fa5dd1c2-3ba7-4cdd-9904-a00e7a84339f/android-cts/testcases, /tmp/xts-root-dir-fa5dd1c2-3ba7-4cdd-9904-a00e7a84339f/android-cts/testcases, /tmp/tf-workfolder16635743860164734351]
12-12 15:01:46 W/SearchArtifactUtil: we have a module name: CtsAppTestCases but no directory found in /tmp/xts-root-dir-fa5dd1c2-3ba7-4cdd-9904-a00e7a84339f/android-cts/testcases.
12-12 15:01:46 D/SearchArtifactUtil: Found file /tmp/xts-root-dir-fa5dd1c2-3ba7-4cdd-9904-a00e7a84339f/android-cts/testcases/CtsAppTestStubsApi30.apk in search directory /tmp/xts-root-dir-fa5dd1c2-3ba7-4cdd-9904-a00e7a84339f/android-cts/testcases.
12-12 15:01:46 D/RunUtil: Running command [aapt2, dump, badging, /tmp/xts-root-dir-fa5dd1c2-3ba7-4cdd-9904-a00e7a84339f/android-cts/testcases/CtsAppTestStubsApi30.apk] with timeout: 1m 0s
12-12 15:01:46 D/RunUtil: Running command [aapt2, dump, xmltree, /tmp/xts-root-dir-fa5dd1c2-3ba7-4cdd-9904-a00e7a84339f/android-cts/testcases/CtsAppTestStubsApi30.apk, --file, AndroidManifest.xml] with timeout: 1m 0s
12-12 15:01:46 D/TestAppInstallSetup: Installing apk com.android.app4 with [/tmp/xts-root-dir-fa5dd1c2-3ba7-4cdd-9904-a00e7a84339f/android-cts/testcases/CtsAppTestStubsApi30.apk] ...
12-12 15:01:46 D/NativeDevice: Using property ro.build.version.sdk=31 from cache.
12-12 15:01:46 D/CtsAppTestStubsApi30.apk: Uploading CtsAppTestStubsApi30.apk onto device 'SKBFXYVX173T'
12-12 15:01:46 D/DeviceImpl: Uploading file onto device 'SKBFXYVX173T'
12-12 15:01:47 D/RunUtil: Running command [aapt, dump, badging, /tmp/xts-root-dir-fa5dd1c2-3ba7-4cdd-9904-a00e7a84339f/android-cts/testcases/CtsAppTestStubsApi30.apk] with timeout: 1m 0s
12-12 15:01:47 D/RunUtil: Running command [aapt, dump, xmltree, /tmp/xts-root-dir-fa5dd1c2-3ba7-4cdd-9904-a00e7a84339f/android-cts/testcases/CtsAppTestStubsApi30.apk, AndroidManifest.xml] with timeout: 1m 0s
12-12 15:01:47 D/RunUtil: Running command [adb, -s, SKBFXYVX173T, shell, appops, write-settings] with timeout: 2m 0s
12-12 15:01:47 D/SearchArtifactUtil: Searching for file CtsAppTestCases.apk. Search directories: [/tmp/xts-root-dir-fa5dd1c2-3ba7-4cdd-9904-a00e7a84339f/android-cts/testcases, /tmp/xts-root-dir-fa5dd1c2-3ba7-4cdd-9904-a00e7a84339f/android-cts/testcases, /tmp/tf-workfolder16635743860164734351]
12-12 15:01:47 W/SearchArtifactUtil: we have a module name: CtsAppTestCases but no directory found in /tmp/xts-root-dir-fa5dd1c2-3ba7-4cdd-9904-a00e7a84339f/android-cts/testcases.
12-12 15:01:47 D/SearchArtifactUtil: Found file /tmp/xts-root-dir-fa5dd1c2-3ba7-4cdd-9904-a00e7a84339f/android-cts/testcases/CtsAppTestCases.apk in search directory /tmp/xts-root-dir-fa5dd1c2-3ba7-4cdd-9904-a00e7a84339f/android-cts/testcases.
12-12 15:01:47 D/RunUtil: Running command [aapt2, dump, badging, /tmp/xts-root-dir-fa5dd1c2-3ba7-4cdd-9904-a00e7a84339f/android-cts/testcases/CtsAppTestCases.apk] with timeout: 1m 0s
12-12 15:01:47 D/RunUtil: Running command [aapt2, dump, xmltree, /tmp/xts-root-dir-fa5dd1c2-3ba7-4cdd-9904-a00e7a84339f/android-cts/testcases/CtsAppTestCases.apk, --file, AndroidManifest.xml] with timeout: 1m 0s
12-12 15:01:47 D/TestAppInstallSetup: Installing apk android.app.cts with [/tmp/xts-root-dir-fa5dd1c2-3ba7-4cdd-9904-a00e7a84339f/android-cts/testcases/CtsAppTestCases.apk] ...
12-12 15:01:47 D/NativeDevice: Using property ro.build.version.sdk=31 from cache.
12-12 15:01:47 D/CtsAppTestCases.apk: Uploading CtsAppTestCases.apk onto device 'SKBFXYVX173T'
12-12 15:01:47 D/DeviceImpl: Uploading file onto device 'SKBFXYVX173T'
12-12 15:01:50 D/RunUtil: Running command [aapt, dump, badging, /tmp/xts-root-dir-fa5dd1c2-3ba7-4cdd-9904-a00e7a84339f/android-cts/testcases/CtsAppTestCases.apk] with timeout: 1m 0s
12-12 15:01:50 D/RunUtil: Running command [aapt, dump, xmltree, /tmp/xts-root-dir-fa5dd1c2-3ba7-4cdd-9904-a00e7a84339f/android-cts/testcases/CtsAppTestCases.apk, AndroidManifest.xml] with timeout: 1m 0s
12-12 15:01:50 D/RunUtil: Running command [adb, -s, SKBFXYVX173T, shell, appops, write-settings] with timeout: 2m 0s
12-12 15:01:50 D/SearchArtifactUtil: Searching for file CtsBadProviderStubs.apk. Search directories: [/tmp/xts-root-dir-fa5dd1c2-3ba7-4cdd-9904-a00e7a84339f/android-cts/testcases, /tmp/xts-root-dir-fa5dd1c2-3ba7-4cdd-9904-a00e7a84339f/android-cts/testcases, /tmp/tf-workfolder16635743860164734351]
12-12 15:01:50 W/SearchArtifactUtil: we have a module name: CtsAppTestCases but no directory found in /tmp/xts-root-dir-fa5dd1c2-3ba7-4cdd-9904-a00e7a84339f/android-cts/testcases.
12-12 15:01:50 D/SearchArtifactUtil: Found file /tmp/xts-root-dir-fa5dd1c2-3ba7-4cdd-9904-a00e7a84339f/android-cts/testcases/CtsBadProviderStubs.apk in search directory /tmp/xts-root-dir-fa5dd1c2-3ba7-4cdd-9904-a00e7a84339f/android-cts/testcases.
12-12 15:01:50 D/RunUtil: Running command [aapt2, dump, badging, /tmp/xts-root-dir-fa5dd1c2-3ba7-4cdd-9904-a00e7a84339f/android-cts/testcases/CtsBadProviderStubs.apk] with timeout: 1m 0s
12-12 15:01:50 D/RunUtil: Running command [aapt2, dump, xmltree, /tmp/xts-root-dir-fa5dd1c2-3ba7-4cdd-9904-a00e7a84339f/android-cts/testcases/CtsBadProviderStubs.apk, --file, AndroidManifest.xml] with timeout: 1m 0s
12-12 15:01:50 D/TestAppInstallSetup: Installing apk com.android.cts.stubbad with [/tmp/xts-root-dir-fa5dd1c2-3ba7-4cdd-9904-a00e7a84339f/android-cts/testcases/CtsBadProviderStubs.apk] ...
12-12 15:01:50 D/NativeDevice: Using property ro.build.version.sdk=31 from cache.
12-12 15:01:50 D/CtsBadProviderStubs.apk: Uploading CtsBadProviderStubs.apk onto device 'SKBFXYVX173T'
12-12 15:01:51 D/DeviceImpl: Uploading file onto device 'SKBFXYVX173T'
12-12 15:01:51 D/RunUtil: Running command [aapt, dump, badging, /tmp/xts-root-dir-fa5dd1c2-3ba7-4cdd-9904-a00e7a84339f/android-cts/testcases/CtsBadProviderStubs.apk] with timeout: 1m 0s
12-12 15:01:51 D/RunUtil: Running command [aapt, dump, xmltree, /tmp/xts-root-dir-fa5dd1c2-3ba7-4cdd-9904-a00e7a84339f/android-cts/testcases/CtsBadProviderStubs.apk, AndroidManifest.xml] with timeout: 1m 0s
12-12 15:01:51 D/RunUtil: Running command [adb, -s, SKBFXYVX173T, shell, appops, write-settings] with timeout: 2m 0s
12-12 15:01:51 D/SearchArtifactUtil: Searching for file CtsCantSaveState1.apk. Search directories: [/tmp/xts-root-dir-fa5dd1c2-3ba7-4cdd-9904-a00e7a84339f/android-cts/testcases, /tmp/xts-root-dir-fa5dd1c2-3ba7-4cdd-9904-a00e7a84339f/android-cts/testcases, /tmp/tf-workfolder16635743860164734351]
12-12 15:01:51 W/SearchArtifactUtil: we have a module name: CtsAppTestCases but no directory found in /tmp/xts-root-dir-fa5dd1c2-3ba7-4cdd-9904-a00e7a84339f/android-cts/testcases.
12-12 15:01:51 D/SearchArtifactUtil: Found file /tmp/xts-root-dir-fa5dd1c2-3ba7-4cdd-9904-a00e7a84339f/android-cts/testcases/CtsCantSaveState1.apk in search directory /tmp/xts-root-dir-fa5dd1c2-3ba7-4cdd-9904-a00e7a84339f/android-cts/testcases.
12-12 15:01:51 D/RunUtil: Running command [aapt2, dump, badging, /tmp/xts-root-dir-fa5dd1c2-3ba7-4cdd-9904-a00e7a84339f/android-cts/testcases/CtsCantSaveState1.apk] with timeout: 1m 0s
12-12 15:01:51 D/RunUtil: Running command [aapt2, dump, xmltree, /tmp/xts-root-dir-fa5dd1c2-3ba7-4cdd-9904-a00e7a84339f/android-cts/testcases/CtsCantSaveState1.apk, --file, AndroidManifest.xml] with timeout: 1m 0s
12-12 15:01:51 D/TestAppInstallSetup: Installing apk com.android.test.cantsavestate1 with [/tmp/xts-root-dir-fa5dd1c2-3ba7-4cdd-9904-a00e7a84339f/android-cts/testcases/CtsCantSaveState1.apk] ...
12-12 15:01:51 D/NativeDevice: Using property ro.build.version.sdk=31 from cache.
12-12 15:01:51 D/CtsCantSaveState1.apk: Uploading CtsCantSaveState1.apk onto device 'SKBFXYVX173T'
12-12 15:01:51 D/DeviceImpl: Uploading file onto device 'SKBFXYVX173T'
12-12 15:01:52 D/RunUtil: Running command [aapt, dump, badging, /tmp/xts-root-dir-fa5dd1c2-3ba7-4cdd-9904-a00e7a84339f/android-cts/testcases/CtsCantSaveState1.apk] with timeout: 1m 0s
12-12 15:01:52 D/RunUtil: Running command [aapt, dump, xmltree, /tmp/xts-root-dir-fa5dd1c2-3ba7-4cdd-9904-a00e7a84339f/android-cts/testcases/CtsCantSaveState1.apk, AndroidManifest.xml] with timeout: 1m 0s
12-12 15:01:52 D/RunUtil: Running command [adb, -s, SKBFXYVX173T, shell, appops, write-settings] with timeout: 2m 0s
12-12 15:01:52 D/SearchArtifactUtil: Searching for file CtsCantSaveState2.apk. Search directories: [/tmp/xts-root-dir-fa5dd1c2-3ba7-4cdd-9904-a00e7a84339f/android-cts/testcases, /tmp/xts-root-dir-fa5dd1c2-3ba7-4cdd-9904-a00e7a84339f/android-cts/testcases, /tmp/tf-workfolder16635743860164734351]
12-12 15:01:52 W/SearchArtifactUtil: we have a module name: CtsAppTestCases but no directory found in /tmp/xts-root-dir-fa5dd1c2-3ba7-4cdd-9904-a00e7a84339f/android-cts/testcases.
12-12 15:01:52 D/SearchArtifactUtil: Found file /tmp/xts-root-dir-fa5dd1c2-3ba7-4cdd-9904-a00e7a84339f/android-cts/testcases/CtsCantSaveState2.apk in search directory /tmp/xts-root-dir-fa5dd1c2-3ba7-4cdd-9904-a00e7a84339f/android-cts/testcases.
12-12 15:01:52 D/RunUtil: Running command [aapt2, dump, badging, /tmp/xts-root-dir-fa5dd1c2-3ba7-4cdd-9904-a00e7a84339f/android-cts/testcases/CtsCantSaveState2.apk] with timeout: 1m 0s
12-12 15:01:52 D/RunUtil: Running command [aapt2, dump, xmltree, /tmp/xts-root-dir-fa5dd1c2-3ba7-4cdd-9904-a00e7a84339f/android-cts/testcases/CtsCantSaveState2.apk, --file, AndroidManifest.xml] with timeout: 1m 0s
12-12 15:01:52 D/TestAppInstallSetup: Installing apk com.android.test.cantsavestate2 with [/tmp/xts-root-dir-fa5dd1c2-3ba7-4cdd-9904-a00e7a84339f/android-cts/testcases/CtsCantSaveState2.apk] ...
12-12 15:01:52 D/NativeDevice: Using property ro.build.version.sdk=31 from cache.
12-12 15:01:52 D/CtsCantSaveState2.apk: Uploading CtsCantSaveState2.apk onto device 'SKBFXYVX173T'
12-12 15:01:52 D/DeviceImpl: Uploading file onto device 'SKBFXYVX173T'
12-12 15:01:53 D/RunUtil: Running command [aapt, dump, badging, /tmp/xts-root-dir-fa5dd1c2-3ba7-4cdd-9904-a00e7a84339f/android-cts/testcases/CtsCantSaveState2.apk] with timeout: 1m 0s
12-12 15:01:53 D/RunUtil: Running command [aapt, dump, xmltree, /tmp/xts-root-dir-fa5dd1c2-3ba7-4cdd-9904-a00e7a84339f/android-cts/testcases/CtsCantSaveState2.apk, AndroidManifest.xml] with timeout: 1m 0s
12-12 15:01:53 D/RunUtil: Running command [adb, -s, SKBFXYVX173T, shell, appops, write-settings] with timeout: 2m 0s
12-12 15:01:53 D/SearchArtifactUtil: Searching for file NotificationDelegator.apk. Search directories: [/tmp/xts-root-dir-fa5dd1c2-3ba7-4cdd-9904-a00e7a84339f/android-cts/testcases, /tmp/xts-root-dir-fa5dd1c2-3ba7-4cdd-9904-a00e7a84339f/android-cts/testcases, /tmp/tf-workfolder16635743860164734351]
12-12 15:01:53 W/SearchArtifactUtil: we have a module name: CtsAppTestCases but no directory found in /tmp/xts-root-dir-fa5dd1c2-3ba7-4cdd-9904-a00e7a84339f/android-cts/testcases.
12-12 15:01:53 D/SearchArtifactUtil: Found file /tmp/xts-root-dir-fa5dd1c2-3ba7-4cdd-9904-a00e7a84339f/android-cts/testcases/NotificationDelegator.apk in search directory /tmp/xts-root-dir-fa5dd1c2-3ba7-4cdd-9904-a00e7a84339f/android-cts/testcases.
12-12 15:01:53 D/RunUtil: Running command [aapt2, dump, badging, /tmp/xts-root-dir-fa5dd1c2-3ba7-4cdd-9904-a00e7a84339f/android-cts/testcases/NotificationDelegator.apk] with timeout: 1m 0s
12-12 15:01:53 D/RunUtil: Running command [aapt2, dump, xmltree, /tmp/xts-root-dir-fa5dd1c2-3ba7-4cdd-9904-a00e7a84339f/android-cts/testcases/NotificationDelegator.apk, --file, AndroidManifest.xml] with timeout: 1m 0s
12-12 15:01:53 D/TestAppInstallSetup: Installing apk com.android.test.notificationdelegator with [/tmp/xts-root-dir-fa5dd1c2-3ba7-4cdd-9904-a00e7a84339f/android-cts/testcases/NotificationDelegator.apk] ...
12-12 15:01:53 D/NativeDevice: Using property ro.build.version.sdk=31 from cache.
12-12 15:01:53 D/NotificationDelegator.apk: Uploading NotificationDelegator.apk onto device 'SKBFXYVX173T'
12-12 15:01:53 D/DeviceImpl: Uploading file onto device 'SKBFXYVX173T'
12-12 15:01:54 D/RunUtil: Running command [aapt, dump, badging, /tmp/xts-root-dir-fa5dd1c2-3ba7-4cdd-9904-a00e7a84339f/android-cts/testcases/NotificationDelegator.apk] with timeout: 1m 0s
12-12 15:01:54 D/RunUtil: Running command [aapt, dump, xmltree, /tmp/xts-root-dir-fa5dd1c2-3ba7-4cdd-9904-a00e7a84339f/android-cts/testcases/NotificationDelegator.apk, AndroidManifest.xml] with timeout: 1m 0s
12-12 15:01:54 D/RunUtil: Running command [adb, -s, SKBFXYVX173T, shell, appops, write-settings] with timeout: 2m 0s
12-12 15:01:54 D/SearchArtifactUtil: Searching for file NotificationProvider.apk. Search directories: [/tmp/xts-root-dir-fa5dd1c2-3ba7-4cdd-9904-a00e7a84339f/android-cts/testcases, /tmp/xts-root-dir-fa5dd1c2-3ba7-4cdd-9904-a00e7a84339f/android-cts/testcases, /tmp/tf-workfolder16635743860164734351]
12-12 15:01:54 W/SearchArtifactUtil: we have a module name: CtsAppTestCases but no directory found in /tmp/xts-root-dir-fa5dd1c2-3ba7-4cdd-9904-a00e7a84339f/android-cts/testcases.
12-12 15:01:54 D/SearchArtifactUtil: Found file /tmp/xts-root-dir-fa5dd1c2-3ba7-4cdd-9904-a00e7a84339f/android-cts/testcases/NotificationProvider.apk in search directory /tmp/xts-root-dir-fa5dd1c2-3ba7-4cdd-9904-a00e7a84339f/android-cts/testcases.
12-12 15:01:54 D/RunUtil: Running command [aapt2, dump, badging, /tmp/xts-root-dir-fa5dd1c2-3ba7-4cdd-9904-a00e7a84339f/android-cts/testcases/NotificationProvider.apk] with timeout: 1m 0s
12-12 15:01:54 D/RunUtil: Running command [aapt2, dump, xmltree, /tmp/xts-root-dir-fa5dd1c2-3ba7-4cdd-9904-a00e7a84339f/android-cts/testcases/NotificationProvider.apk, --file, AndroidManifest.xml] with timeout: 1m 0s
12-12 15:01:54 D/TestAppInstallSetup: Installing apk com.android.test.notificationprovider with [/tmp/xts-root-dir-fa5dd1c2-3ba7-4cdd-9904-a00e7a84339f/android-cts/testcases/NotificationProvider.apk] ...
12-12 15:01:54 D/NativeDevice: Using property ro.build.version.sdk=31 from cache.
12-12 15:01:54 D/NotificationProvider.apk: Uploading NotificationProvider.apk onto device 'SKBFXYVX173T'
12-12 15:01:54 D/DeviceImpl: Uploading file onto device 'SKBFXYVX173T'
12-12 15:01:55 D/RunUtil: Running command [aapt, dump, badging, /tmp/xts-root-dir-fa5dd1c2-3ba7-4cdd-9904-a00e7a84339f/android-cts/testcases/NotificationProvider.apk] with timeout: 1m 0s
12-12 15:01:55 D/RunUtil: Running command [aapt, dump, xmltree, /tmp/xts-root-dir-fa5dd1c2-3ba7-4cdd-9904-a00e7a84339f/android-cts/testcases/NotificationProvider.apk, AndroidManifest.xml] with timeout: 1m 0s
12-12 15:01:55 D/RunUtil: Running command [adb, -s, SKBFXYVX173T, shell, appops, write-settings] with timeout: 2m 0s
12-12 15:01:55 D/SearchArtifactUtil: Searching for file NotificationListener.apk. Search directories: [/tmp/xts-root-dir-fa5dd1c2-3ba7-4cdd-9904-a00e7a84339f/android-cts/testcases, /tmp/xts-root-dir-fa5dd1c2-3ba7-4cdd-9904-a00e7a84339f/android-cts/testcases, /tmp/tf-workfolder16635743860164734351]
12-12 15:01:55 W/SearchArtifactUtil: we have a module name: CtsAppTestCases but no directory found in /tmp/xts-root-dir-fa5dd1c2-3ba7-4cdd-9904-a00e7a84339f/android-cts/testcases.
12-12 15:01:55 D/SearchArtifactUtil: Found file /tmp/xts-root-dir-fa5dd1c2-3ba7-4cdd-9904-a00e7a84339f/android-cts/testcases/NotificationListener.apk in search directory /tmp/xts-root-dir-fa5dd1c2-3ba7-4cdd-9904-a00e7a84339f/android-cts/testcases.
12-12 15:01:55 D/RunUtil: Running command [aapt2, dump, badging, /tmp/xts-root-dir-fa5dd1c2-3ba7-4cdd-9904-a00e7a84339f/android-cts/testcases/NotificationListener.apk] with timeout: 1m 0s
12-12 15:01:55 D/RunUtil: Running command [aapt2, dump, xmltree, /tmp/xts-root-dir-fa5dd1c2-3ba7-4cdd-9904-a00e7a84339f/android-cts/testcases/NotificationListener.apk, --file, AndroidManifest.xml] with timeout: 1m 0s
12-12 15:01:55 D/TestAppInstallSetup: Installing apk com.android.test.notificationlistener with [/tmp/xts-root-dir-fa5dd1c2-3ba7-4cdd-9904-a00e7a84339f/android-cts/testcases/NotificationListener.apk] ...
12-12 15:01:55 D/NativeDevice: Using property ro.build.version.sdk=31 from cache.
12-12 15:01:55 D/NotificationListener.apk: Uploading NotificationListener.apk onto device 'SKBFXYVX173T'
12-12 15:01:55 D/DeviceImpl: Uploading file onto device 'SKBFXYVX173T'
12-12 15:01:56 D/RunUtil: Running command [aapt, dump, badging, /tmp/xts-root-dir-fa5dd1c2-3ba7-4cdd-9904-a00e7a84339f/android-cts/testcases/NotificationListener.apk] with timeout: 1m 0s
12-12 15:01:56 D/RunUtil: Running command [aapt, dump, xmltree, /tmp/xts-root-dir-fa5dd1c2-3ba7-4cdd-9904-a00e7a84339f/android-cts/testcases/NotificationListener.apk, AndroidManifest.xml] with timeout: 1m 0s
12-12 15:01:56 D/RunUtil: Running command [adb, -s, SKBFXYVX173T, shell, appops, write-settings] with timeout: 2m 0s
12-12 15:01:56 D/SearchArtifactUtil: Searching for file StorageDelegator.apk. Search directories: [/tmp/xts-root-dir-fa5dd1c2-3ba7-4cdd-9904-a00e7a84339f/android-cts/testcases, /tmp/xts-root-dir-fa5dd1c2-3ba7-4cdd-9904-a00e7a84339f/android-cts/testcases, /tmp/tf-workfolder16635743860164734351]
12-12 15:01:56 W/SearchArtifactUtil: we have a module name: CtsAppTestCases but no directory found in /tmp/xts-root-dir-fa5dd1c2-3ba7-4cdd-9904-a00e7a84339f/android-cts/testcases.
12-12 15:01:56 D/SearchArtifactUtil: Found file /tmp/xts-root-dir-fa5dd1c2-3ba7-4cdd-9904-a00e7a84339f/android-cts/testcases/StorageDelegator.apk in search directory /tmp/xts-root-dir-fa5dd1c2-3ba7-4cdd-9904-a00e7a84339f/android-cts/testcases.
12-12 15:01:56 D/RunUtil: Running command [aapt2, dump, badging, /tmp/xts-root-dir-fa5dd1c2-3ba7-4cdd-9904-a00e7a84339f/android-cts/testcases/StorageDelegator.apk] with timeout: 1m 0s
12-12 15:01:56 D/RunUtil: Running command [aapt2, dump, xmltree, /tmp/xts-root-dir-fa5dd1c2-3ba7-4cdd-9904-a00e7a84339f/android-cts/testcases/StorageDelegator.apk, --file, AndroidManifest.xml] with timeout: 1m 0s
12-12 15:01:56 D/TestAppInstallSetup: Installing apk com.android.test.storagedelegator with [/tmp/xts-root-dir-fa5dd1c2-3ba7-4cdd-9904-a00e7a84339f/android-cts/testcases/StorageDelegator.apk] ...
12-12 15:01:56 D/NativeDevice: Using property ro.build.version.sdk=31 from cache.
12-12 15:01:56 D/StorageDelegator.apk: Uploading StorageDelegator.apk onto device 'SKBFXYVX173T'
12-12 15:01:56 D/DeviceImpl: Uploading file onto device 'SKBFXYVX173T'
12-12 15:01:57 D/RunUtil: Running command [aapt, dump, badging, /tmp/xts-root-dir-fa5dd1c2-3ba7-4cdd-9904-a00e7a84339f/android-cts/testcases/StorageDelegator.apk] with timeout: 1m 0s
12-12 15:01:57 D/RunUtil: Running command [aapt, dump, xmltree, /tmp/xts-root-dir-fa5dd1c2-3ba7-4cdd-9904-a00e7a84339f/android-cts/testcases/StorageDelegator.apk, AndroidManifest.xml] with timeout: 1m 0s
12-12 15:01:57 D/RunUtil: Running command [adb, -s, SKBFXYVX173T, shell, appops, write-settings] with timeout: 2m 0s
12-12 15:01:57 D/SearchArtifactUtil: Searching for file CtsActivityManagerApi29.apk. Search directories: [/tmp/xts-root-dir-fa5dd1c2-3ba7-4cdd-9904-a00e7a84339f/android-cts/testcases, /tmp/xts-root-dir-fa5dd1c2-3ba7-4cdd-9904-a00e7a84339f/android-cts/testcases, /tmp/tf-workfolder16635743860164734351]
12-12 15:01:57 W/SearchArtifactUtil: we have a module name: CtsAppTestCases but no directory found in /tmp/xts-root-dir-fa5dd1c2-3ba7-4cdd-9904-a00e7a84339f/android-cts/testcases.
12-12 15:01:57 D/SearchArtifactUtil: Found file /tmp/xts-root-dir-fa5dd1c2-3ba7-4cdd-9904-a00e7a84339f/android-cts/testcases/CtsActivityManagerApi29.apk in search directory /tmp/xts-root-dir-fa5dd1c2-3ba7-4cdd-9904-a00e7a84339f/android-cts/testcases.
12-12 15:01:57 D/RunUtil: Running command [aapt2, dump, badging, /tmp/xts-root-dir-fa5dd1c2-3ba7-4cdd-9904-a00e7a84339f/android-cts/testcases/CtsActivityManagerApi29.apk] with timeout: 1m 0s
12-12 15:01:57 D/RunUtil: Running command [aapt2, dump, xmltree, /tmp/xts-root-dir-fa5dd1c2-3ba7-4cdd-9904-a00e7a84339f/android-cts/testcases/CtsActivityManagerApi29.apk, --file, AndroidManifest.xml] with timeout: 1m 0s
12-12 15:01:57 D/TestAppInstallSetup: Installing apk android.app.cts.activitymanager.api29 with [/tmp/xts-root-dir-fa5dd1c2-3ba7-4cdd-9904-a00e7a84339f/android-cts/testcases/CtsActivityManagerApi29.apk] ...
12-12 15:01:57 D/NativeDevice: Using property ro.build.version.sdk=31 from cache.
12-12 15:01:57 D/CtsActivityManagerApi29.apk: Uploading CtsActivityManagerApi29.apk onto device 'SKBFXYVX173T'
12-12 15:01:57 D/DeviceImpl: Uploading file onto device 'SKBFXYVX173T'
12-12 15:01:58 D/RunUtil: Running command [aapt, dump, badging, /tmp/xts-root-dir-fa5dd1c2-3ba7-4cdd-9904-a00e7a84339f/android-cts/testcases/CtsActivityManagerApi29.apk] with timeout: 1m 0s
12-12 15:01:58 D/RunUtil: Running command [aapt, dump, xmltree, /tmp/xts-root-dir-fa5dd1c2-3ba7-4cdd-9904-a00e7a84339f/android-cts/testcases/CtsActivityManagerApi29.apk, AndroidManifest.xml] with timeout: 1m 0s
12-12 15:01:58 D/RunUtil: Running command [adb, -s, SKBFXYVX173T, shell, appops, write-settings] with timeout: 2m 0s
12-12 15:01:58 D/SearchArtifactUtil: Searching for file NotificationTrampoline.apk. Search directories: [/tmp/xts-root-dir-fa5dd1c2-3ba7-4cdd-9904-a00e7a84339f/android-cts/testcases, /tmp/xts-root-dir-fa5dd1c2-3ba7-4cdd-9904-a00e7a84339f/android-cts/testcases, /tmp/tf-workfolder16635743860164734351]
12-12 15:01:58 W/SearchArtifactUtil: we have a module name: CtsAppTestCases but no directory found in /tmp/xts-root-dir-fa5dd1c2-3ba7-4cdd-9904-a00e7a84339f/android-cts/testcases.
12-12 15:01:58 D/SearchArtifactUtil: Found file /tmp/xts-root-dir-fa5dd1c2-3ba7-4cdd-9904-a00e7a84339f/android-cts/testcases/NotificationTrampoline.apk in search directory /tmp/xts-root-dir-fa5dd1c2-3ba7-4cdd-9904-a00e7a84339f/android-cts/testcases.
12-12 15:01:58 D/RunUtil: Running command [aapt2, dump, badging, /tmp/xts-root-dir-fa5dd1c2-3ba7-4cdd-9904-a00e7a84339f/android-cts/testcases/NotificationTrampoline.apk] with timeout: 1m 0s
12-12 15:01:58 D/RunUtil: Running command [aapt2, dump, xmltree, /tmp/xts-root-dir-fa5dd1c2-3ba7-4cdd-9904-a00e7a84339f/android-cts/testcases/NotificationTrampoline.apk, --file, AndroidManifest.xml] with timeout: 1m 0s
12-12 15:01:58 D/TestAppInstallSetup: Installing apk com.android.test.notificationtrampoline.current with [/tmp/xts-root-dir-fa5dd1c2-3ba7-4cdd-9904-a00e7a84339f/android-cts/testcases/NotificationTrampoline.apk] ...
12-12 15:01:58 D/NativeDevice: Using property ro.build.version.sdk=31 from cache.
12-12 15:01:58 D/NotificationTrampoline.apk: Uploading NotificationTrampoline.apk onto device 'SKBFXYVX173T'
12-12 15:01:58 D/DeviceImpl: Uploading file onto device 'SKBFXYVX173T'
12-12 15:01:59 D/RunUtil: Running command [aapt, dump, badging, /tmp/xts-root-dir-fa5dd1c2-3ba7-4cdd-9904-a00e7a84339f/android-cts/testcases/NotificationTrampoline.apk] with timeout: 1m 0s
12-12 15:01:59 D/RunUtil: Running command [aapt, dump, xmltree, /tmp/xts-root-dir-fa5dd1c2-3ba7-4cdd-9904-a00e7a84339f/android-cts/testcases/NotificationTrampoline.apk, AndroidManifest.xml] with timeout: 1m 0s
12-12 15:01:59 D/RunUtil: Running command [adb, -s, SKBFXYVX173T, shell, appops, write-settings] with timeout: 2m 0s
12-12 15:01:59 D/SearchArtifactUtil: Searching for file NotificationTrampolineApi30.apk. Search directories: [/tmp/xts-root-dir-fa5dd1c2-3ba7-4cdd-9904-a00e7a84339f/android-cts/testcases, /tmp/xts-root-dir-fa5dd1c2-3ba7-4cdd-9904-a00e7a84339f/android-cts/testcases, /tmp/tf-workfolder16635743860164734351]
12-12 15:01:59 W/SearchArtifactUtil: we have a module name: CtsAppTestCases but no directory found in /tmp/xts-root-dir-fa5dd1c2-3ba7-4cdd-9904-a00e7a84339f/android-cts/testcases.
12-12 15:01:59 D/SearchArtifactUtil: Found file /tmp/xts-root-dir-fa5dd1c2-3ba7-4cdd-9904-a00e7a84339f/android-cts/testcases/NotificationTrampolineApi30.apk in search directory /tmp/xts-root-dir-fa5dd1c2-3ba7-4cdd-9904-a00e7a84339f/android-cts/testcases.
12-12 15:01:59 D/RunUtil: Running command [aapt2, dump, badging, /tmp/xts-root-dir-fa5dd1c2-3ba7-4cdd-9904-a00e7a84339f/android-cts/testcases/NotificationTrampolineApi30.apk] with timeout: 1m 0s
12-12 15:01:59 D/RunUtil: Running command [aapt2, dump, xmltree, /tmp/xts-root-dir-fa5dd1c2-3ba7-4cdd-9904-a00e7a84339f/android-cts/testcases/NotificationTrampolineApi30.apk, --file, AndroidManifest.xml] with timeout: 1m 0s
12-12 15:01:59 D/TestAppInstallSetup: Installing apk com.android.test.notificationtrampoline.api30 with [/tmp/xts-root-dir-fa5dd1c2-3ba7-4cdd-9904-a00e7a84339f/android-cts/testcases/NotificationTrampolineApi30.apk] ...
12-12 15:01:59 D/NativeDevice: Using property ro.build.version.sdk=31 from cache.
12-12 15:01:59 D/NotificationTrampolineApi30.apk: Uploading NotificationTrampolineApi30.apk onto device 'SKBFXYVX173T'
12-12 15:01:59 D/DeviceImpl: Uploading file onto device 'SKBFXYVX173T'
12-12 15:02:00 D/RunUtil: Running command [aapt, dump, badging, /tmp/xts-root-dir-fa5dd1c2-3ba7-4cdd-9904-a00e7a84339f/android-cts/testcases/NotificationTrampolineApi30.apk] with timeout: 1m 0s
12-12 15:02:00 D/RunUtil: Running command [aapt, dump, xmltree, /tmp/xts-root-dir-fa5dd1c2-3ba7-4cdd-9904-a00e7a84339f/android-cts/testcases/NotificationTrampolineApi30.apk, AndroidManifest.xml] with timeout: 1m 0s
12-12 15:02:00 D/RunUtil: Running command [adb, -s, SKBFXYVX173T, shell, appops, write-settings] with timeout: 2m 0s
12-12 15:02:00 D/ModuleDefinition: Running setup preparer: RunCommandTargetPreparer
12-12 15:02:00 D/RunUtil: Running command [adb, -s, SKBFXYVX173T, shell, input, keyevent, KEYCODE_WAKEUP] with timeout: 2m 0s
12-12 15:02:00 D/RunUtil: Running command [adb, -s, SKBFXYVX173T, shell, wm, dismiss-keyguard] with timeout: 2m 0s
12-12 15:02:00 D/RunUtil: Running command [adb, -s, SKBFXYVX173T, shell, settings, put, global, cw_disable_wifimediator, 1] with timeout: 2m 0s
12-12 15:02:00 D/AndroidJUnitTest: Disable test storage on instant app module.
12-12 15:02:00 D/AndroidJUnitTest: Attempting to push filters to /data/local/tmp/ajur/includes.txt
12-12 15:02:00 D/NativeDevice: Using 'ls' to check doesFileExist(/data/local/tmp/ajur)
12-12 15:02:00 D/RunUtil: Running command [adb, -s, SKBFXYVX173T, shell, ls, '/data/local/tmp/ajur'] with timeout: 2m 0s
12-12 15:02:00 D/NativeDevice: File /data/local/tmp/ajur does not exist.
stdout: 
stderr: ls: /data/local/tmp/ajur: No such file or directory

12-12 15:02:00 D/NativeDevice: Using 'ls' to check doesFileExist(/data/local/tmp/ajur/includes.txt)
12-12 15:02:00 D/RunUtil: Running command [adb, -s, SKBFXYVX173T, shell, ls, '/data/local/tmp/ajur/includes.txt'] with timeout: 2m 0s
12-12 15:02:00 D/FileUtil: Creating temp file at /tmp/xts-root-dir-fa5dd1c2-3ba7-4cdd-9904-a00e7a84339f/android-cts/logs/2025.12.12_15.00.56/inv_18424983443859154131 with prefix "filter-armeabi-v7a%20CtsAppTestCases%5Binstant%5D4349774685288463829.include_" suffix ".txt.gz"
12-12 15:02:00 I/LogFileSaver: Saved gzip log file /tmp/xts-root-dir-fa5dd1c2-3ba7-4cdd-9904-a00e7a84339f/android-cts/logs/2025.12.12_15.00.56/inv_18424983443859154131/filter-armeabi-v7a%20CtsAppTestCases%5Binstant%5D4349774685288463829.include_9234710477288945342.txt.gz. [size=10, elapsed=1ms]
12-12 15:02:00 D/CertificationSuiteResultReporter: Saved logs for filter-armeabi-v7a%20CtsAppTestCases%5Binstant%5D4349774685288463829.include in /tmp/xts-root-dir-fa5dd1c2-3ba7-4cdd-9904-a00e7a84339f/android-cts/logs/2025.12.12_15.00.56/inv_18424983443859154131/filter-armeabi-v7a%20CtsAppTestCases%5Binstant%5D4349774685288463829.include_9234710477288945342.txt.gz
12-12 15:02:00 D/FileUtil: Creating temp file at /tmp/13441469/cts/inv_12648427467095576587/inv_2368518573660175600 with prefix "filter-armeabi-v7a%20CtsAppTestCases%5Binstant%5D4349774685288463829.include_" suffix ".txt.gz"
12-12 15:02:00 I/LogFileSaver: Saved gzip log file /tmp/13441469/cts/inv_12648427467095576587/inv_2368518573660175600/filter-armeabi-v7a%20CtsAppTestCases%5Binstant%5D4349774685288463829.include_409360733251643950.txt.gz. [size=10, elapsed=0ms]
12-12 15:02:00 D/NativeDevice: Using property ro.build.version.sdk=31 from cache.
12-12 15:02:00 D/NativeDevice: Using property ro.build.version.sdk=31 from cache.
12-12 15:02:00 D/NativeDevice: Using property ro.build.version.codename=REL from cache.
12-12 15:02:00 D/NativeDevice: Using property ro.build.version.sdk=31 from cache.
12-12 15:02:00 D/InstrumentationTest: Collecting test info for android.app.cts on device SKBFXYVX173T
12-12 15:02:00 I/RemoteAndroidTestRunner: Running am instrument -w -r --no-hidden-api-checks --abi armeabi-v7a  -e testFile /data/local/tmp/ajur/includes.txt -e debug false -e newRunListenerMode true -e log true -e notAnnotation android.platform.test.annotations.AsbSecurityTest,com.android.compatibility.common.util.CtsDownstreamingTest,android.platform.test.annotations.AppModeFull -e timeout_msec 300000 android.app.cts/androidx.test.runner.AndroidJUnitRunner on foxconn-bfx_at100-SKBFXYVX173T
12-12 15:02:02 D/InstrumentationTest: Initializing com.android.tradefed.device.metric.CountTestCasesCollector for instrumentation.
12-12 15:02:02 I/RemoteAndroidTestRunner: Running am instrument -w -r --no-hidden-api-checks --abi armeabi-v7a  -e testFile /data/local/tmp/ajur/includes.txt -e debug false -e newRunListenerMode true -e log false -e notAnnotation android.platform.test.annotations.AsbSecurityTest,com.android.compatibility.common.util.CtsDownstreamingTest,android.platform.test.annotations.AppModeFull -e timeout_msec 300000 android.app.cts/androidx.test.runner.AndroidJUnitRunner on foxconn-bfx_at100-SKBFXYVX173T
12-12 15:02:03 D/ModuleListener: ModuleListener.testRunStarted(android.app.cts, 1, 0) on SKBFXYVX173T
12-12 15:02:03 D/ModuleListener: ModuleListener.testStarted(android.app.cts.DownloadManagerTest#testDownloadManagerSupportsHttpsWithExternalWebServer) on SKBFXYVX173T
12-12 15:05:03 I/ModuleListener: [1/1] SKBFXYVX173T android.app.cts.DownloadManagerTest#testDownloadManagerSupportsHttpsWithExternalWebServer FAILURE: java.lang.InterruptedException: Timeout waiting for IDs [1]; received [].  Make sure you have WiFi or some other connectivity for this test.
	at android.app.cts.DownloadManagerTestBase$DownloadCompleteReceiver.waitForDownloadComplete(DownloadManagerTestBase.java:525)
	at android.app.cts.DownloadManagerTest.testDownloadManagerSupportsHttpsWithExternalWebServer(DownloadManagerTest.java:183)

12-12 15:05:04 D/ModuleListener: ModuleListener.testRunEnded(181515) on SKBFXYVX173T
12-12 15:05:04 D/RunUtil: Running command [adb, -s, SKBFXYVX173T, shell, settings, put, global, cw_disable_wifimediator, 0] with timeout: 2m 0s
12-12 15:05:05 D/TestDevice: Uninstalling com.android.test.notificationtrampoline.api30 with extra args 
12-12 15:05:05 D/TestDevice: Uninstalling android.app.cts with extra args 
12-12 15:05:06 D/TestDevice: Uninstalling com.android.test.storagedelegator with extra args 
12-12 15:05:07 D/TestDevice: Uninstalling com.android.test.notificationtrampoline.current with extra args 
12-12 15:05:08 D/TestDevice: Uninstalling com.android.app4 with extra args 
12-12 15:05:09 D/TestDevice: Uninstalling com.android.app3 with extra args 
12-12 15:05:09 D/TestDevice: Uninstalling com.android.test.cantsavestate1 with extra args 
12-12 15:05:10 D/TestDevice: Uninstalling com.android.test.notificationdelegator with extra args 
12-12 15:05:11 D/TestDevice: Uninstalling com.android.app2 with extra args 
12-12 15:05:12 D/TestDevice: Uninstalling com.android.test.cantsavestate2 with extra args 
12-12 15:05:13 D/TestDevice: Uninstalling com.android.app1 with extra args 
12-12 15:05:13 D/TestDevice: Uninstalling com.android.cts.stubbad with extra args 
12-12 15:05:14 D/TestDevice: Uninstalling com.android.test.notificationprovider with extra args 
12-12 15:05:15 D/TestDevice: Uninstalling android.app.stubs with extra args 
12-12 15:05:16 D/TestDevice: Uninstalling android.app.cts.activitymanager.api29 with extra args 
12-12 15:05:17 D/TestDevice: Uninstalling com.android.cts.launcherapps.simpleapp with extra args 
12-12 15:05:17 D/TestDevice: Uninstalling com.android.test.notificationlistener with extra args 
12-12 15:05:18 I/NativeDeviceStateMonitor: Device SKBFXYVX173T is already ONLINE
12-12 15:05:18 I/NativeDeviceStateMonitor: Waiting 360000 ms for device SKBFXYVX173T boot complete
12-12 15:05:18 I/DeviceStateMonitor: Waiting 359896 ms for device SKBFXYVX173T package manager
12-12 15:05:19 I/NativeDeviceStateMonitor: Waiting 359747 ms for device SKBFXYVX173T external store
12-12 15:05:19 I/ConsoleReporter: [SKBFXYVX173T] Starting armeabi-v7a CtsAppTestCases[instant] with 1 test
12-12 15:05:19 I/ConsoleReporter: [1/1 armeabi-v7a CtsAppTestCases[instant] SKBFXYVX173T] android.app.cts.DownloadManagerTest#testDownloadManagerSupportsHttpsWithExternalWebServer fail: java.lang.InterruptedException: Timeout waiting for IDs [1]; received [].  Make sure you have WiFi or some other connectivity for this test.
	at android.app.cts.DownloadManagerTestBase$DownloadCompleteReceiver.waitForDownloadComplete(DownloadManagerTestBase.java:525)
	at android.app.cts.DownloadManagerTest.testDownloadManagerSupportsHttpsWithExternalWebServer(DownloadManagerTest.java:183)

12-12 15:05:19 I/ConsoleReporter: [SKBFXYVX173T] armeabi-v7a CtsAppTestCases[instant] completed in 3m 18s. 0 passed, 1 failed, 0 not executed
12-12 15:05:19 I/ITestSuite: Running system status checker after module execution: armeabi-v7a CtsAppTestCases[instant]
12-12 15:05:19 D/RunUtil: Running command [adb, -s, SKBFXYVX173T, shell, getprop, ro.build.version.sdk] with timeout: 45s
12-12 15:05:19 D/NativeDevice: Using property ro.build.version.sdk=31 from cache.
12-12 15:05:19 D/NativeDevice: Using property ro.build.version.sdk=31 from cache.
12-12 15:05:19 I/NativeDevice: "enable-root" set to false; ignoring 'adb root' request
12-12 15:05:19 I/NativeDeviceStateMonitor: Device SKBFXYVX173T is already ONLINE
12-12 15:05:19 I/NativeDeviceStateMonitor: Waiting 359999 ms for device SKBFXYVX173T boot complete
12-12 15:05:19 I/DeviceStateMonitor: Waiting 359963 ms for device SKBFXYVX173T package manager
12-12 15:05:19 I/NativeDeviceStateMonitor: Waiting 359895 ms for device SKBFXYVX173T external store
12-12 15:05:21 I/MonitoringUtils: Wifi Connectivity: passed check.
12-12 15:05:21 D/TestDevice: Output from KeyguardController:   KeyguardController:
    mKeyguardShowing=false
    mAodShowing=false
    mKeyguardGoingAway=false

12-12 15:05:21 E/LeakedThreadStatusChecker: We have 4 threads instead of 1. List: [Thread[Invocation-SKBFXYVX173T,5,Invocation-SKBFXYVX173T], Thread[BackgroundDeviceAction-logcat -b all -v threadtime,uid,5,Invocation-SKBFXYVX173T], Thread[Timer-1,5,Invocation-SKBFXYVX173T], Thread[grpc-default-worker-ELG-3-1,5,Invocation-SKBFXYVX173T]]
12-12 15:05:21 W/ITestSuite: System status checker [com.android.tradefed.suite.checker.LeakedThreadStatusChecker] failed
12-12 15:05:21 D/NativeDevice: Time offset = 1721 ms
12-12 15:05:21 D/DeviceSettingChecker: Begin postExecution for checking device setting
12-12 15:05:21 E/TestDevice: Unable to get setting from string:   "audiocaps": {
12-12 15:05:21 E/TestDevice: Unable to get setting from string:     "continuousAudio": false,
12-12 15:05:21 E/TestDevice: Unable to get setting from string:     "aaudio":true,
12-12 15:05:21 E/TestDevice: Unable to get setting from string:     "uiAudioBufferDelayOffset":60,
12-12 15:05:21 E/TestDevice: Unable to get setting from string:     "pcm": {
12-12 15:05:21 E/TestDevice: Unable to get setting from string:       "mixing": true,
12-12 15:05:21 E/TestDevice: Unable to get setting from string:       "transition": ease
12-12 15:05:21 E/TestDevice: Unable to get setting from string:     },
12-12 15:05:21 E/TestDevice: Unable to get setting from string:     "ddplus": {
12-12 15:05:21 E/TestDevice: Unable to get setting from string:       "mixing": false,
12-12 15:05:21 E/TestDevice: Unable to get setting from string:       "transition": mute
12-12 15:05:21 E/TestDevice: Unable to get setting from string:     },
12-12 15:05:21 E/TestDevice: Unable to get setting from string:     "atmos": {
12-12 15:05:21 E/TestDevice: Unable to get setting from string:       "enabled": true,
12-12 15:05:21 E/TestDevice: Unable to get setting from string:       "mixing": false,
12-12 15:05:21 E/TestDevice: Unable to get setting from string:       "transition": mute
12-12 15:05:21 E/TestDevice: Unable to get setting from string:     }
12-12 15:05:21 E/TestDevice: Unable to get setting from string:   }
12-12 15:05:21 E/TestDevice: Unable to get setting from string: }
12-12 15:05:21 E/TestDevice: Unable to get setting from string: 
12-12 15:05:21 E/TestDevice: Unable to get setting from string:   "vp9Disabled": "true",
12-12 15:05:21 E/TestDevice: Unable to get setting from string:   "hdrOutputType": "always",
12-12 15:05:21 E/TestDevice: Unable to get setting from string:   "minVideoFramesForPlaybackStart": "50"
12-12 15:05:21 E/TestDevice: Unable to get setting from string: }
12-12 15:05:21 E/TestDevice: Unable to get setting from string: 
12-12 15:05:21 W/DeviceSettingChecker: Setting in namespace global fails:
 cw_disable_wifimediator is not found before module run

12-12 15:05:21 W/ITestSuite: System status checker [com.android.tradefed.suite.checker.DeviceSettingChecker] failed
12-12 15:05:22 D/NativeDevice: Using property ro.build.version.sdk=31 from cache.
12-12 15:05:22 D/SystemServerFileDescriptorChecker: Skipping system_server fd check on user builds.
12-12 15:05:22 W/ITestSuite: There are failed system status checkers: {com.android.tradefed.suite.checker.LeakedThreadStatusChecker=We have 4 threads instead of 1. List: [Thread[Invocation-SKBFXYVX173T,5,Invocation-SKBFXYVX173T], Thread[BackgroundDeviceAction-logcat -b all -v threadtime,uid,5,Invocation-SKBFXYVX173T], Thread[Timer-1,5,Invocation-SKBFXYVX173T], Thread[grpc-default-worker-ELG-3-1,5,Invocation-SKBFXYVX173T]], com.android.tradefed.suite.checker.DeviceSettingChecker=Setting in namespace global fails:
 cw_disable_wifimediator is not found before module run
}
12-12 15:05:22 D/FileUtil: Creating temp file at /tmp/xts-root-dir-fa5dd1c2-3ba7-4cdd-9904-a00e7a84339f/android-cts/results/2025.12.12_15.00.56/proto with prefix "tmp-proto" suffix ""
12-12 15:05:22 D/BaseTestSuite: Filters for 'armeabi-v7a CtsAppTestCases': []
12-12 15:05:22 D/FileUtil: Creating temp file at /tmp/tf-workfolder16635743860164734351 with prefix "CtsAppTestCases" suffix ".xml"
12-12 15:05:22 D/LogFileSaver: Log data for module-configuration is already compressed, skipping compression
12-12 15:05:22 D/FileUtil: Creating temp file at /tmp/xts-root-dir-fa5dd1c2-3ba7-4cdd-9904-a00e7a84339f/android-cts/logs/2025.12.12_15.00.56/inv_18424983443859154131 with prefix "module-configuration_" suffix ".xml"
12-12 15:05:22 I/LogFileSaver: Saved log file /tmp/xts-root-dir-fa5dd1c2-3ba7-4cdd-9904-a00e7a84339f/android-cts/logs/2025.12.12_15.00.56/inv_18424983443859154131/module-configuration_12712493768460204690.xml. [size=3233, elapsed=0ms]
12-12 15:05:22 D/CertificationSuiteResultReporter: Saved logs for module-configuration in /tmp/xts-root-dir-fa5dd1c2-3ba7-4cdd-9904-a00e7a84339f/android-cts/logs/2025.12.12_15.00.56/inv_18424983443859154131/module-configuration_12712493768460204690.xml
12-12 15:05:22 D/LogFileSaver: Log data for module-configuration is already compressed, skipping compression
12-12 15:05:22 D/FileUtil: Creating temp file at /tmp/13441469/cts/inv_12648427467095576587/inv_2368518573660175600 with prefix "module-configuration_" suffix ".xml"
12-12 15:05:22 I/LogFileSaver: Saved log file /tmp/13441469/cts/inv_12648427467095576587/inv_2368518573660175600/module-configuration_3800448873663594800.xml (type:HARNESS_CONFIG). [size=3233, elapsed=1ms]
12-12 15:05:22 I/ITestSuite: Running system status checker before module execution: armeabi-v7a CtsAppTestCases
12-12 15:05:22 D/NativeDevice: Using property ro.build.version.sdk=31 from cache.
12-12 15:05:22 D/NativeDevice: Using property ro.build.version.sdk=31 from cache.
12-12 15:05:22 D/NativeDevice: Using property ro.build.version.sdk=31 from cache.
12-12 15:05:22 I/UserChecker: Current user 0 is already user type CURRENT, no action.
12-12 15:05:22 D/DeviceSettingChecker: Begin preExecutionCheck for checking device setting
12-12 15:05:22 E/TestDevice: Unable to get setting from string:   "audiocaps": {
12-12 15:05:22 E/TestDevice: Unable to get setting from string:     "continuousAudio": false,
12-12 15:05:22 E/TestDevice: Unable to get setting from string:     "aaudio":true,
12-12 15:05:22 E/TestDevice: Unable to get setting from string:     "uiAudioBufferDelayOffset":60,
12-12 15:05:22 E/TestDevice: Unable to get setting from string:     "pcm": {
12-12 15:05:22 E/TestDevice: Unable to get setting from string:       "mixing": true,
12-12 15:05:22 E/TestDevice: Unable to get setting from string:       "transition": ease
12-12 15:05:22 E/TestDevice: Unable to get setting from string:     },
12-12 15:05:22 E/TestDevice: Unable to get setting from string:     "ddplus": {
12-12 15:05:22 E/TestDevice: Unable to get setting from string:       "mixing": false,
12-12 15:05:22 E/TestDevice: Unable to get setting from string:       "transition": mute
12-12 15:05:22 E/TestDevice: Unable to get setting from string:     },
12-12 15:05:22 E/TestDevice: Unable to get setting from string:     "atmos": {
12-12 15:05:22 E/TestDevice: Unable to get setting from string:       "enabled": true,
12-12 15:05:22 E/TestDevice: Unable to get setting from string:       "mixing": false,
12-12 15:05:22 E/TestDevice: Unable to get setting from string:       "transition": mute
12-12 15:05:22 E/TestDevice: Unable to get setting from string:     }
12-12 15:05:22 E/TestDevice: Unable to get setting from string:   }
12-12 15:05:22 E/TestDevice: Unable to get setting from string: }
12-12 15:05:22 E/TestDevice: Unable to get setting from string: 
12-12 15:05:22 E/TestDevice: Unable to get setting from string:   "vp9Disabled": "true",
12-12 15:05:22 E/TestDevice: Unable to get setting from string:   "hdrOutputType": "always",
12-12 15:05:22 E/TestDevice: Unable to get setting from string:   "minVideoFramesForPlaybackStart": "50"
12-12 15:05:22 E/TestDevice: Unable to get setting from string: }
12-12 15:05:22 E/TestDevice: Unable to get setting from string: 
12-12 15:05:22 D/NativeDevice: Using property ro.build.version.sdk=31 from cache.
12-12 15:05:22 D/NativeDevice: Using property ro.build.version.sdk=31 from cache.
12-12 15:05:22 I/DeviceBaselineChecker: Enable device baselines  in 0 millis.
12-12 15:05:22 D/ModuleDefinition: Running module armeabi-v7a CtsAppTestCases
12-12 15:05:22 D/ModuleDefinition: Running setup preparer: LocationCheck
12-12 15:05:23 I/LocationCheck: Verifying location setting
12-12 15:05:23 D/ModuleDefinition: Running setup preparer: SuiteApkInstaller
12-12 15:05:23 D/RunUtil: Running command [adb, -s, SKBFXYVX173T, shell, getprop] with timeout: 45s
12-12 15:05:23 D/TestAppInstallSetup: Using abi armeabi-v7a from abi option.
12-12 15:05:23 D/NativeDevice: Using property ro.build.version.sdk=31 from cache.
12-12 15:05:23 D/NativeDevice: Using property ro.build.version.sdk=31 from cache.
12-12 15:05:23 D/NativeDevice: Using property ro.build.version.codename=REL from cache.
12-12 15:05:23 D/NativeDevice: Using property ro.build.version.sdk=31 from cache.
12-12 15:05:23 D/RunUtil: Running command [adb, -s, SKBFXYVX173T, shell, pm, list, features] with timeout: 2m 0s
12-12 15:05:23 D/NativeDevice: Using property ro.build.version.sdk=31 from cache.
12-12 15:05:23 D/NativeDevice: Using property ro.build.version.codename=REL from cache.
12-12 15:05:23 D/SearchArtifactUtil: Searching for file CtsSimpleApp.apk. Search directories: [/tmp/xts-root-dir-fa5dd1c2-3ba7-4cdd-9904-a00e7a84339f/android-cts/testcases, /tmp/xts-root-dir-fa5dd1c2-3ba7-4cdd-9904-a00e7a84339f/android-cts/testcases, /tmp/tf-workfolder16635743860164734351]
12-12 15:05:23 W/SearchArtifactUtil: we have a module name: CtsAppTestCases but no directory found in /tmp/xts-root-dir-fa5dd1c2-3ba7-4cdd-9904-a00e7a84339f/android-cts/testcases.
12-12 15:05:23 D/SearchArtifactUtil: Found file /tmp/xts-root-dir-fa5dd1c2-3ba7-4cdd-9904-a00e7a84339f/android-cts/testcases/CtsSimpleApp.apk in search directory /tmp/xts-root-dir-fa5dd1c2-3ba7-4cdd-9904-a00e7a84339f/android-cts/testcases.
12-12 15:05:23 D/RunUtil: Running command [aapt2, dump, badging, /tmp/xts-root-dir-fa5dd1c2-3ba7-4cdd-9904-a00e7a84339f/android-cts/testcases/CtsSimpleApp.apk] with timeout: 1m 0s
12-12 15:05:23 D/RunUtil: Running command [aapt2, dump, xmltree, /tmp/xts-root-dir-fa5dd1c2-3ba7-4cdd-9904-a00e7a84339f/android-cts/testcases/CtsSimpleApp.apk, --file, AndroidManifest.xml] with timeout: 1m 0s
12-12 15:05:23 D/TestAppInstallSetup: Installing apk com.android.cts.launcherapps.simpleapp with [/tmp/xts-root-dir-fa5dd1c2-3ba7-4cdd-9904-a00e7a84339f/android-cts/testcases/CtsSimpleApp.apk] ...
12-12 15:05:23 D/NativeDevice: Using property ro.build.version.sdk=31 from cache.
12-12 15:05:23 D/CtsSimpleApp.apk: Uploading CtsSimpleApp.apk onto device 'SKBFXYVX173T'
12-12 15:05:23 D/DeviceImpl: Uploading file onto device 'SKBFXYVX173T'
12-12 15:05:24 D/RunUtil: Running command [aapt, dump, badging, /tmp/xts-root-dir-fa5dd1c2-3ba7-4cdd-9904-a00e7a84339f/android-cts/testcases/CtsSimpleApp.apk] with timeout: 1m 0s
12-12 15:05:24 D/RunUtil: Running command [aapt, dump, xmltree, /tmp/xts-root-dir-fa5dd1c2-3ba7-4cdd-9904-a00e7a84339f/android-cts/testcases/CtsSimpleApp.apk, AndroidManifest.xml] with timeout: 1m 0s
12-12 15:05:24 D/RunUtil: Running command [adb, -s, SKBFXYVX173T, shell, appops, write-settings] with timeout: 2m 0s
12-12 15:05:24 D/SearchArtifactUtil: Searching for file CtsAppTestStubs.apk. Search directories: [/tmp/xts-root-dir-fa5dd1c2-3ba7-4cdd-9904-a00e7a84339f/android-cts/testcases, /tmp/xts-root-dir-fa5dd1c2-3ba7-4cdd-9904-a00e7a84339f/android-cts/testcases, /tmp/tf-workfolder16635743860164734351]
12-12 15:05:24 W/SearchArtifactUtil: we have a module name: CtsAppTestCases but no directory found in /tmp/xts-root-dir-fa5dd1c2-3ba7-4cdd-9904-a00e7a84339f/android-cts/testcases.
12-12 15:05:24 D/SearchArtifactUtil: Found file /tmp/xts-root-dir-fa5dd1c2-3ba7-4cdd-9904-a00e7a84339f/android-cts/testcases/CtsAppTestStubs.apk in search directory /tmp/xts-root-dir-fa5dd1c2-3ba7-4cdd-9904-a00e7a84339f/android-cts/testcases.
12-12 15:05:24 D/RunUtil: Running command [aapt2, dump, badging, /tmp/xts-root-dir-fa5dd1c2-3ba7-4cdd-9904-a00e7a84339f/android-cts/testcases/CtsAppTestStubs.apk] with timeout: 1m 0s
12-12 15:05:24 D/RunUtil: Running command [aapt2, dump, xmltree, /tmp/xts-root-dir-fa5dd1c2-3ba7-4cdd-9904-a00e7a84339f/android-cts/testcases/CtsAppTestStubs.apk, --file, AndroidManifest.xml] with timeout: 1m 0s
12-12 15:05:24 D/TestAppInstallSetup: Installing apk android.app.stubs with [/tmp/xts-root-dir-fa5dd1c2-3ba7-4cdd-9904-a00e7a84339f/android-cts/testcases/CtsAppTestStubs.apk] ...
12-12 15:05:24 D/NativeDevice: Using property ro.build.version.sdk=31 from cache.
12-12 15:05:24 D/CtsAppTestStubs.apk: Uploading CtsAppTestStubs.apk onto device 'SKBFXYVX173T'
12-12 15:05:24 D/DeviceImpl: Uploading file onto device 'SKBFXYVX173T'
12-12 15:05:26 D/RunUtil: Running command [aapt, dump, badging, /tmp/xts-root-dir-fa5dd1c2-3ba7-4cdd-9904-a00e7a84339f/android-cts/testcases/CtsAppTestStubs.apk] with timeout: 1m 0s
12-12 15:05:26 D/RunUtil: Running command [aapt, dump, xmltree, /tmp/xts-root-dir-fa5dd1c2-3ba7-4cdd-9904-a00e7a84339f/android-cts/testcases/CtsAppTestStubs.apk, AndroidManifest.xml] with timeout: 1m 0s
12-12 15:05:26 D/RunUtil: Running command [adb, -s, SKBFXYVX173T, shell, appops, write-settings] with timeout: 2m 0s
12-12 15:05:27 D/SearchArtifactUtil: Searching for file CtsAppTestStubsApp1.apk. Search directories: [/tmp/xts-root-dir-fa5dd1c2-3ba7-4cdd-9904-a00e7a84339f/android-cts/testcases, /tmp/xts-root-dir-fa5dd1c2-3ba7-4cdd-9904-a00e7a84339f/android-cts/testcases, /tmp/tf-workfolder16635743860164734351]
12-12 15:05:27 W/SearchArtifactUtil: we have a module name: CtsAppTestCases but no directory found in /tmp/xts-root-dir-fa5dd1c2-3ba7-4cdd-9904-a00e7a84339f/android-cts/testcases.
12-12 15:05:27 D/SearchArtifactUtil: Found file /tmp/xts-root-dir-fa5dd1c2-3ba7-4cdd-9904-a00e7a84339f/android-cts/testcases/CtsAppTestStubsApp1.apk in search directory /tmp/xts-root-dir-fa5dd1c2-3ba7-4cdd-9904-a00e7a84339f/android-cts/testcases.
12-12 15:05:27 D/RunUtil: Running command [aapt2, dump, badging, /tmp/xts-root-dir-fa5dd1c2-3ba7-4cdd-9904-a00e7a84339f/android-cts/testcases/CtsAppTestStubsApp1.apk] with timeout: 1m 0s
12-12 15:05:27 D/RunUtil: Running command [aapt2, dump, xmltree, /tmp/xts-root-dir-fa5dd1c2-3ba7-4cdd-9904-a00e7a84339f/android-cts/testcases/CtsAppTestStubsApp1.apk, --file, AndroidManifest.xml] with timeout: 1m 0s
12-12 15:05:27 D/TestAppInstallSetup: Installing apk com.android.app1 with [/tmp/xts-root-dir-fa5dd1c2-3ba7-4cdd-9904-a00e7a84339f/android-cts/testcases/CtsAppTestStubsApp1.apk] ...
12-12 15:05:27 D/NativeDevice: Using property ro.build.version.sdk=31 from cache.
12-12 15:05:27 D/CtsAppTestStubsApp1.apk: Uploading CtsAppTestStubsApp1.apk onto device 'SKBFXYVX173T'
12-12 15:05:27 D/DeviceImpl: Uploading file onto device 'SKBFXYVX173T'
12-12 15:05:29 D/RunUtil: Running command [aapt, dump, badging, /tmp/xts-root-dir-fa5dd1c2-3ba7-4cdd-9904-a00e7a84339f/android-cts/testcases/CtsAppTestStubsApp1.apk] with timeout: 1m 0s
12-12 15:05:29 D/RunUtil: Running command [aapt, dump, xmltree, /tmp/xts-root-dir-fa5dd1c2-3ba7-4cdd-9904-a00e7a84339f/android-cts/testcases/CtsAppTestStubsApp1.apk, AndroidManifest.xml] with timeout: 1m 0s
12-12 15:05:29 D/RunUtil: Running command [adb, -s, SKBFXYVX173T, shell, appops, write-settings] with timeout: 2m 0s
12-12 15:05:29 D/SearchArtifactUtil: Searching for file CtsAppTestStubsApp3.apk. Search directories: [/tmp/xts-root-dir-fa5dd1c2-3ba7-4cdd-9904-a00e7a84339f/android-cts/testcases, /tmp/xts-root-dir-fa5dd1c2-3ba7-4cdd-9904-a00e7a84339f/android-cts/testcases, /tmp/tf-workfolder16635743860164734351]
12-12 15:05:29 W/SearchArtifactUtil: we have a module name: CtsAppTestCases but no directory found in /tmp/xts-root-dir-fa5dd1c2-3ba7-4cdd-9904-a00e7a84339f/android-cts/testcases.
12-12 15:05:29 D/SearchArtifactUtil: Found file /tmp/xts-root-dir-fa5dd1c2-3ba7-4cdd-9904-a00e7a84339f/android-cts/testcases/CtsAppTestStubsApp3.apk in search directory /tmp/xts-root-dir-fa5dd1c2-3ba7-4cdd-9904-a00e7a84339f/android-cts/testcases.
12-12 15:05:29 D/RunUtil: Running command [aapt2, dump, badging, /tmp/xts-root-dir-fa5dd1c2-3ba7-4cdd-9904-a00e7a84339f/android-cts/testcases/CtsAppTestStubsApp3.apk] with timeout: 1m 0s
12-12 15:05:29 D/RunUtil: Running command [aapt2, dump, xmltree, /tmp/xts-root-dir-fa5dd1c2-3ba7-4cdd-9904-a00e7a84339f/android-cts/testcases/CtsAppTestStubsApp3.apk, --file, AndroidManifest.xml] with timeout: 1m 0s
12-12 15:05:29 D/TestAppInstallSetup: Installing apk com.android.app3 with [/tmp/xts-root-dir-fa5dd1c2-3ba7-4cdd-9904-a00e7a84339f/android-cts/testcases/CtsAppTestStubsApp3.apk] ...
12-12 15:05:29 D/NativeDevice: Using property ro.build.version.sdk=31 from cache.
12-12 15:05:29 D/CtsAppTestStubsApp3.apk: Uploading CtsAppTestStubsApp3.apk onto device 'SKBFXYVX173T'
12-12 15:05:29 D/DeviceImpl: Uploading file onto device 'SKBFXYVX173T'
12-12 15:05:31 D/RunUtil: Running command [aapt, dump, badging, /tmp/xts-root-dir-fa5dd1c2-3ba7-4cdd-9904-a00e7a84339f/android-cts/testcases/CtsAppTestStubsApp3.apk] with timeout: 1m 0s
12-12 15:05:31 D/RunUtil: Running command [aapt, dump, xmltree, /tmp/xts-root-dir-fa5dd1c2-3ba7-4cdd-9904-a00e7a84339f/android-cts/testcases/CtsAppTestStubsApp3.apk, AndroidManifest.xml] with timeout: 1m 0s
12-12 15:05:31 D/RunUtil: Running command [adb, -s, SKBFXYVX173T, shell, appops, write-settings] with timeout: 2m 0s
12-12 15:05:31 D/SearchArtifactUtil: Searching for file CtsAppTestStubsApp2.apk. Search directories: [/tmp/xts-root-dir-fa5dd1c2-3ba7-4cdd-9904-a00e7a84339f/android-cts/testcases, /tmp/xts-root-dir-fa5dd1c2-3ba7-4cdd-9904-a00e7a84339f/android-cts/testcases, /tmp/tf-workfolder16635743860164734351]
12-12 15:05:32 W/SearchArtifactUtil: we have a module name: CtsAppTestCases but no directory found in /tmp/xts-root-dir-fa5dd1c2-3ba7-4cdd-9904-a00e7a84339f/android-cts/testcases.
12-12 15:05:32 D/SearchArtifactUtil: Found file /tmp/xts-root-dir-fa5dd1c2-3ba7-4cdd-9904-a00e7a84339f/android-cts/testcases/CtsAppTestStubsApp2.apk in search directory /tmp/xts-root-dir-fa5dd1c2-3ba7-4cdd-9904-a00e7a84339f/android-cts/testcases.
12-12 15:05:32 D/RunUtil: Running command [aapt2, dump, badging, /tmp/xts-root-dir-fa5dd1c2-3ba7-4cdd-9904-a00e7a84339f/android-cts/testcases/CtsAppTestStubsApp2.apk] with timeout: 1m 0s
12-12 15:05:32 D/RunUtil: Running command [aapt2, dump, xmltree, /tmp/xts-root-dir-fa5dd1c2-3ba7-4cdd-9904-a00e7a84339f/android-cts/testcases/CtsAppTestStubsApp2.apk, --file, AndroidManifest.xml] with timeout: 1m 0s
12-12 15:05:32 D/TestAppInstallSetup: Installing apk com.android.app2 with [/tmp/xts-root-dir-fa5dd1c2-3ba7-4cdd-9904-a00e7a84339f/android-cts/testcases/CtsAppTestStubsApp2.apk] ...
12-12 15:05:32 D/NativeDevice: Using property ro.build.version.sdk=31 from cache.
12-12 15:05:32 D/CtsAppTestStubsApp2.apk: Uploading CtsAppTestStubsApp2.apk onto device 'SKBFXYVX173T'
12-12 15:05:32 D/DeviceImpl: Uploading file onto device 'SKBFXYVX173T'
12-12 15:05:34 D/RunUtil: Running command [aapt, dump, badging, /tmp/xts-root-dir-fa5dd1c2-3ba7-4cdd-9904-a00e7a84339f/android-cts/testcases/CtsAppTestStubsApp2.apk] with timeout: 1m 0s
12-12 15:05:34 D/RunUtil: Running command [aapt, dump, xmltree, /tmp/xts-root-dir-fa5dd1c2-3ba7-4cdd-9904-a00e7a84339f/android-cts/testcases/CtsAppTestStubsApp2.apk, AndroidManifest.xml] with timeout: 1m 0s
12-12 15:05:34 D/RunUtil: Running command [adb, -s, SKBFXYVX173T, shell, appops, write-settings] with timeout: 2m 0s
12-12 15:05:34 D/SearchArtifactUtil: Searching for file CtsAppTestStubsApi30.apk. Search directories: [/tmp/xts-root-dir-fa5dd1c2-3ba7-4cdd-9904-a00e7a84339f/android-cts/testcases, /tmp/xts-root-dir-fa5dd1c2-3ba7-4cdd-9904-a00e7a84339f/android-cts/testcases, /tmp/tf-workfolder16635743860164734351]
12-12 15:05:34 W/SearchArtifactUtil: we have a module name: CtsAppTestCases but no directory found in /tmp/xts-root-dir-fa5dd1c2-3ba7-4cdd-9904-a00e7a84339f/android-cts/testcases.
12-12 15:05:34 D/SearchArtifactUtil: Found file /tmp/xts-root-dir-fa5dd1c2-3ba7-4cdd-9904-a00e7a84339f/android-cts/testcases/CtsAppTestStubsApi30.apk in search directory /tmp/xts-root-dir-fa5dd1c2-3ba7-4cdd-9904-a00e7a84339f/android-cts/testcases.
12-12 15:05:34 D/RunUtil: Running command [aapt2, dump, badging, /tmp/xts-root-dir-fa5dd1c2-3ba7-4cdd-9904-a00e7a84339f/android-cts/testcases/CtsAppTestStubsApi30.apk] with timeout: 1m 0s
12-12 15:05:34 D/RunUtil: Running command [aapt2, dump, xmltree, /tmp/xts-root-dir-fa5dd1c2-3ba7-4cdd-9904-a00e7a84339f/android-cts/testcases/CtsAppTestStubsApi30.apk, --file, AndroidManifest.xml] with timeout: 1m 0s
12-12 15:05:34 D/TestAppInstallSetup: Installing apk com.android.app4 with [/tmp/xts-root-dir-fa5dd1c2-3ba7-4cdd-9904-a00e7a84339f/android-cts/testcases/CtsAppTestStubsApi30.apk] ...
12-12 15:05:34 D/NativeDevice: Using property ro.build.version.sdk=31 from cache.
12-12 15:05:34 D/CtsAppTestStubsApi30.apk: Uploading CtsAppTestStubsApi30.apk onto device 'SKBFXYVX173T'
12-12 15:05:34 D/DeviceImpl: Uploading file onto device 'SKBFXYVX173T'
12-12 15:05:35 D/RunUtil: Running command [aapt, dump, badging, /tmp/xts-root-dir-fa5dd1c2-3ba7-4cdd-9904-a00e7a84339f/android-cts/testcases/CtsAppTestStubsApi30.apk] with timeout: 1m 0s
12-12 15:05:35 D/RunUtil: Running command [aapt, dump, xmltree, /tmp/xts-root-dir-fa5dd1c2-3ba7-4cdd-9904-a00e7a84339f/android-cts/testcases/CtsAppTestStubsApi30.apk, AndroidManifest.xml] with timeout: 1m 0s
12-12 15:05:35 D/RunUtil: Running command [adb, -s, SKBFXYVX173T, shell, appops, write-settings] with timeout: 2m 0s
12-12 15:05:35 D/SearchArtifactUtil: Searching for file CtsAppTestCases.apk. Search directories: [/tmp/xts-root-dir-fa5dd1c2-3ba7-4cdd-9904-a00e7a84339f/android-cts/testcases, /tmp/xts-root-dir-fa5dd1c2-3ba7-4cdd-9904-a00e7a84339f/android-cts/testcases, /tmp/tf-workfolder16635743860164734351]
12-12 15:05:35 W/SearchArtifactUtil: we have a module name: CtsAppTestCases but no directory found in /tmp/xts-root-dir-fa5dd1c2-3ba7-4cdd-9904-a00e7a84339f/android-cts/testcases.
12-12 15:05:35 D/SearchArtifactUtil: Found file /tmp/xts-root-dir-fa5dd1c2-3ba7-4cdd-9904-a00e7a84339f/android-cts/testcases/CtsAppTestCases.apk in search directory /tmp/xts-root-dir-fa5dd1c2-3ba7-4cdd-9904-a00e7a84339f/android-cts/testcases.
12-12 15:05:35 D/RunUtil: Running command [aapt2, dump, badging, /tmp/xts-root-dir-fa5dd1c2-3ba7-4cdd-9904-a00e7a84339f/android-cts/testcases/CtsAppTestCases.apk] with timeout: 1m 0s
12-12 15:05:35 D/RunUtil: Running command [aapt2, dump, xmltree, /tmp/xts-root-dir-fa5dd1c2-3ba7-4cdd-9904-a00e7a84339f/android-cts/testcases/CtsAppTestCases.apk, --file, AndroidManifest.xml] with timeout: 1m 0s
12-12 15:05:35 D/TestAppInstallSetup: Installing apk android.app.cts with [/tmp/xts-root-dir-fa5dd1c2-3ba7-4cdd-9904-a00e7a84339f/android-cts/testcases/CtsAppTestCases.apk] ...
12-12 15:05:35 D/NativeDevice: Using property ro.build.version.sdk=31 from cache.
12-12 15:05:35 D/CtsAppTestCases.apk: Uploading CtsAppTestCases.apk onto device 'SKBFXYVX173T'
12-12 15:05:35 D/DeviceImpl: Uploading file onto device 'SKBFXYVX173T'
12-12 15:05:38 D/RunUtil: Running command [aapt, dump, badging, /tmp/xts-root-dir-fa5dd1c2-3ba7-4cdd-9904-a00e7a84339f/android-cts/testcases/CtsAppTestCases.apk] with timeout: 1m 0s
12-12 15:05:38 D/RunUtil: Running command [aapt, dump, xmltree, /tmp/xts-root-dir-fa5dd1c2-3ba7-4cdd-9904-a00e7a84339f/android-cts/testcases/CtsAppTestCases.apk, AndroidManifest.xml] with timeout: 1m 0s
12-12 15:05:38 D/RunUtil: Running command [adb, -s, SKBFXYVX173T, shell, appops, write-settings] with timeout: 2m 0s
12-12 15:05:38 D/SearchArtifactUtil: Searching for file CtsBadProviderStubs.apk. Search directories: [/tmp/xts-root-dir-fa5dd1c2-3ba7-4cdd-9904-a00e7a84339f/android-cts/testcases, /tmp/xts-root-dir-fa5dd1c2-3ba7-4cdd-9904-a00e7a84339f/android-cts/testcases, /tmp/tf-workfolder16635743860164734351]
12-12 15:05:38 W/SearchArtifactUtil: we have a module name: CtsAppTestCases but no directory found in /tmp/xts-root-dir-fa5dd1c2-3ba7-4cdd-9904-a00e7a84339f/android-cts/testcases.
12-12 15:05:38 D/SearchArtifactUtil: Found file /tmp/xts-root-dir-fa5dd1c2-3ba7-4cdd-9904-a00e7a84339f/android-cts/testcases/CtsBadProviderStubs.apk in search directory /tmp/xts-root-dir-fa5dd1c2-3ba7-4cdd-9904-a00e7a84339f/android-cts/testcases.
12-12 15:05:38 D/RunUtil: Running command [aapt2, dump, badging, /tmp/xts-root-dir-fa5dd1c2-3ba7-4cdd-9904-a00e7a84339f/android-cts/testcases/CtsBadProviderStubs.apk] with timeout: 1m 0s
12-12 15:05:38 D/RunUtil: Running command [aapt2, dump, xmltree, /tmp/xts-root-dir-fa5dd1c2-3ba7-4cdd-9904-a00e7a84339f/android-cts/testcases/CtsBadProviderStubs.apk, --file, AndroidManifest.xml] with timeout: 1m 0s
12-12 15:05:38 D/TestAppInstallSetup: Installing apk com.android.cts.stubbad with [/tmp/xts-root-dir-fa5dd1c2-3ba7-4cdd-9904-a00e7a84339f/android-cts/testcases/CtsBadProviderStubs.apk] ...
12-12 15:05:38 D/NativeDevice: Using property ro.build.version.sdk=31 from cache.
12-12 15:05:38 D/CtsBadProviderStubs.apk: Uploading CtsBadProviderStubs.apk onto device 'SKBFXYVX173T'
12-12 15:05:39 D/DeviceImpl: Uploading file onto device 'SKBFXYVX173T'
12-12 15:05:39 D/RunUtil: Running command [aapt, dump, badging, /tmp/xts-root-dir-fa5dd1c2-3ba7-4cdd-9904-a00e7a84339f/android-cts/testcases/CtsBadProviderStubs.apk] with timeout: 1m 0s
12-12 15:05:39 D/RunUtil: Running command [aapt, dump, xmltree, /tmp/xts-root-dir-fa5dd1c2-3ba7-4cdd-9904-a00e7a84339f/android-cts/testcases/CtsBadProviderStubs.apk, AndroidManifest.xml] with timeout: 1m 0s
12-12 15:05:39 D/RunUtil: Running command [adb, -s, SKBFXYVX173T, shell, appops, write-settings] with timeout: 2m 0s
12-12 15:05:39 D/SearchArtifactUtil: Searching for file CtsCantSaveState1.apk. Search directories: [/tmp/xts-root-dir-fa5dd1c2-3ba7-4cdd-9904-a00e7a84339f/android-cts/testcases, /tmp/xts-root-dir-fa5dd1c2-3ba7-4cdd-9904-a00e7a84339f/android-cts/testcases, /tmp/tf-workfolder16635743860164734351]
12-12 15:05:39 W/SearchArtifactUtil: we have a module name: CtsAppTestCases but no directory found in /tmp/xts-root-dir-fa5dd1c2-3ba7-4cdd-9904-a00e7a84339f/android-cts/testcases.
12-12 15:05:39 D/SearchArtifactUtil: Found file /tmp/xts-root-dir-fa5dd1c2-3ba7-4cdd-9904-a00e7a84339f/android-cts/testcases/CtsCantSaveState1.apk in search directory /tmp/xts-root-dir-fa5dd1c2-3ba7-4cdd-9904-a00e7a84339f/android-cts/testcases.
12-12 15:05:39 D/RunUtil: Running command [aapt2, dump, badging, /tmp/xts-root-dir-fa5dd1c2-3ba7-4cdd-9904-a00e7a84339f/android-cts/testcases/CtsCantSaveState1.apk] with timeout: 1m 0s
12-12 15:05:39 D/RunUtil: Running command [aapt2, dump, xmltree, /tmp/xts-root-dir-fa5dd1c2-3ba7-4cdd-9904-a00e7a84339f/android-cts/testcases/CtsCantSaveState1.apk, --file, AndroidManifest.xml] with timeout: 1m 0s
12-12 15:05:39 D/TestAppInstallSetup: Installing apk com.android.test.cantsavestate1 with [/tmp/xts-root-dir-fa5dd1c2-3ba7-4cdd-9904-a00e7a84339f/android-cts/testcases/CtsCantSaveState1.apk] ...
12-12 15:05:39 D/NativeDevice: Using property ro.build.version.sdk=31 from cache.
12-12 15:05:39 D/CtsCantSaveState1.apk: Uploading CtsCantSaveState1.apk onto device 'SKBFXYVX173T'
12-12 15:05:39 D/DeviceImpl: Uploading file onto device 'SKBFXYVX173T'
12-12 15:05:40 D/RunUtil: Running command [aapt, dump, badging, /tmp/xts-root-dir-fa5dd1c2-3ba7-4cdd-9904-a00e7a84339f/android-cts/testcases/CtsCantSaveState1.apk] with timeout: 1m 0s
12-12 15:05:40 D/RunUtil: Running command [aapt, dump, xmltree, /tmp/xts-root-dir-fa5dd1c2-3ba7-4cdd-9904-a00e7a84339f/android-cts/testcases/CtsCantSaveState1.apk, AndroidManifest.xml] with timeout: 1m 0s
12-12 15:05:40 D/RunUtil: Running command [adb, -s, SKBFXYVX173T, shell, appops, write-settings] with timeout: 2m 0s
12-12 15:05:40 D/SearchArtifactUtil: Searching for file CtsCantSaveState2.apk. Search directories: [/tmp/xts-root-dir-fa5dd1c2-3ba7-4cdd-9904-a00e7a84339f/android-cts/testcases, /tmp/xts-root-dir-fa5dd1c2-3ba7-4cdd-9904-a00e7a84339f/android-cts/testcases, /tmp/tf-workfolder16635743860164734351]
12-12 15:05:40 W/SearchArtifactUtil: we have a module name: CtsAppTestCases but no directory found in /tmp/xts-root-dir-fa5dd1c2-3ba7-4cdd-9904-a00e7a84339f/android-cts/testcases.
12-12 15:05:40 D/SearchArtifactUtil: Found file /tmp/xts-root-dir-fa5dd1c2-3ba7-4cdd-9904-a00e7a84339f/android-cts/testcases/CtsCantSaveState2.apk in search directory /tmp/xts-root-dir-fa5dd1c2-3ba7-4cdd-9904-a00e7a84339f/android-cts/testcases.
12-12 15:05:40 D/RunUtil: Running command [aapt2, dump, badging, /tmp/xts-root-dir-fa5dd1c2-3ba7-4cdd-9904-a00e7a84339f/android-cts/testcases/CtsCantSaveState2.apk] with timeout: 1m 0s
12-12 15:05:40 D/RunUtil: Running command [aapt2, dump, xmltree, /tmp/xts-root-dir-fa5dd1c2-3ba7-4cdd-9904-a00e7a84339f/android-cts/testcases/CtsCantSaveState2.apk, --file, AndroidManifest.xml] with timeout: 1m 0s
12-12 15:05:40 D/TestAppInstallSetup: Installing apk com.android.test.cantsavestate2 with [/tmp/xts-root-dir-fa5dd1c2-3ba7-4cdd-9904-a00e7a84339f/android-cts/testcases/CtsCantSaveState2.apk] ...
12-12 15:05:40 D/NativeDevice: Using property ro.build.version.sdk=31 from cache.
12-12 15:05:40 D/CtsCantSaveState2.apk: Uploading CtsCantSaveState2.apk onto device 'SKBFXYVX173T'
12-12 15:05:40 D/DeviceImpl: Uploading file onto device 'SKBFXYVX173T'
12-12 15:05:41 D/RunUtil: Running command [aapt, dump, badging, /tmp/xts-root-dir-fa5dd1c2-3ba7-4cdd-9904-a00e7a84339f/android-cts/testcases/CtsCantSaveState2.apk] with timeout: 1m 0s
12-12 15:05:41 D/RunUtil: Running command [aapt, dump, xmltree, /tmp/xts-root-dir-fa5dd1c2-3ba7-4cdd-9904-a00e7a84339f/android-cts/testcases/CtsCantSaveState2.apk, AndroidManifest.xml] with timeout: 1m 0s
12-12 15:05:41 D/RunUtil: Running command [adb, -s, SKBFXYVX173T, shell, appops, write-settings] with timeout: 2m 0s
12-12 15:05:41 D/SearchArtifactUtil: Searching for file NotificationDelegator.apk. Search directories: [/tmp/xts-root-dir-fa5dd1c2-3ba7-4cdd-9904-a00e7a84339f/android-cts/testcases, /tmp/xts-root-dir-fa5dd1c2-3ba7-4cdd-9904-a00e7a84339f/android-cts/testcases, /tmp/tf-workfolder16635743860164734351]
12-12 15:05:41 W/SearchArtifactUtil: we have a module name: CtsAppTestCases but no directory found in /tmp/xts-root-dir-fa5dd1c2-3ba7-4cdd-9904-a00e7a84339f/android-cts/testcases.
12-12 15:05:41 D/SearchArtifactUtil: Found file /tmp/xts-root-dir-fa5dd1c2-3ba7-4cdd-9904-a00e7a84339f/android-cts/testcases/NotificationDelegator.apk in search directory /tmp/xts-root-dir-fa5dd1c2-3ba7-4cdd-9904-a00e7a84339f/android-cts/testcases.
12-12 15:05:41 D/RunUtil: Running command [aapt2, dump, badging, /tmp/xts-root-dir-fa5dd1c2-3ba7-4cdd-9904-a00e7a84339f/android-cts/testcases/NotificationDelegator.apk] with timeout: 1m 0s
12-12 15:05:41 D/RunUtil: Running command [aapt2, dump, xmltree, /tmp/xts-root-dir-fa5dd1c2-3ba7-4cdd-9904-a00e7a84339f/android-cts/testcases/NotificationDelegator.apk, --file, AndroidManifest.xml] with timeout: 1m 0s
12-12 15:05:41 D/TestAppInstallSetup: Installing apk com.android.test.notificationdelegator with [/tmp/xts-root-dir-fa5dd1c2-3ba7-4cdd-9904-a00e7a84339f/android-cts/testcases/NotificationDelegator.apk] ...
12-12 15:05:41 D/NativeDevice: Using property ro.build.version.sdk=31 from cache.
12-12 15:05:41 D/NotificationDelegator.apk: Uploading NotificationDelegator.apk onto device 'SKBFXYVX173T'
12-12 15:05:41 D/DeviceImpl: Uploading file onto device 'SKBFXYVX173T'
12-12 15:05:42 D/RunUtil: Running command [aapt, dump, badging, /tmp/xts-root-dir-fa5dd1c2-3ba7-4cdd-9904-a00e7a84339f/android-cts/testcases/NotificationDelegator.apk] with timeout: 1m 0s
12-12 15:05:42 D/RunUtil: Running command [aapt, dump, xmltree, /tmp/xts-root-dir-fa5dd1c2-3ba7-4cdd-9904-a00e7a84339f/android-cts/testcases/NotificationDelegator.apk, AndroidManifest.xml] with timeout: 1m 0s
12-12 15:05:42 D/RunUtil: Running command [adb, -s, SKBFXYVX173T, shell, appops, write-settings] with timeout: 2m 0s
12-12 15:05:42 D/SearchArtifactUtil: Searching for file NotificationProvider.apk. Search directories: [/tmp/xts-root-dir-fa5dd1c2-3ba7-4cdd-9904-a00e7a84339f/android-cts/testcases, /tmp/xts-root-dir-fa5dd1c2-3ba7-4cdd-9904-a00e7a84339f/android-cts/testcases, /tmp/tf-workfolder16635743860164734351]
12-12 15:05:42 W/SearchArtifactUtil: we have a module name: CtsAppTestCases but no directory found in /tmp/xts-root-dir-fa5dd1c2-3ba7-4cdd-9904-a00e7a84339f/android-cts/testcases.
12-12 15:05:42 D/SearchArtifactUtil: Found file /tmp/xts-root-dir-fa5dd1c2-3ba7-4cdd-9904-a00e7a84339f/android-cts/testcases/NotificationProvider.apk in search directory /tmp/xts-root-dir-fa5dd1c2-3ba7-4cdd-9904-a00e7a84339f/android-cts/testcases.
12-12 15:05:42 D/RunUtil: Running command [aapt2, dump, badging, /tmp/xts-root-dir-fa5dd1c2-3ba7-4cdd-9904-a00e7a84339f/android-cts/testcases/NotificationProvider.apk] with timeout: 1m 0s
12-12 15:05:42 D/RunUtil: Running command [aapt2, dump, xmltree, /tmp/xts-root-dir-fa5dd1c2-3ba7-4cdd-9904-a00e7a84339f/android-cts/testcases/NotificationProvider.apk, --file, AndroidManifest.xml] with timeout: 1m 0s
12-12 15:05:42 D/TestAppInstallSetup: Installing apk com.android.test.notificationprovider with [/tmp/xts-root-dir-fa5dd1c2-3ba7-4cdd-9904-a00e7a84339f/android-cts/testcases/NotificationProvider.apk] ...
12-12 15:05:42 D/NativeDevice: Using property ro.build.version.sdk=31 from cache.
12-12 15:05:42 D/NotificationProvider.apk: Uploading NotificationProvider.apk onto device 'SKBFXYVX173T'
12-12 15:05:42 D/DeviceImpl: Uploading file onto device 'SKBFXYVX173T'
12-12 15:05:43 D/RunUtil: Running command [aapt, dump, badging, /tmp/xts-root-dir-fa5dd1c2-3ba7-4cdd-9904-a00e7a84339f/android-cts/testcases/NotificationProvider.apk] with timeout: 1m 0s
12-12 15:05:43 D/RunUtil: Running command [aapt, dump, xmltree, /tmp/xts-root-dir-fa5dd1c2-3ba7-4cdd-9904-a00e7a84339f/android-cts/testcases/NotificationProvider.apk, AndroidManifest.xml] with timeout: 1m 0s
12-12 15:05:43 D/RunUtil: Running command [adb, -s, SKBFXYVX173T, shell, appops, write-settings] with timeout: 2m 0s
12-12 15:05:43 D/SearchArtifactUtil: Searching for file NotificationListener.apk. Search directories: [/tmp/xts-root-dir-fa5dd1c2-3ba7-4cdd-9904-a00e7a84339f/android-cts/testcases, /tmp/xts-root-dir-fa5dd1c2-3ba7-4cdd-9904-a00e7a84339f/android-cts/testcases, /tmp/tf-workfolder16635743860164734351]
12-12 15:05:43 W/SearchArtifactUtil: we have a module name: CtsAppTestCases but no directory found in /tmp/xts-root-dir-fa5dd1c2-3ba7-4cdd-9904-a00e7a84339f/android-cts/testcases.
12-12 15:05:43 D/SearchArtifactUtil: Found file /tmp/xts-root-dir-fa5dd1c2-3ba7-4cdd-9904-a00e7a84339f/android-cts/testcases/NotificationListener.apk in search directory /tmp/xts-root-dir-fa5dd1c2-3ba7-4cdd-9904-a00e7a84339f/android-cts/testcases.
12-12 15:05:43 D/RunUtil: Running command [aapt2, dump, badging, /tmp/xts-root-dir-fa5dd1c2-3ba7-4cdd-9904-a00e7a84339f/android-cts/testcases/NotificationListener.apk] with timeout: 1m 0s
12-12 15:05:43 D/RunUtil: Running command [aapt2, dump, xmltree, /tmp/xts-root-dir-fa5dd1c2-3ba7-4cdd-9904-a00e7a84339f/android-cts/testcases/NotificationListener.apk, --file, AndroidManifest.xml] with timeout: 1m 0s
12-12 15:05:43 D/TestAppInstallSetup: Installing apk com.android.test.notificationlistener with [/tmp/xts-root-dir-fa5dd1c2-3ba7-4cdd-9904-a00e7a84339f/android-cts/testcases/NotificationListener.apk] ...
12-12 15:05:43 D/NativeDevice: Using property ro.build.version.sdk=31 from cache.
12-12 15:05:43 D/NotificationListener.apk: Uploading NotificationListener.apk onto device 'SKBFXYVX173T'
12-12 15:05:43 D/DeviceImpl: Uploading file onto device 'SKBFXYVX173T'
12-12 15:05:44 D/RunUtil: Running command [aapt, dump, badging, /tmp/xts-root-dir-fa5dd1c2-3ba7-4cdd-9904-a00e7a84339f/android-cts/testcases/NotificationListener.apk] with timeout: 1m 0s
12-12 15:05:44 D/RunUtil: Running command [aapt, dump, xmltree, /tmp/xts-root-dir-fa5dd1c2-3ba7-4cdd-9904-a00e7a84339f/android-cts/testcases/NotificationListener.apk, AndroidManifest.xml] with timeout: 1m 0s
12-12 15:05:44 D/RunUtil: Running command [adb, -s, SKBFXYVX173T, shell, appops, write-settings] with timeout: 2m 0s
12-12 15:05:44 D/SearchArtifactUtil: Searching for file StorageDelegator.apk. Search directories: [/tmp/xts-root-dir-fa5dd1c2-3ba7-4cdd-9904-a00e7a84339f/android-cts/testcases, /tmp/xts-root-dir-fa5dd1c2-3ba7-4cdd-9904-a00e7a84339f/android-cts/testcases, /tmp/tf-workfolder16635743860164734351]
12-12 15:05:44 W/SearchArtifactUtil: we have a module name: CtsAppTestCases but no directory found in /tmp/xts-root-dir-fa5dd1c2-3ba7-4cdd-9904-a00e7a84339f/android-cts/testcases.
12-12 15:05:44 D/SearchArtifactUtil: Found file /tmp/xts-root-dir-fa5dd1c2-3ba7-4cdd-9904-a00e7a84339f/android-cts/testcases/StorageDelegator.apk in search directory /tmp/xts-root-dir-fa5dd1c2-3ba7-4cdd-9904-a00e7a84339f/android-cts/testcases.
12-12 15:05:44 D/RunUtil: Running command [aapt2, dump, badging, /tmp/xts-root-dir-fa5dd1c2-3ba7-4cdd-9904-a00e7a84339f/android-cts/testcases/StorageDelegator.apk] with timeout: 1m 0s
12-12 15:05:44 D/RunUtil: Running command [aapt2, dump, xmltree, /tmp/xts-root-dir-fa5dd1c2-3ba7-4cdd-9904-a00e7a84339f/android-cts/testcases/StorageDelegator.apk, --file, AndroidManifest.xml] with timeout: 1m 0s
12-12 15:05:44 D/TestAppInstallSetup: Installing apk com.android.test.storagedelegator with [/tmp/xts-root-dir-fa5dd1c2-3ba7-4cdd-9904-a00e7a84339f/android-cts/testcases/StorageDelegator.apk] ...
12-12 15:05:44 D/NativeDevice: Using property ro.build.version.sdk=31 from cache.
12-12 15:05:44 D/StorageDelegator.apk: Uploading StorageDelegator.apk onto device 'SKBFXYVX173T'
12-12 15:05:44 D/DeviceImpl: Uploading file onto device 'SKBFXYVX173T'
12-12 15:05:45 D/RunUtil: Running command [aapt, dump, badging, /tmp/xts-root-dir-fa5dd1c2-3ba7-4cdd-9904-a00e7a84339f/android-cts/testcases/StorageDelegator.apk] with timeout: 1m 0s
12-12 15:05:45 D/RunUtil: Running command [aapt, dump, xmltree, /tmp/xts-root-dir-fa5dd1c2-3ba7-4cdd-9904-a00e7a84339f/android-cts/testcases/StorageDelegator.apk, AndroidManifest.xml] with timeout: 1m 0s
12-12 15:05:45 D/RunUtil: Running command [adb, -s, SKBFXYVX173T, shell, appops, write-settings] with timeout: 2m 0s
12-12 15:05:45 D/SearchArtifactUtil: Searching for file CtsActivityManagerApi29.apk. Search directories: [/tmp/xts-root-dir-fa5dd1c2-3ba7-4cdd-9904-a00e7a84339f/android-cts/testcases, /tmp/xts-root-dir-fa5dd1c2-3ba7-4cdd-9904-a00e7a84339f/android-cts/testcases, /tmp/tf-workfolder16635743860164734351]
12-12 15:05:45 W/SearchArtifactUtil: we have a module name: CtsAppTestCases but no directory found in /tmp/xts-root-dir-fa5dd1c2-3ba7-4cdd-9904-a00e7a84339f/android-cts/testcases.
12-12 15:05:45 D/SearchArtifactUtil: Found file /tmp/xts-root-dir-fa5dd1c2-3ba7-4cdd-9904-a00e7a84339f/android-cts/testcases/CtsActivityManagerApi29.apk in search directory /tmp/xts-root-dir-fa5dd1c2-3ba7-4cdd-9904-a00e7a84339f/android-cts/testcases.
12-12 15:05:45 D/RunUtil: Running command [aapt2, dump, badging, /tmp/xts-root-dir-fa5dd1c2-3ba7-4cdd-9904-a00e7a84339f/android-cts/testcases/CtsActivityManagerApi29.apk] with timeout: 1m 0s
12-12 15:05:45 D/RunUtil: Running command [aapt2, dump, xmltree, /tmp/xts-root-dir-fa5dd1c2-3ba7-4cdd-9904-a00e7a84339f/android-cts/testcases/CtsActivityManagerApi29.apk, --file, AndroidManifest.xml] with timeout: 1m 0s
12-12 15:05:45 D/TestAppInstallSetup: Installing apk android.app.cts.activitymanager.api29 with [/tmp/xts-root-dir-fa5dd1c2-3ba7-4cdd-9904-a00e7a84339f/android-cts/testcases/CtsActivityManagerApi29.apk] ...
12-12 15:05:45 D/NativeDevice: Using property ro.build.version.sdk=31 from cache.
12-12 15:05:45 D/CtsActivityManagerApi29.apk: Uploading CtsActivityManagerApi29.apk onto device 'SKBFXYVX173T'
12-12 15:05:45 D/DeviceImpl: Uploading file onto device 'SKBFXYVX173T'
12-12 15:05:45 D/RunUtil: Running command [aapt, dump, badging, /tmp/xts-root-dir-fa5dd1c2-3ba7-4cdd-9904-a00e7a84339f/android-cts/testcases/CtsActivityManagerApi29.apk] with timeout: 1m 0s
12-12 15:05:45 D/RunUtil: Running command [aapt, dump, xmltree, /tmp/xts-root-dir-fa5dd1c2-3ba7-4cdd-9904-a00e7a84339f/android-cts/testcases/CtsActivityManagerApi29.apk, AndroidManifest.xml] with timeout: 1m 0s
12-12 15:05:45 D/RunUtil: Running command [adb, -s, SKBFXYVX173T, shell, appops, write-settings] with timeout: 2m 0s
12-12 15:05:46 D/SearchArtifactUtil: Searching for file NotificationTrampoline.apk. Search directories: [/tmp/xts-root-dir-fa5dd1c2-3ba7-4cdd-9904-a00e7a84339f/android-cts/testcases, /tmp/xts-root-dir-fa5dd1c2-3ba7-4cdd-9904-a00e7a84339f/android-cts/testcases, /tmp/tf-workfolder16635743860164734351]
12-12 15:05:46 W/SearchArtifactUtil: we have a module name: CtsAppTestCases but no directory found in /tmp/xts-root-dir-fa5dd1c2-3ba7-4cdd-9904-a00e7a84339f/android-cts/testcases.
12-12 15:05:46 D/SearchArtifactUtil: Found file /tmp/xts-root-dir-fa5dd1c2-3ba7-4cdd-9904-a00e7a84339f/android-cts/testcases/NotificationTrampoline.apk in search directory /tmp/xts-root-dir-fa5dd1c2-3ba7-4cdd-9904-a00e7a84339f/android-cts/testcases.
12-12 15:05:46 D/RunUtil: Running command [aapt2, dump, badging, /tmp/xts-root-dir-fa5dd1c2-3ba7-4cdd-9904-a00e7a84339f/android-cts/testcases/NotificationTrampoline.apk] with timeout: 1m 0s
12-12 15:05:46 D/RunUtil: Running command [aapt2, dump, xmltree, /tmp/xts-root-dir-fa5dd1c2-3ba7-4cdd-9904-a00e7a84339f/android-cts/testcases/NotificationTrampoline.apk, --file, AndroidManifest.xml] with timeout: 1m 0s
12-12 15:05:46 D/TestAppInstallSetup: Installing apk com.android.test.notificationtrampoline.current with [/tmp/xts-root-dir-fa5dd1c2-3ba7-4cdd-9904-a00e7a84339f/android-cts/testcases/NotificationTrampoline.apk] ...
12-12 15:05:46 D/NativeDevice: Using property ro.build.version.sdk=31 from cache.
12-12 15:05:46 D/NotificationTrampoline.apk: Uploading NotificationTrampoline.apk onto device 'SKBFXYVX173T'
12-12 15:05:46 D/DeviceImpl: Uploading file onto device 'SKBFXYVX173T'
12-12 15:05:46 D/RunUtil: Running command [aapt, dump, badging, /tmp/xts-root-dir-fa5dd1c2-3ba7-4cdd-9904-a00e7a84339f/android-cts/testcases/NotificationTrampoline.apk] with timeout: 1m 0s
12-12 15:05:46 D/RunUtil: Running command [aapt, dump, xmltree, /tmp/xts-root-dir-fa5dd1c2-3ba7-4cdd-9904-a00e7a84339f/android-cts/testcases/NotificationTrampoline.apk, AndroidManifest.xml] with timeout: 1m 0s
12-12 15:05:46 D/RunUtil: Running command [adb, -s, SKBFXYVX173T, shell, appops, write-settings] with timeout: 2m 0s
12-12 15:05:47 D/SearchArtifactUtil: Searching for file NotificationTrampolineApi30.apk. Search directories: [/tmp/xts-root-dir-fa5dd1c2-3ba7-4cdd-9904-a00e7a84339f/android-cts/testcases, /tmp/xts-root-dir-fa5dd1c2-3ba7-4cdd-9904-a00e7a84339f/android-cts/testcases, /tmp/tf-workfolder16635743860164734351]
12-12 15:05:47 W/SearchArtifactUtil: we have a module name: CtsAppTestCases but no directory found in /tmp/xts-root-dir-fa5dd1c2-3ba7-4cdd-9904-a00e7a84339f/android-cts/testcases.
12-12 15:05:47 D/SearchArtifactUtil: Found file /tmp/xts-root-dir-fa5dd1c2-3ba7-4cdd-9904-a00e7a84339f/android-cts/testcases/NotificationTrampolineApi30.apk in search directory /tmp/xts-root-dir-fa5dd1c2-3ba7-4cdd-9904-a00e7a84339f/android-cts/testcases.
12-12 15:05:47 D/RunUtil: Running command [aapt2, dump, badging, /tmp/xts-root-dir-fa5dd1c2-3ba7-4cdd-9904-a00e7a84339f/android-cts/testcases/NotificationTrampolineApi30.apk] with timeout: 1m 0s
12-12 15:05:47 D/RunUtil: Running command [aapt2, dump, xmltree, /tmp/xts-root-dir-fa5dd1c2-3ba7-4cdd-9904-a00e7a84339f/android-cts/testcases/NotificationTrampolineApi30.apk, --file, AndroidManifest.xml] with timeout: 1m 0s
12-12 15:05:47 D/TestAppInstallSetup: Installing apk com.android.test.notificationtrampoline.api30 with [/tmp/xts-root-dir-fa5dd1c2-3ba7-4cdd-9904-a00e7a84339f/android-cts/testcases/NotificationTrampolineApi30.apk] ...
12-12 15:05:47 D/NativeDevice: Using property ro.build.version.sdk=31 from cache.
12-12 15:05:47 D/NotificationTrampolineApi30.apk: Uploading NotificationTrampolineApi30.apk onto device 'SKBFXYVX173T'
12-12 15:05:47 D/DeviceImpl: Uploading file onto device 'SKBFXYVX173T'
12-12 15:05:47 D/RunUtil: Running command [aapt, dump, badging, /tmp/xts-root-dir-fa5dd1c2-3ba7-4cdd-9904-a00e7a84339f/android-cts/testcases/NotificationTrampolineApi30.apk] with timeout: 1m 0s
12-12 15:05:47 D/RunUtil: Running command [aapt, dump, xmltree, /tmp/xts-root-dir-fa5dd1c2-3ba7-4cdd-9904-a00e7a84339f/android-cts/testcases/NotificationTrampolineApi30.apk, AndroidManifest.xml] with timeout: 1m 0s
12-12 15:05:47 D/RunUtil: Running command [adb, -s, SKBFXYVX173T, shell, appops, write-settings] with timeout: 2m 0s
12-12 15:05:48 D/ModuleDefinition: Running setup preparer: RunCommandTargetPreparer
12-12 15:05:48 D/RunUtil: Running command [adb, -s, SKBFXYVX173T, shell, input, keyevent, KEYCODE_WAKEUP] with timeout: 2m 0s
12-12 15:05:48 D/RunUtil: Running command [adb, -s, SKBFXYVX173T, shell, wm, dismiss-keyguard] with timeout: 2m 0s
12-12 15:05:48 D/RunUtil: Running command [adb, -s, SKBFXYVX173T, shell, settings, put, global, cw_disable_wifimediator, 1] with timeout: 2m 0s
12-12 15:05:48 D/NativeDevice: Using property ro.build.version.sdk=31 from cache.
12-12 15:05:48 D/NativeDevice: Using property ro.build.version.codename=REL from cache.
12-12 15:05:48 D/NativeDevice: Using property ro.build.version.sdk=31 from cache.
12-12 15:05:48 D/NativeDevice: Using property ro.build.version.codename=REL from cache.
12-12 15:05:48 D/AndroidJUnitTest: Disabled test storage as it's not supported on that branch.
12-12 15:05:48 D/AndroidJUnitTest: Attempting to push filters to /data/local/tmp/ajur/includes.txt
12-12 15:05:48 D/NativeDevice: Using 'ls' to check doesFileExist(/data/local/tmp/ajur)
12-12 15:05:48 D/RunUtil: Running command [adb, -s, SKBFXYVX173T, shell, ls, '/data/local/tmp/ajur'] with timeout: 2m 0s
12-12 15:05:48 D/NativeDevice: File /data/local/tmp/ajur does not exist.
stdout: 
stderr: ls: /data/local/tmp/ajur: No such file or directory

12-12 15:05:48 D/NativeDevice: Using 'ls' to check doesFileExist(/data/local/tmp/ajur/includes.txt)
12-12 15:05:48 D/RunUtil: Running command [adb, -s, SKBFXYVX173T, shell, ls, '/data/local/tmp/ajur/includes.txt'] with timeout: 2m 0s
12-12 15:05:48 D/FileUtil: Creating temp file at /tmp/xts-root-dir-fa5dd1c2-3ba7-4cdd-9904-a00e7a84339f/android-cts/logs/2025.12.12_15.00.56/inv_18424983443859154131 with prefix "filter-armeabi-v7a%20CtsAppTestCases6352708413357715113.include_" suffix ".txt.gz"
12-12 15:05:48 I/LogFileSaver: Saved gzip log file /tmp/xts-root-dir-fa5dd1c2-3ba7-4cdd-9904-a00e7a84339f/android-cts/logs/2025.12.12_15.00.56/inv_18424983443859154131/filter-armeabi-v7a%20CtsAppTestCases6352708413357715113.include_1540238922583744623.txt.gz. [size=10, elapsed=1ms]
12-12 15:05:48 D/CertificationSuiteResultReporter: Saved logs for filter-armeabi-v7a%20CtsAppTestCases6352708413357715113.include in /tmp/xts-root-dir-fa5dd1c2-3ba7-4cdd-9904-a00e7a84339f/android-cts/logs/2025.12.12_15.00.56/inv_18424983443859154131/filter-armeabi-v7a%20CtsAppTestCases6352708413357715113.include_1540238922583744623.txt.gz
12-12 15:05:48 D/FileUtil: Creating temp file at /tmp/13441469/cts/inv_12648427467095576587/inv_2368518573660175600 with prefix "filter-armeabi-v7a%20CtsAppTestCases6352708413357715113.include_" suffix ".txt.gz"
12-12 15:05:48 I/LogFileSaver: Saved gzip log file /tmp/13441469/cts/inv_12648427467095576587/inv_2368518573660175600/filter-armeabi-v7a%20CtsAppTestCases6352708413357715113.include_17725287682977448724.txt.gz. [size=10, elapsed=1ms]
12-12 15:05:48 D/NativeDevice: Using property ro.build.version.sdk=31 from cache.
12-12 15:05:48 D/NativeDevice: Using property ro.build.version.sdk=31 from cache.
12-12 15:05:48 D/NativeDevice: Using property ro.build.version.codename=REL from cache.
12-12 15:05:48 D/NativeDevice: Using property ro.build.version.sdk=31 from cache.
12-12 15:05:48 D/InstrumentationTest: Collecting test info for android.app.cts on device SKBFXYVX173T
12-12 15:05:48 I/RemoteAndroidTestRunner: Running am instrument -w -r --no-hidden-api-checks --abi armeabi-v7a  -e testFile /data/local/tmp/ajur/includes.txt -e debug false -e newRunListenerMode true -e log true -e notAnnotation com.android.compatibility.common.util.CtsDownstreamingTest,android.platform.test.annotations.AsbSecurityTest,android.platform.test.annotations.AppModeInstant -e timeout_msec 300000 android.app.cts/androidx.test.runner.AndroidJUnitRunner on foxconn-bfx_at100-SKBFXYVX173T
12-12 15:05:50 D/InstrumentationTest: Initializing com.android.tradefed.device.metric.CountTestCasesCollector for instrumentation.
12-12 15:05:50 I/RemoteAndroidTestRunner: Running am instrument -w -r --no-hidden-api-checks --abi armeabi-v7a  -e testFile /data/local/tmp/ajur/includes.txt -e debug false -e newRunListenerMode true -e log false -e notAnnotation com.android.compatibility.common.util.CtsDownstreamingTest,android.platform.test.annotations.AsbSecurityTest,android.platform.test.annotations.AppModeInstant -e timeout_msec 300000 android.app.cts/androidx.test.runner.AndroidJUnitRunner on foxconn-bfx_at100-SKBFXYVX173T
12-12 15:05:51 D/ModuleListener: ModuleListener.testRunStarted(android.app.cts, 1, 0) on SKBFXYVX173T
12-12 15:05:51 D/ModuleListener: ModuleListener.testStarted(android.app.cts.DownloadManagerTest#testDownloadManagerSupportsHttpsWithExternalWebServer) on SKBFXYVX173T
12-12 15:08:51 I/ModuleListener: [1/1] SKBFXYVX173T android.app.cts.DownloadManagerTest#testDownloadManagerSupportsHttpsWithExternalWebServer FAILURE: java.lang.InterruptedException: Timeout waiting for IDs [2]; received [].  Make sure you have WiFi or some other connectivity for this test.
	at android.app.cts.DownloadManagerTestBase$DownloadCompleteReceiver.waitForDownloadComplete(DownloadManagerTestBase.java:525)
	at android.app.cts.DownloadManagerTest.testDownloadManagerSupportsHttpsWithExternalWebServer(DownloadManagerTest.java:183)

12-12 15:08:52 D/ModuleListener: ModuleListener.testRunEnded(181591) on SKBFXYVX173T
12-12 15:08:52 D/RunUtil: Running command [adb, -s, SKBFXYVX173T, shell, settings, put, global, cw_disable_wifimediator, 0] with timeout: 2m 0s
12-12 15:08:53 D/TestDevice: Uninstalling com.android.test.notificationtrampoline.api30 with extra args 
12-12 15:08:53 D/TestDevice: Uninstalling android.app.cts with extra args 
12-12 15:08:54 D/TestDevice: Uninstalling com.android.test.storagedelegator with extra args 
12-12 15:08:55 D/TestDevice: Uninstalling com.android.test.notificationtrampoline.current with extra args 
12-12 15:08:56 D/TestDevice: Uninstalling com.android.app4 with extra args 
12-12 15:08:56 D/TestDevice: Uninstalling com.android.app3 with extra args 
12-12 15:08:57 D/TestDevice: Uninstalling com.android.test.cantsavestate1 with extra args 
12-12 15:08:58 D/TestDevice: Uninstalling com.android.test.notificationdelegator with extra args 
12-12 15:08:59 D/TestDevice: Uninstalling com.android.app2 with extra args 
12-12 15:08:59 D/TestDevice: Uninstalling com.android.test.cantsavestate2 with extra args 
12-12 15:09:00 D/TestDevice: Uninstalling com.android.app1 with extra args 
12-12 15:09:01 D/TestDevice: Uninstalling com.android.cts.stubbad with extra args 
12-12 15:09:02 D/TestDevice: Uninstalling com.android.test.notificationprovider with extra args 
12-12 15:09:03 D/TestDevice: Uninstalling android.app.stubs with extra args 
12-12 15:09:03 D/TestDevice: Uninstalling android.app.cts.activitymanager.api29 with extra args 
12-12 15:09:04 D/TestDevice: Uninstalling com.android.cts.launcherapps.simpleapp with extra args 
12-12 15:09:05 D/TestDevice: Uninstalling com.android.test.notificationlistener with extra args 
12-12 15:09:06 I/NativeDeviceStateMonitor: Device SKBFXYVX173T is already ONLINE
12-12 15:09:06 I/NativeDeviceStateMonitor: Waiting 360000 ms for device SKBFXYVX173T boot complete
12-12 15:09:06 I/DeviceStateMonitor: Waiting 359927 ms for device SKBFXYVX173T package manager
12-12 15:09:06 I/NativeDeviceStateMonitor: Waiting 359731 ms for device SKBFXYVX173T external store
12-12 15:09:06 I/ConsoleReporter: [SKBFXYVX173T] Starting armeabi-v7a CtsAppTestCases with 1 test
12-12 15:09:06 I/ConsoleReporter: [1/1 armeabi-v7a CtsAppTestCases SKBFXYVX173T] android.app.cts.DownloadManagerTest#testDownloadManagerSupportsHttpsWithExternalWebServer fail: java.lang.InterruptedException: Timeout waiting for IDs [2]; received [].  Make sure you have WiFi or some other connectivity for this test.
	at android.app.cts.DownloadManagerTestBase$DownloadCompleteReceiver.waitForDownloadComplete(DownloadManagerTestBase.java:525)
	at android.app.cts.DownloadManagerTest.testDownloadManagerSupportsHttpsWithExternalWebServer(DownloadManagerTest.java:183)

12-12 15:09:06 I/ConsoleReporter: [SKBFXYVX173T] armeabi-v7a CtsAppTestCases completed in 3m 18s. 0 passed, 1 failed, 0 not executed
12-12 15:09:06 I/ITestSuite: Running system status checker after module execution: armeabi-v7a CtsAppTestCases
12-12 15:09:06 D/RunUtil: Running command [adb, -s, SKBFXYVX173T, shell, getprop, ro.build.version.sdk] with timeout: 45s
12-12 15:09:07 D/NativeDevice: Using property ro.build.version.sdk=31 from cache.
12-12 15:09:07 D/NativeDevice: Using property ro.build.version.sdk=31 from cache.
12-12 15:09:07 I/NativeDevice: "enable-root" set to false; ignoring 'adb root' request
12-12 15:09:07 I/NativeDeviceStateMonitor: Device SKBFXYVX173T is already ONLINE
12-12 15:09:07 I/NativeDeviceStateMonitor: Waiting 360000 ms for device SKBFXYVX173T boot complete
12-12 15:09:07 I/DeviceStateMonitor: Waiting 359963 ms for device SKBFXYVX173T package manager
12-12 15:09:07 I/NativeDeviceStateMonitor: Waiting 359896 ms for device SKBFXYVX173T external store
12-12 15:09:09 I/MonitoringUtils: Wifi Connectivity: passed check.
12-12 15:09:09 D/TestDevice: Output from KeyguardController:   KeyguardController:
    mKeyguardShowing=false
    mAodShowing=false
    mKeyguardGoingAway=false

12-12 15:09:09 E/LeakedThreadStatusChecker: We have 4 threads instead of 1. List: [Thread[Invocation-SKBFXYVX173T,5,Invocation-SKBFXYVX173T], Thread[BackgroundDeviceAction-logcat -b all -v threadtime,uid,5,Invocation-SKBFXYVX173T], Thread[Timer-1,5,Invocation-SKBFXYVX173T], Thread[grpc-default-worker-ELG-3-1,5,Invocation-SKBFXYVX173T]]
12-12 15:09:09 W/ITestSuite: System status checker [com.android.tradefed.suite.checker.LeakedThreadStatusChecker] failed
12-12 15:09:09 D/NativeDevice: Time offset = 1326 ms
12-12 15:09:09 D/DeviceSettingChecker: Begin postExecution for checking device setting
12-12 15:09:09 E/TestDevice: Unable to get setting from string:   "audiocaps": {
12-12 15:09:09 E/TestDevice: Unable to get setting from string:     "continuousAudio": false,
12-12 15:09:09 E/TestDevice: Unable to get setting from string:     "aaudio":true,
12-12 15:09:09 E/TestDevice: Unable to get setting from string:     "uiAudioBufferDelayOffset":60,
12-12 15:09:09 E/TestDevice: Unable to get setting from string:     "pcm": {
12-12 15:09:09 E/TestDevice: Unable to get setting from string:       "mixing": true,
12-12 15:09:09 E/TestDevice: Unable to get setting from string:       "transition": ease
12-12 15:09:09 E/TestDevice: Unable to get setting from string:     },
12-12 15:09:09 E/TestDevice: Unable to get setting from string:     "ddplus": {
12-12 15:09:09 E/TestDevice: Unable to get setting from string:       "mixing": false,
12-12 15:09:09 E/TestDevice: Unable to get setting from string:       "transition": mute
12-12 15:09:09 E/TestDevice: Unable to get setting from string:     },
12-12 15:09:09 E/TestDevice: Unable to get setting from string:     "atmos": {
12-12 15:09:09 E/TestDevice: Unable to get setting from string:       "enabled": true,
12-12 15:09:09 E/TestDevice: Unable to get setting from string:       "mixing": false,
12-12 15:09:09 E/TestDevice: Unable to get setting from string:       "transition": mute
12-12 15:09:09 E/TestDevice: Unable to get setting from string:     }
12-12 15:09:09 E/TestDevice: Unable to get setting from string:   }
12-12 15:09:09 E/TestDevice: Unable to get setting from string: }
12-12 15:09:09 E/TestDevice: Unable to get setting from string: 
12-12 15:09:09 E/TestDevice: Unable to get setting from string:   "vp9Disabled": "true",
12-12 15:09:09 E/TestDevice: Unable to get setting from string:   "hdrOutputType": "always",
12-12 15:09:09 E/TestDevice: Unable to get setting from string:   "minVideoFramesForPlaybackStart": "50"
12-12 15:09:09 E/TestDevice: Unable to get setting from string: }
12-12 15:09:09 E/TestDevice: Unable to get setting from string: 
12-12 15:09:09 D/NativeDevice: Using property ro.build.version.sdk=31 from cache.
12-12 15:09:09 D/SystemServerFileDescriptorChecker: Skipping system_server fd check on user builds.
12-12 15:09:09 W/ITestSuite: There are failed system status checkers: {com.android.tradefed.suite.checker.LeakedThreadStatusChecker=We have 4 threads instead of 1. List: [Thread[Invocation-SKBFXYVX173T,5,Invocation-SKBFXYVX173T], Thread[BackgroundDeviceAction-logcat -b all -v threadtime,uid,5,Invocation-SKBFXYVX173T], Thread[Timer-1,5,Invocation-SKBFXYVX173T], Thread[grpc-default-worker-ELG-3-1,5,Invocation-SKBFXYVX173T]]}
12-12 15:09:09 D/FileUtil: Creating temp file at /tmp/xts-root-dir-fa5dd1c2-3ba7-4cdd-9904-a00e7a84339f/android-cts/results/2025.12.12_15.00.56/proto with prefix "tmp-proto" suffix ""
12-12 15:09:09 D/PrettyPrintDelimiter: 
=============================
===== TEST PHASE ENDING =====
=============================
12-12 15:09:10 D/LogFileSaver: Log data for device_logcat_test_SKBFXYVX173T is already compressed, skipping compression
12-12 15:09:10 D/FileUtil: Creating temp file at /tmp/xts-root-dir-fa5dd1c2-3ba7-4cdd-9904-a00e7a84339f/android-cts/logs/2025.12.12_15.00.56/inv_18424983443859154131 with prefix "device_logcat_test_SKBFXYVX173T_" suffix ".txt"
12-12 15:09:10 I/LogFileSaver: Saved log file /tmp/xts-root-dir-fa5dd1c2-3ba7-4cdd-9904-a00e7a84339f/android-cts/logs/2025.12.12_15.00.56/inv_18424983443859154131/device_logcat_test_SKBFXYVX173T_711971204612712340.txt. [size=3682480, elapsed=13ms]
12-12 15:09:10 D/CertificationSuiteResultReporter: Saved logs for device_logcat_test_SKBFXYVX173T in /tmp/xts-root-dir-fa5dd1c2-3ba7-4cdd-9904-a00e7a84339f/android-cts/logs/2025.12.12_15.00.56/inv_18424983443859154131/device_logcat_test_SKBFXYVX173T_711971204612712340.txt
12-12 15:09:10 D/LogFileSaver: Log data for device_logcat_test_SKBFXYVX173T is already compressed, skipping compression
12-12 15:09:10 D/FileUtil: Creating temp file at /tmp/13441469/cts/inv_12648427467095576587/inv_2368518573660175600 with prefix "device_logcat_test_SKBFXYVX173T_" suffix ".txt"
12-12 15:09:10 I/LogFileSaver: Saved log file /tmp/13441469/cts/inv_12648427467095576587/inv_2368518573660175600/device_logcat_test_SKBFXYVX173T_12560529884969465227.txt. [size=3682480, elapsed=13ms]
12-12 15:09:10 I/CommandInterrupter: Interrupt blocked
12-12 15:09:10 D/TestInvocation: Testing minimum responsiveness.
12-12 15:09:10 I/NativeDeviceStateMonitor: Device SKBFXYVX173T is already ONLINE
12-12 15:09:10 D/RunUtil: Running command [adb, -s, SKBFXYVX173T, shell, getprop, ro.build.version.sdk] with timeout: 45s
12-12 15:09:10 D/FileUtil: Creating temp file at /tmp/xts-root-dir-fa5dd1c2-3ba7-4cdd-9904-a00e7a84339f/android-cts/logs/2025.12.12_15.00.56/inv_18424983443859154131 with prefix "executeShellCommandLog_SKBFXYVX173T_" suffix ".txt.gz"
12-12 15:09:10 I/LogFileSaver: Saved gzip log file /tmp/xts-root-dir-fa5dd1c2-3ba7-4cdd-9904-a00e7a84339f/android-cts/logs/2025.12.12_15.00.56/inv_18424983443859154131/executeShellCommandLog_SKBFXYVX173T_15418021530993999601.txt.gz. [size=10, elapsed=3ms]
12-12 15:09:10 D/CertificationSuiteResultReporter: Saved logs for executeShellCommandLog_SKBFXYVX173T in /tmp/xts-root-dir-fa5dd1c2-3ba7-4cdd-9904-a00e7a84339f/android-cts/logs/2025.12.12_15.00.56/inv_18424983443859154131/executeShellCommandLog_SKBFXYVX173T_15418021530993999601.txt.gz
12-12 15:09:10 D/FileUtil: Creating temp file at /tmp/13441469/cts/inv_12648427467095576587/inv_2368518573660175600 with prefix "executeShellCommandLog_SKBFXYVX173T_" suffix ".txt.gz"
12-12 15:09:10 I/LogFileSaver: Saved gzip log file /tmp/13441469/cts/inv_12648427467095576587/inv_2368518573660175600/executeShellCommandLog_SKBFXYVX173T_438611846106465460.txt.gz. [size=10, elapsed=2ms]
12-12 15:09:10 D/TestInvocation: Checking that devices are online.
12-12 15:09:10 I/NativeDeviceStateMonitor: Device SKBFXYVX173T is already ONLINE
12-12 15:09:10 I/NativeDeviceStateMonitor: Waiting 180000 ms for device SKBFXYVX173T boot complete
12-12 15:09:10 I/DeviceStateMonitor: Waiting 179964 ms for device SKBFXYVX173T package manager
12-12 15:09:10 I/NativeDeviceStateMonitor: Waiting 179896 ms for device SKBFXYVX173T external store
12-12 15:09:10 D/InvocationExecution: starting tearDown 'com.android.compatibility.common.tradefed.targetprep.PropertyCheck@5ffed07c' on device: 'SKBFXYVX173T'
12-12 15:09:10 D/InvocationExecution: done with tearDown 'com.android.compatibility.common.tradefed.targetprep.PropertyCheck@5ffed07c' on device: 'SKBFXYVX173T' in 0 ms
12-12 15:09:10 D/InvocationExecution: starting tearDown 'com.android.compatibility.common.tradefed.targetprep.PropertyCheck@6147ab77' on device: 'SKBFXYVX173T'
12-12 15:09:10 D/InvocationExecution: done with tearDown 'com.android.compatibility.common.tradefed.targetprep.PropertyCheck@6147ab77' on device: 'SKBFXYVX173T' in 0 ms
12-12 15:09:10 D/InvocationExecution: starting tearDown 'com.android.compatibility.common.tradefed.targetprep.PropertyCheck@4947ef2b' on device: 'SKBFXYVX173T'
12-12 15:09:10 D/InvocationExecution: done with tearDown 'com.android.compatibility.common.tradefed.targetprep.PropertyCheck@4947ef2b' on device: 'SKBFXYVX173T' in 0 ms
12-12 15:09:10 D/InvocationExecution: starting tearDown 'com.android.tradefed.targetprep.RunCommandTargetPreparer@23296cb9' on device: 'SKBFXYVX173T'
12-12 15:09:10 D/RunUtil: Running command [adb, -s, SKBFXYVX173T, shell, settings, put, global, verifier_engprod, 0] with timeout: 2m 0s
12-12 15:09:10 D/InvocationExecution: done with tearDown 'com.android.tradefed.targetprep.RunCommandTargetPreparer@23296cb9' on device: 'SKBFXYVX173T' in 64 ms
12-12 15:09:10 D/InvocationExecution: starting tearDown 'com.android.tradefed.targetprep.RunCommandTargetPreparer@614abb0a' on device: 'SKBFXYVX173T'
12-12 15:09:10 D/RunUtil: Running command [adb, -s, SKBFXYVX173T, shell, settings, put, global, package_verifier_enable, 1] with timeout: 2m 0s
12-12 15:09:10 D/InvocationExecution: done with tearDown 'com.android.tradefed.targetprep.RunCommandTargetPreparer@614abb0a' on device: 'SKBFXYVX173T' in 62 ms
12-12 15:09:10 D/InvocationExecution: starting tearDown 'com.android.compatibility.common.tradefed.targetprep.ReportLogCollector@327b381' on device: 'SKBFXYVX173T'
12-12 15:09:10 D/NativeDevice: Using property ro.build.version.sdk=31 from cache.
12-12 15:09:10 D/NativeDevice: Using 'ls' to check doesFileExist(/storage/emulated/0/report-log-files/)
12-12 15:09:10 D/RunUtil: Running command [adb, -s, SKBFXYVX173T, shell, ls, '/storage/emulated/0/report-log-files/'] with timeout: 2m 0s
12-12 15:09:10 D/NativeDevice: File /storage/emulated/0/report-log-files/ does not exist.
stdout: 
stderr: ls: /storage/emulated/0/report-log-files/: No such file or directory

12-12 15:09:10 E/NativeDevice: Device path /sdcard/report-log-files/ does not exist to be pulled.
12-12 15:09:10 D/InvocationExecution: done with tearDown 'com.android.compatibility.common.tradefed.targetprep.ReportLogCollector@327b381' on device: 'SKBFXYVX173T' in 115 ms
12-12 15:09:10 D/InvocationExecution: starting tearDown 'com.android.compatibility.common.tradefed.targetprep.DeviceInfoCollector@2854dfaf' on device: 'SKBFXYVX173T'
12-12 15:09:10 D/InvocationExecution: done with tearDown 'com.android.compatibility.common.tradefed.targetprep.DeviceInfoCollector@2854dfaf' on device: 'SKBFXYVX173T' in 3 ms
12-12 15:09:10 D/InvocationExecution: starting tearDown 'com.android.tradefed.targetprep.RunCommandTargetPreparer@14e2ed78' on device: 'SKBFXYVX173T'
12-12 15:09:10 D/InvocationExecution: done with tearDown 'com.android.tradefed.targetprep.RunCommandTargetPreparer@14e2ed78' on device: 'SKBFXYVX173T' in 0 ms
12-12 15:09:10 D/InvocationExecution: starting tearDown 'com.android.compatibility.common.tradefed.targetprep.WifiCheck@4cd1559c' on device: 'SKBFXYVX173T'
12-12 15:09:10 D/InvocationExecution: done with tearDown 'com.android.compatibility.common.tradefed.targetprep.WifiCheck@4cd1559c' on device: 'SKBFXYVX173T' in 0 ms
12-12 15:09:10 D/InvocationExecution: starting tearDown 'com.android.compatibility.common.tradefed.targetprep.ApkPreconditionCheck@b828d33' on device: 'SKBFXYVX173T'
12-12 15:09:10 D/InvocationExecution: done with tearDown 'com.android.compatibility.common.tradefed.targetprep.ApkPreconditionCheck@b828d33' on device: 'SKBFXYVX173T' in 0 ms
12-12 15:09:10 D/InvocationExecution: starting tearDown 'com.android.compatibility.common.tradefed.targetprep.SettingsPreparer@7b3e1848' on device: 'SKBFXYVX173T'
12-12 15:09:10 D/InvocationExecution: done with tearDown 'com.android.compatibility.common.tradefed.targetprep.SettingsPreparer@7b3e1848' on device: 'SKBFXYVX173T' in 0 ms
12-12 15:09:10 D/InvocationExecution: starting tearDown 'com.android.compatibility.common.tradefed.targetprep.SettingsPreparer@18b47d76' on device: 'SKBFXYVX173T'
12-12 15:09:10 D/InvocationExecution: done with tearDown 'com.android.compatibility.common.tradefed.targetprep.SettingsPreparer@18b47d76' on device: 'SKBFXYVX173T' in 1 ms
12-12 15:09:10 D/InvocationExecution: starting tearDown 'com.android.compatibility.common.tradefed.targetprep.PackageDisabler@7ec4519b' on device: 'SKBFXYVX173T'
12-12 15:09:10 D/InvocationExecution: done with tearDown 'com.android.compatibility.common.tradefed.targetprep.PackageDisabler@7ec4519b' on device: 'SKBFXYVX173T' in 0 ms
12-12 15:09:10 D/InvocationExecution: starting tearDown 'com.android.compatibility.common.tradefed.targetprep.StayAwakePreparer@27a36f17' on device: 'SKBFXYVX173T'
12-12 15:09:10 D/InvocationExecution: done with tearDown 'com.android.compatibility.common.tradefed.targetprep.StayAwakePreparer@27a36f17' on device: 'SKBFXYVX173T' in 0 ms
12-12 15:09:10 D/InvocationExecution: starting tearDown 'com.android.compatibility.common.tradefed.targetprep.DynamicConfigPusher@33c63d68' on device: 'SKBFXYVX173T'
12-12 15:09:10 D/InvocationExecution: done with tearDown 'com.android.compatibility.common.tradefed.targetprep.DynamicConfigPusher@33c63d68' on device: 'SKBFXYVX173T' in 1 ms
12-12 15:09:10 D/InvocationExecution: starting tearDown 'com.android.compatibility.common.tradefed.targetprep.DeviceFileCollector@1f7e6cb5' on device: 'SKBFXYVX173T'
12-12 15:09:10 D/InvocationExecution: done with tearDown 'com.android.compatibility.common.tradefed.targetprep.DeviceFileCollector@1f7e6cb5' on device: 'SKBFXYVX173T' in 0 ms
12-12 15:09:10 D/InvocationExecution: starting tearDown 'com.android.compatibility.common.tradefed.targetprep.DeviceFileCollector@73537c29' on device: 'SKBFXYVX173T'
12-12 15:09:10 D/InvocationExecution: done with tearDown 'com.android.compatibility.common.tradefed.targetprep.DeviceFileCollector@73537c29' on device: 'SKBFXYVX173T' in 0 ms
12-12 15:09:10 D/TestDevice: Uninstalling com.android.tradefed.utils.wifi with extra args 
12-12 15:09:11 D/WifiHelper: Successfully clean up WifiHelper.
12-12 15:09:11 D/RunUtil: Running command [id, -u, dev2-google01] with timeout: 1m 0s
12-12 15:09:11 D/RunUtil: Running command [tail, -c, 10MB, /tmp/adb.1000.log] with timeout: 1m 0s
12-12 15:09:11 D/LogFileSaver: Log data for host_adb_log is already compressed, skipping compression
12-12 15:09:11 D/FileUtil: Creating temp file at /tmp/xts-root-dir-fa5dd1c2-3ba7-4cdd-9904-a00e7a84339f/android-cts/logs/2025.12.12_15.00.56/inv_18424983443859154131 with prefix "host_adb_log_" suffix ".txt"
12-12 15:09:11 I/LogFileSaver: Saved log file /tmp/xts-root-dir-fa5dd1c2-3ba7-4cdd-9904-a00e7a84339f/android-cts/logs/2025.12.12_15.00.56/inv_18424983443859154131/host_adb_log_10270299839071014497.txt. [size=180813, elapsed=1ms]
12-12 15:09:11 D/CertificationSuiteResultReporter: Saved logs for host_adb_log in /tmp/xts-root-dir-fa5dd1c2-3ba7-4cdd-9904-a00e7a84339f/android-cts/logs/2025.12.12_15.00.56/inv_18424983443859154131/host_adb_log_10270299839071014497.txt
12-12 15:09:11 D/LogFileSaver: Log data for host_adb_log is already compressed, skipping compression
12-12 15:09:11 D/FileUtil: Creating temp file at /tmp/13441469/cts/inv_12648427467095576587/inv_2368518573660175600 with prefix "host_adb_log_" suffix ".txt"
12-12 15:09:11 I/LogFileSaver: Saved log file /tmp/13441469/cts/inv_12648427467095576587/inv_2368518573660175600/host_adb_log_4287300385770964424.txt. [size=180813, elapsed=0ms]
12-12 15:09:11 D/LogFileSaver: Log data for device_logcat_teardown_SKBFXYVX173T is already compressed, skipping compression
12-12 15:09:11 D/FileUtil: Creating temp file at /tmp/xts-root-dir-fa5dd1c2-3ba7-4cdd-9904-a00e7a84339f/android-cts/logs/2025.12.12_15.00.56/inv_18424983443859154131 with prefix "device_logcat_teardown_SKBFXYVX173T_" suffix ".txt"
12-12 15:09:11 I/LogFileSaver: Saved log file /tmp/xts-root-dir-fa5dd1c2-3ba7-4cdd-9904-a00e7a84339f/android-cts/logs/2025.12.12_15.00.56/inv_18424983443859154131/device_logcat_teardown_SKBFXYVX173T_12478090273521099491.txt. [size=8598, elapsed=1ms]
12-12 15:09:11 D/CertificationSuiteResultReporter: Saved logs for device_logcat_teardown_SKBFXYVX173T in /tmp/xts-root-dir-fa5dd1c2-3ba7-4cdd-9904-a00e7a84339f/android-cts/logs/2025.12.12_15.00.56/inv_18424983443859154131/device_logcat_teardown_SKBFXYVX173T_12478090273521099491.txt
12-12 15:09:11 D/LogFileSaver: Log data for device_logcat_teardown_SKBFXYVX173T is already compressed, skipping compression
12-12 15:09:11 D/FileUtil: Creating temp file at /tmp/13441469/cts/inv_12648427467095576587/inv_2368518573660175600 with prefix "device_logcat_teardown_SKBFXYVX173T_" suffix ".txt"
12-12 15:09:11 I/LogFileSaver: Saved log file /tmp/13441469/cts/inv_12648427467095576587/inv_2368518573660175600/device_logcat_teardown_SKBFXYVX173T_9986162765880735100.txt. [size=8598, elapsed=1ms]
12-12 15:09:11 I/TestInvocation: Done stopping logcat for SKBFXYVX173T
12-12 15:09:11 D/BackgroundDeviceAction: com.android.ddmlib.TimeoutException while running logcat on SKBFXYVX173T. May see duplicated content in log.
12-12 15:09:11 D/BackgroundDeviceAction: Waiting for device SKBFXYVX173T online before starting.
12-12 15:09:11 D/CommandScheduler: TestDeviceState for releasing 'SKBFXYVX173T(class com.android.tradefed.device.TestDevice)' is 'ONLINE'
12-12 15:09:11 I/NativeDeviceStateMonitor: Waiting 30000 ms for device SKBFXYVX173T shell to be responsive
12-12 15:09:11 I/NativeDeviceStateMonitor: shell ready. id output: uid=2000(shell) gid=2000(shell) groups=2000(shell),1004(input),1007(log),1011(adb),1015(sdcard_rw),1028(sdcard_r),1078(ext_data_rw),1079(ext_obb_rw),3001(net_bt_admin),3002(net_bt),3003(inet),3006(net_bw_stats),3009(readproc),3011(uhid) context=u:r:shell:s0

12-12 15:09:11 D/CommandScheduler: Release map of the devices: {com.android.tradefed.device.TestDevice@24e7d479=AVAILABLE}
12-12 15:09:11 W/NativeDevice: Attempting to stop logcat when not capturing for SKBFXYVX173T
12-12 15:09:11 D/TestDevice: No snapuserd notification in progress for BLOCK_BEFORE_RELEASING
