11-06 16:30:22.488 INFO ==========> VtsTrebleVendorVintfTest <==========
11-06 16:30:22.492 INFO adb devices: [u'0001201904000455']
11-06 16:30:22.865 INFO [AndroidDevice|0001201904000455] Starting VTS agent
11-06 16:30:22.977 WARNING [AndroidDevice|0001201904000455] A command to setup the env to start the VTS Agent failed Error executing adb cmd 'adb -s 0001201904000455 shell "\"rm -f /data/local/tmp/vts_driver_* ; rm -f /data/local/tmp/vts_agent_callback* ; pgrep 'vts_*' | xargs kill\""'. ret: 127, stdout: , stderr: /system/bin/sh: rm -f /data/local/tmp/vts_driver_* ; rm -f /data/local/tmp/vts_agent_callback* ; pgrep 'vts_*' | xargs kill: inaccessible or not found

11-06 16:30:24.658 INFO Android framework started.
11-06 16:30:26.400 INFO [Test Case] 1/9 DeviceManifestTest.ShippingFcmVersion_32bit
11-06 16:30:26.401 INFO [Test Case] 1/8 DeviceManifestTest.NoDeprecatedHalsOnManifest_32bit
11-06 16:30:26.401 INFO [Test Case] 1/7 DeviceManifestTest.GnssHalVersionCompatibility_32bit
11-06 16:30:26.402 INFO [Test Case] 1/6 DeviceMatrixTest.VndkVersion_32bit
11-06 16:30:26.402 INFO [Test Case] 1/5 DeviceManifest/SingleManifestTest.HalsAreBinderized/0_32bit
11-06 16:30:26.403 INFO [Test Case] 1/4 DeviceManifest/SingleManifestTest.HalsAreServed/0_32bit
11-06 16:30:26.403 INFO [Test Case] 1/3 DeviceManifest/SingleManifestTest.ServedHwbinderHalsAreInManifest/0_32bit
11-06 16:30:26.403 INFO [Test Case] 1/2 DeviceManifest/SingleManifestTest.ServedPassthroughHalsAreInManifest/0_32bit
11-06 16:30:26.404 INFO [Test Case] 1/1 DeviceManifest/SingleManifestTest.InterfacesAreReleased/0_32bit
11-06 16:30:26.929 ERROR Note: Google Test filter = DeviceManifest/SingleManifestTest.InterfacesAreReleased/0
11-06 16:30:26.929 ERROR [==========] Running 1 test from 1 test suite.
11-06 16:30:26.929 ERROR [----------] Global test environment set-up.
11-06 16:30:26.930 ERROR [----------] 1 test from DeviceManifest/SingleManifestTest
11-06 16:30:26.930 ERROR [ RUN      ] DeviceManifest/SingleManifestTest.InterfacesAreReleased/0
11-06 16:30:26.930 ERROR Getting: android.hardware.atrace@1.0::IAtraceDevice/default
11-06 16:30:26.930 ERROR Getting: android.hardware.audio@5.0::IDevicesFactory/default
11-06 16:30:26.931 ERROR Getting: android.hardware.audio@5.0::IDevicesFactory/default
11-06 16:30:26.931 ERROR Getting: android.hardware.audio.effect@5.0::IEffectsFactory/default
11-06 16:30:26.931 ERROR Getting: android.hardware.audio.effect@5.0::IEffectsFactory/default
11-06 16:30:26.932 ERROR Getting: android.hardware.bluetooth@1.0::IBluetoothHci/default
11-06 16:30:26.932 ERROR Getting: android.hardware.bluetooth@1.0::IBluetoothHci/default
11-06 16:30:26.932 ERROR Getting: android.hardware.bluetooth.audio@2.0::IBluetoothAudioProvidersFactory/default
11-06 16:30:26.932 ERROR Getting: android.hardware.bluetooth.audio@2.0::IBluetoothAudioProvidersFactory/default
11-06 16:30:26.933 ERROR Getting: android.hardware.camera.provider@2.5::ICameraProvider/legacy/0
11-06 16:30:26.933 ERROR Getting: android.hardware.camera.provider@2.5::ICameraProvider/legacy/0
11-06 16:30:26.933 ERROR Getting: android.hardware.cas@1.1::IMediaCasService/default
11-06 16:30:26.933 ERROR Getting: android.hardware.configstore@1.1::ISurfaceFlingerConfigs/default
11-06 16:30:26.934 ERROR Getting: android.hardware.configstore@1.1::ISurfaceFlingerConfigs/default
11-06 16:30:26.934 ERROR Getting: android.hardware.drm@1.0::ICryptoFactory/default
11-06 16:30:26.934 ERROR Getting: android.hardware.drm@1.0::ICryptoFactory/widevine
11-06 16:30:26.934 ERROR Getting: android.hardware.drm@1.0::IDrmFactory/default
11-06 16:30:26.935 ERROR Getting: android.hardware.drm@1.0::IDrmFactory/widevine
11-06 16:30:26.935 ERROR Getting: android.hardware.drm@1.0::ICryptoFactory/default
11-06 16:30:26.935 ERROR Getting: android.hardware.drm@1.0::IDrmFactory/default
11-06 16:30:26.936 ERROR Getting: android.hardware.drm@1.2::ICryptoFactory/clearkey
11-06 16:30:26.936 ERROR Getting: android.hardware.drm@1.2::ICryptoFactory/widevine
11-06 16:30:26.936 ERROR Getting: android.hardware.drm@1.2::IDrmFactory/clearkey
11-06 16:30:26.936 ERROR Getting: android.hardware.drm@1.2::IDrmFactory/widevine
11-06 16:30:26.937 ERROR Getting: android.hardware.gatekeeper@1.0::IGatekeeper/default
11-06 16:30:26.937 ERROR Getting: android.hardware.gatekeeper@1.0::IGatekeeper/default
11-06 16:30:26.937 ERROR Getting: android.hardware.graphics.allocator@3.0::IAllocator/default
11-06 16:30:26.937 ERROR Getting: android.hardware.graphics.allocator@3.0::IAllocator/default
11-06 16:30:26.938 ERROR Getting: android.hardware.graphics.composer@2.3::IComposer/default
11-06 16:30:26.938 ERROR Getting: android.hardware.graphics.mapper@3.0::IMapper/default
11-06 16:30:26.938 ERROR Getting: android.hardware.graphics.mapper@3.0::IMapper/default
11-06 16:30:26.938 ERROR Getting: android.hardware.health@2.0::IHealth/default
11-06 16:30:26.939 ERROR Getting: android.hardware.health@2.0::IHealth/default
11-06 16:30:26.939 ERROR Getting: android.hardware.ir@1.0::IConsumerIr/default
11-06 16:30:26.939 ERROR Getting: android.hardware.ir@1.0::IConsumerIr/default
11-06 16:30:26.939 ERROR Getting: android.hardware.keymaster@4.0::IKeymasterDevice/default
11-06 16:30:26.940 ERROR Getting: android.hardware.keymaster@4.0::IKeymasterDevice/default
11-06 16:30:26.940 ERROR Getting: android.hardware.light@2.0::ILight/default
11-06 16:30:26.940 ERROR Getting: android.hardware.light@2.0::ILight/default
11-06 16:30:26.941 ERROR Getting: android.hardware.media.omx@1.0::IOmx/default
11-06 16:30:26.941 ERROR Getting: android.hardware.media.omx@1.0::IOmxStore/default
11-06 16:30:26.941 ERROR Getting: android.hardware.media.omx@1.0::IOmx/default
11-06 16:30:26.941 ERROR Getting: android.hardware.media.omx@1.0::IOmxStore/default
11-06 16:30:26.942 ERROR Getting: android.hardware.memtrack@1.0::IMemtrack/default
11-06 16:30:26.942 ERROR Getting: android.hardware.memtrack@1.0::IMemtrack/default
11-06 16:30:26.942 ERROR Getting: android.hardware.power@1.0::IPower/default
11-06 16:30:26.942 ERROR Getting: android.hardware.power@1.0::IPower/default
11-06 16:30:26.943 ERROR Getting: android.hardware.power.stats@1.0::IPowerStats/default
11-06 16:30:26.943 ERROR Getting: android.hardware.soundtrigger@2.2::ISoundTriggerHw/default
11-06 16:30:26.943 ERROR Getting: android.hardware.soundtrigger@2.2::ISoundTriggerHw/default
11-06 16:30:26.943 ERROR Getting: android.hardware.thermal@1.0::IThermal/default
11-06 16:30:26.944 ERROR Getting: android.hardware.thermal@2.0::IThermal/default
11-06 16:30:26.944 ERROR Getting: android.hardware.tv.cec@1.0::IHdmiCec/default
11-06 16:30:26.944 ERROR Getting: android.hardware.tv.cec@1.0::IHdmiCec/default
11-06 16:30:26.945 ERROR Getting: android.hardware.usb@1.0::IUsb/default
11-06 16:30:26.945 ERROR Getting: android.hardware.usb@1.0::IUsb/default
11-06 16:30:26.945 ERROR Getting: android.hardware.wifi@1.3::IWifi/default
11-06 16:30:26.945 ERROR Getting: android.hardware.wifi@1.3::IWifi/default
11-06 16:30:26.946 ERROR Getting: com.skb.btvpropertyservice@1.0::IBtvPropertyService/default
11-06 16:30:26.946 ERROR test/vts-testcase/hal/treble/vintf/SingleManifestTest.cpp:63: Failure
11-06 16:30:26.946 ERROR Failed
11-06 16:30:26.946 ERROR com.skb.btvpropertyservice@1.0::IBtvPropertyService has an empty hash. This is because it was compiled without being frozen in a corresponding current.txt file.
11-06 16:30:26.947 ERROR Getting: com.skb.btvpropertyservice@1.0::IBtvPropertyService/default
11-06 16:30:26.947 ERROR test/vts-testcase/hal/treble/vintf/SingleManifestTest.cpp:63: Failure
11-06 16:30:26.947 ERROR Failed
11-06 16:30:26.947 ERROR com.skb.btvpropertyservice@1.0::IBtvPropertyService has an empty hash. This is because it was compiled without being frozen in a corresponding current.txt file.
11-06 16:30:26.948 ERROR Getting: com.skb.btvservice@1.0::IBtvMediaPlayer/btv_main
11-06 16:30:26.948 ERROR test/vts-testcase/hal/treble/vintf/SingleManifestTest.cpp:63: Failure
11-06 16:30:26.948 ERROR Failed
11-06 16:30:26.948 ERROR com.skb.btvservice@1.0::IBtvMediaPlayer has an empty hash. This is because it was compiled without being frozen in a corresponding current.txt file.
11-06 16:30:26.949 ERROR Getting: com.skb.btvservice@1.0::IBtvMediaPlayer/btv_pip
11-06 16:30:26.949 ERROR test/vts-testcase/hal/treble/vintf/SingleManifestTest.cpp:63: Failure
11-06 16:30:26.949 ERROR Failed
11-06 16:30:26.950 ERROR com.skb.btvservice@1.0::IBtvMediaPlayer has an empty hash. This is because it was compiled without being frozen in a corresponding current.txt file.
11-06 16:30:26.950 ERROR Getting: com.skb.btvservice@1.0::ITVService/default
11-06 16:30:26.950 ERROR test/vts-testcase/hal/treble/vintf/SingleManifestTest.cpp:63: Failure
11-06 16:30:26.950 ERROR Failed
11-06 16:30:26.951 ERROR com.skb.btvservice@1.0::ITVService has an empty hash. This is because it was compiled without being frozen in a corresponding current.txt file.
11-06 16:30:26.951 ERROR Getting: com.skb.btvservice@1.0::IBtvMediaPlayer/btv_main
11-06 16:30:26.951 ERROR test/vts-testcase/hal/treble/vintf/SingleManifestTest.cpp:63: Failure
11-06 16:30:26.951 ERROR Failed
11-06 16:30:26.952 ERROR com.skb.btvservice@1.0::IBtvMediaPlayer has an empty hash. This is because it was compiled without being frozen in a corresponding current.txt file.
11-06 16:30:26.952 ERROR Getting: com.skb.btvservice@1.0::IBtvMediaPlayer/btv_pip
11-06 16:30:26.952 ERROR test/vts-testcase/hal/treble/vintf/SingleManifestTest.cpp:63: Failure
11-06 16:30:26.953 ERROR Failed
11-06 16:30:26.953 ERROR com.skb.btvservice@1.0::IBtvMediaPlayer has an empty hash. This is because it was compiled without being frozen in a corresponding current.txt file.
11-06 16:30:26.953 ERROR Getting: com.skb.btvservice@1.0::ITVService/default
11-06 16:30:26.953 ERROR test/vts-testcase/hal/treble/vintf/SingleManifestTest.cpp:63: Failure
11-06 16:30:26.954 ERROR Failed
11-06 16:30:26.954 ERROR com.skb.btvservice@1.0::ITVService has an empty hash. This is because it was compiled without being frozen in a corresponding current.txt file.
11-06 16:30:26.954 ERROR Getting: vendor.amlogic.hardware.hdmicec@1.0::IDroidHdmiCEC/default
11-06 16:30:26.954 ERROR Getting: vendor.amlogic.hardware.hdmicec@1.0::IDroidHdmiCEC/default
11-06 16:30:26.955 ERROR Getting: vendor.amlogic.hardware.remotecontrol@1.0::IRemoteControl/default
11-06 16:30:26.955 ERROR Getting: vendor.amlogic.hardware.remotecontrol@1.0::IRemoteControl/default
11-06 16:30:26.955 ERROR Getting: vendor.amlogic.hardware.subtitleserver@1.0::ISubtitleServer/default
11-06 16:30:26.955 ERROR Getting: vendor.amlogic.hardware.subtitleserver@1.0::ISubtitleServer/default
11-06 16:30:26.956 ERROR Getting: vendor.amlogic.hardware.systemcontrol@1.1::ISystemControl/default
11-06 16:30:26.956 ERROR Getting: vendor.amlogic.hardware.systemcontrol@1.1::ISystemControl/default
11-06 16:30:26.956 ERROR [  FAILED  ] DeviceManifest/SingleManifestTest.InterfacesAreReleased/0, where GetParam() = device manifest (298 ms)
11-06 16:30:26.956 ERROR [----------] 1 test from DeviceManifest/SingleManifestTest (298 ms total)
11-06 16:30:26.956 ERROR 
11-06 16:30:26.956 ERROR [----------] Global test environment tear-down
11-06 16:30:26.957 ERROR [==========] 1 test from 1 test suite ran. (298 ms total)
11-06 16:30:26.957 ERROR [  PASSED  ] 0 tests.
11-06 16:30:26.957 ERROR [  FAILED  ] 1 test, listed below:
11-06 16:30:26.957 ERROR [  FAILED  ] DeviceManifest/SingleManifestTest.InterfacesAreReleased/0, where GetParam() = device manifest
11-06 16:30:26.957 ERROR 
11-06 16:30:26.958 ERROR  1 FAILED TEST
11-06 16:30:26.958 ERROR 
11-06 16:30:26.958 ERROR <?xml version="1.0" encoding="UTF-8"?>
11-06 16:30:26.958 ERROR <testsuites tests="1" failures="1" disabled="0" errors="0" timestamp="2020-11-06T08:30:26" time="0.298" name="AllTests">
11-06 16:30:26.958 ERROR   <testsuite name="DeviceManifest/SingleManifestTest" tests="1" failures="1" disabled="0" errors="0" time="0.298">
11-06 16:30:26.959 ERROR     <testcase name="InterfacesAreReleased/0" value_param="device manifest" status="run" time="0.298" classname="DeviceManifest/SingleManifestTest">
11-06 16:30:26.959 ERROR       <failure message="test/vts-testcase/hal/treble/vintf/SingleManifestTest.cpp:63&#x0A;Failed&#x0A;com.skb.btvpropertyservice@1.0::IBtvPropertyService has an empty hash. This is because it was compiled without being frozen in a corresponding current.txt file." type=""><![CDATA[test/vts-testcase/hal/treble/vintf/SingleManifestTest.cpp:63
11-06 16:30:26.959 ERROR Failed
11-06 16:30:26.959 ERROR com.skb.btvpropertyservice@1.0::IBtvPropertyService has an empty hash. This is because it was compiled without being frozen in a corresponding current.txt file.]]></failure>
11-06 16:30:26.959 ERROR       <failure message="test/vts-testcase/hal/treble/vintf/SingleManifestTest.cpp:63&#x0A;Failed&#x0A;com.skb.btvpropertyservice@1.0::IBtvPropertyService has an empty hash. This is because it was compiled without being frozen in a corresponding current.txt file." type=""><![CDATA[test/vts-testcase/hal/treble/vintf/SingleManifestTest.cpp:63
11-06 16:30:26.960 ERROR Failed
11-06 16:30:26.960 ERROR com.skb.btvpropertyservice@1.0::IBtvPropertyService has an empty hash. This is because it was compiled without being frozen in a corresponding current.txt file.]]></failure>
11-06 16:30:26.960 ERROR       <failure message="test/vts-testcase/hal/treble/vintf/SingleManifestTest.cpp:63&#x0A;Failed&#x0A;com.skb.btvservice@1.0::IBtvMediaPlayer has an empty hash. This is because it was compiled without being frozen in a corresponding current.txt file." type=""><![CDATA[test/vts-testcase/hal/treble/vintf/SingleManifestTest.cpp:63
11-06 16:30:26.960 ERROR Failed
11-06 16:30:26.960 ERROR com.skb.btvservice@1.0::IBtvMediaPlayer has an empty hash. This is because it was compiled without being frozen in a corresponding current.txt file.]]></failure>
11-06 16:30:26.960 ERROR       <failure message="test/vts-testcase/hal/treble/vintf/SingleManifestTest.cpp:63&#x0A;Failed&#x0A;com.skb.btvservice@1.0::IBtvMediaPlayer has an empty hash. This is because it was compiled without being frozen in a corresponding current.txt file." type=""><![CDATA[test/vts-testcase/hal/treble/vintf/SingleManifestTest.cpp:63
11-06 16:30:26.961 ERROR Failed
11-06 16:30:26.961 ERROR com.skb.btvservice@1.0::IBtvMediaPlayer has an empty hash. This is because it was compiled without being frozen in a corresponding current.txt file.]]></failure>
11-06 16:30:26.961 ERROR       <failure message="test/vts-testcase/hal/treble/vintf/SingleManifestTest.cpp:63&#x0A;Failed&#x0A;com.skb.btvservice@1.0::ITVService has an empty hash. This is because it was compiled without being frozen in a corresponding current.txt file." type=""><![CDATA[test/vts-testcase/hal/treble/vintf/SingleManifestTest.cpp:63
11-06 16:30:26.961 ERROR Failed
11-06 16:30:26.961 ERROR com.skb.btvservice@1.0::ITVService has an empty hash. This is because it was compiled without being frozen in a corresponding current.txt file.]]></failure>
11-06 16:30:26.961 ERROR       <failure message="test/vts-testcase/hal/treble/vintf/SingleManifestTest.cpp:63&#x0A;Failed&#x0A;com.skb.btvservice@1.0::IBtvMediaPlayer has an empty hash. This is because it was compiled without being frozen in a corresponding current.txt file." type=""><![CDATA[test/vts-testcase/hal/treble/vintf/SingleManifestTest.cpp:63
11-06 16:30:26.961 ERROR Failed
11-06 16:30:26.962 ERROR com.skb.btvservice@1.0::IBtvMediaPlayer has an empty hash. This is because it was compiled without being frozen in a corresponding current.txt file.]]></failure>
11-06 16:30:26.962 ERROR       <failure message="test/vts-testcase/hal/treble/vintf/SingleManifestTest.cpp:63&#x0A;Failed&#x0A;com.skb.btvservice@1.0::IBtvMediaPlayer has an empty hash. This is because it was compiled without being frozen in a corresponding current.txt file." type=""><![CDATA[test/vts-testcase/hal/treble/vintf/SingleManifestTest.cpp:63
11-06 16:30:26.962 ERROR Failed
11-06 16:30:26.962 ERROR com.skb.btvservice@1.0::IBtvMediaPlayer has an empty hash. This is because it was compiled without being frozen in a corresponding current.txt file.]]></failure>
11-06 16:30:26.962 ERROR       <failure message="test/vts-testcase/hal/treble/vintf/SingleManifestTest.cpp:63&#x0A;Failed&#x0A;com.skb.btvservice@1.0::ITVService has an empty hash. This is because it was compiled without being frozen in a corresponding current.txt file." type=""><![CDATA[test/vts-testcase/hal/treble/vintf/SingleManifestTest.cpp:63
11-06 16:30:26.962 ERROR Failed
11-06 16:30:26.962 ERROR com.skb.btvservice@1.0::ITVService has an empty hash. This is because it was compiled without being frozen in a corresponding current.txt file.]]></failure>
11-06 16:30:26.963 ERROR     </testcase>
11-06 16:30:26.963 ERROR   </testsuite>
11-06 16:30:26.963 ERROR </testsuites>
11-06 16:30:26.963 ERROR 
11-06 16:30:26.963 ERROR test/vts-testcase/hal/treble/vintf/SingleManifestTest.cpp:63
Failed
com.skb.btvpropertyservice@1.0::IBtvPropertyService has an empty hash. This is because it was compiled without being frozen in a corresponding current.txt file.
test/vts-testcase/hal/treble/vintf/SingleManifestTest.cpp:63
Failed
com.skb.btvpropertyservice@1.0::IBtvPropertyService has an empty hash. This is because it was compiled without being frozen in a corresponding current.txt file.
test/vts-testcase/hal/treble/vintf/SingleManifestTest.cpp:63
Failed
com.skb.btvservice@1.0::IBtvMediaPlayer has an empty hash. This is because it was compiled without being frozen in a corresponding current.txt file.
test/vts-testcase/hal/treble/vintf/SingleManifestTest.cpp:63
Failed
com.skb.btvservice@1.0::IBtvMediaPlayer has an empty hash. This is because it was compiled without being frozen in a corresponding current.txt file.
test/vts-testcase/hal/treble/vintf/SingleManifestTest.cpp:63
Failed
com.skb.btvservice@1.0::ITVService has an empty hash. This is because it was compiled without being frozen in a corresponding current.txt file.
test/vts-testcase/hal/treble/vintf/SingleManifestTest.cpp:63
Failed
com.skb.btvservice@1.0::IBtvMediaPlayer has an empty hash. This is because it was compiled without being frozen in a corresponding current.txt file.
test/vts-testcase/hal/treble/vintf/SingleManifestTest.cpp:63
Failed
com.skb.btvservice@1.0::IBtvMediaPlayer has an empty hash. This is because it was compiled without being frozen in a corresponding current.txt file.
test/vts-testcase/hal/treble/vintf/SingleManifestTest.cpp:63
Failed
com.skb.btvservice@1.0::ITVService has an empty hash. This is because it was compiled without being frozen in a corresponding current.txt file.
11-06 16:30:26.964 ERROR [Test Case] 1/1 DeviceManifest/SingleManifestTest.InterfacesAreReleased/0_32bit FAIL
11-06 16:30:26.965 INFO Dumping logcat /tmp/vts-runner-log1697553995138094944/VtsTrebleVendorVintfTest/11-06-2020_16-30-22-476/logcat/logcat_DeviceManifest_SingleManifestTest.InterfacesAreReleased_0_32bit__radio_0001201904000455.txt...
11-06 16:30:27.033 INFO Dumping logcat /tmp/vts-runner-log1697553995138094944/VtsTrebleVendorVintfTest/11-06-2020_16-30-22-476/logcat/logcat_DeviceManifest_SingleManifestTest.InterfacesAreReleased_0_32bit__events_0001201904000455.txt...
11-06 16:30:27.155 INFO Dumping logcat /tmp/vts-runner-log1697553995138094944/VtsTrebleVendorVintfTest/11-06-2020_16-30-22-476/logcat/logcat_DeviceManifest_SingleManifestTest.InterfacesAreReleased_0_32bit__main_0001201904000455.txt...
11-06 16:30:27.335 INFO Dumping logcat /tmp/vts-runner-log1697553995138094944/VtsTrebleVendorVintfTest/11-06-2020_16-30-22-476/logcat/logcat_DeviceManifest_SingleManifestTest.InterfacesAreReleased_0_32bit__system_0001201904000455.txt...
11-06 16:30:27.502 INFO Dumping logcat /tmp/vts-runner-log1697553995138094944/VtsTrebleVendorVintfTest/11-06-2020_16-30-22-476/logcat/logcat_DeviceManifest_SingleManifestTest.InterfacesAreReleased_0_32bit__crash_0001201904000455.txt...
11-06 16:30:27.931 WARNING Failed to remove: {'stderrs': ['rmdir: /data/local/tmp/vts_binary_test_GtestBinaryTest/: No such file or directory\n', 'rmdir: /data/nativetest64: No such file or directory\n', ''], 'return_codes': [1, 1, 0], 'stdouts': ['', '', '']}
11-06 16:30:27.932 INFO Summary for test class VtsTrebleVendorVintfTest: Error 0, Executed 1, Failed 1, Passed 0, Requested 0, Skipped 0
11-06 16:30:28.355 INFO Summary for test run VtsTrebleVendorVintfTest@11-06-2020_16-30-22-476: Error 0, Executed 1, Failed 1, Passed 0, Requested 0, Skipped 0
