11-06 16:30:22.476 DEBUG Test filter: Filter:
enable_regex: True
enable_negative_pattern: True
enable_module_name_prefix_matching: True
module_name: VtsTrebleVendorVintfTest
include_filter: ['VtsTrebleVendorVintfTest.DeviceManifest/SingleManifestTest.InterfacesAreReleased/0_32bit']
exclude_filter: []
include_filter_exact: ['VtsTrebleVendorVintfTest.DeviceManifest/SingleManifestTest.InterfacesAreReleased/0_32bit']
include_filter_regex: []
exclude_filter_exact: []
exclude_filter_regex: []
expand_bitness: True
11-06 16:30:22.476 DEBUG Missing toggle parameter in configuration: enable_coverage
11-06 16:30:22.488 DEBUG Coverage is disabled.
11-06 16:30:22.488 DEBUG Missing toggle parameter in configuration: enable_sancov
11-06 16:30:22.488 DEBUG Sancov is disabled.
11-06 16:30:22.488 DEBUG Missing toggle parameter in configuration: enable_profiling
11-06 16:30:22.488 DEBUG Profiling is disabled.
11-06 16:30:22.488 DEBUG Missing toggle parameter in configuration: enable_systrace
11-06 16:30:22.488 DEBUG Systrace is disabled.
11-06 16:30:22.488 DEBUG Missing toggle parameter in configuration: enable_log_uploading
11-06 16:30:22.488 DEBUG Log uploading is disabled
11-06 16:30:22.488 INFO ==========> VtsTrebleVendorVintfTest <==========
11-06 16:30:22.488 DEBUG Start timer with timeout=299.987472057sec.
11-06 16:30:22.489 DEBUG Missing optional user param 'precondition_first_api_level' in configuration, continue.
11-06 16:30:22.489 DEBUG cwd: /home/tcrd3/Downloads/Q/android-vts/testcases
11-06 16:30:22.490 DEBUG Start standing subprocess with cmd: adb devices 
11-06 16:30:22.492 DEBUG cmd: adb devices , stdout: List of devices attached
0001201904000455	device

, stderr: , ret: 0
11-06 16:30:22.492 INFO adb devices: [u'0001201904000455']
11-06 16:30:22.492 DEBUG controller_config: [{u'build_id': u'6860432', u'product_type': u'bfx-at100', u'build_alias': u'QTG1.200924.001', u'product_variant': u'bfx-at100', u'build_flavor': u'tvgsi_arm-userdebug', 'log_severity': u'DEBUG', u'serial': u'0001201904000455'}]
11-06 16:30:22.496 DEBUG Start standing subprocess with cmd: adb -s 0001201904000455 shell "id -un"
11-06 16:30:22.610 DEBUG cmd: adb -s 0001201904000455 shell "id -un", stdout: root
, stderr: , ret: 0
11-06 16:30:22.616 DEBUG Start standing subprocess with cmd: adb forward --list
11-06 16:30:22.625 DEBUG cmd: adb forward --list, stdout: 
, stderr: , ret: 0
11-06 16:30:22.632 DEBUG Start standing subprocess with cmd: adb -s 0001201904000455 reverse tcp:5010 tcp:1597
11-06 16:30:22.640 DEBUG cmd: adb -s 0001201904000455 reverse tcp:5010 tcp:1597, stdout: 5010
, stderr: , ret: 0
11-06 16:30:22.646 DEBUG Start standing subprocess with cmd: adb devices 
11-06 16:30:22.655 DEBUG cmd: adb devices , stdout: List of devices attached
0001201904000455	device

, stderr: , ret: 0
11-06 16:30:22.670 DEBUG Start standing subprocess with cmd: adb -s 0001201904000455 shell "getprop ro.build.product"
11-06 16:30:22.785 DEBUG cmd: adb -s 0001201904000455 shell "getprop ro.build.product", stdout: generic
, stderr: , ret: 0
11-06 16:30:22.792 DEBUG Start standing subprocess with cmd: adb -s 0001201904000455 shell "getprop ro.product.name"
11-06 16:30:22.857 DEBUG cmd: adb -s 0001201904000455 shell "getprop ro.product.name", stdout: BFX_AT100
, stderr: , ret: 0
11-06 16:30:22.864 DEBUG Start standing subprocess with cmd: adb -s 0001201904000455 logcat -v threadtime -b all >> /tmp/vts-runner-log1697553995138094944/VtsTrebleVendorVintfTest/11-06-2020_16-30-22-476/AndroidDevice0001201904000455/adblog_bfx_at100_0001201904000455.txt
11-06 16:30:22.865 INFO [AndroidDevice|0001201904000455] Starting VTS agent
11-06 16:30:22.871 DEBUG Start standing subprocess with cmd: adb -s 0001201904000455 shell "stop llkd-1"
11-06 16:30:22.936 DEBUG cmd: adb -s 0001201904000455 shell "stop llkd-1", stdout: , stderr: , ret: 0
11-06 16:30:22.943 DEBUG Start standing subprocess with cmd: adb -s 0001201904000455 shell "\"rm -f /data/local/tmp/vts_driver_* ; rm -f /data/local/tmp/vts_agent_callback* ; pgrep 'vts_*' | xargs kill\""
11-06 16:30:22.976 DEBUG cmd: adb -s 0001201904000455 shell "\"rm -f /data/local/tmp/vts_driver_* ; rm -f /data/local/tmp/vts_agent_callback* ; pgrep 'vts_*' | xargs kill\"", stdout: , stderr: /system/bin/sh: rm -f /data/local/tmp/vts_driver_* ; rm -f /data/local/tmp/vts_agent_callback* ; pgrep 'vts_*' | xargs kill: inaccessible or not found
, ret: 127
11-06 16:30:22.977 WARNING [AndroidDevice|0001201904000455] A command to setup the env to start the VTS Agent failed Error executing adb cmd 'adb -s 0001201904000455 shell "\"rm -f /data/local/tmp/vts_driver_* ; rm -f /data/local/tmp/vts_agent_callback* ; pgrep 'vts_*' | xargs kill\""'. ret: 127, stdout: , stderr: /system/bin/sh: rm -f /data/local/tmp/vts_driver_* ; rm -f /data/local/tmp/vts_agent_callback* ; pgrep 'vts_*' | xargs kill: inaccessible or not found

11-06 16:30:22.984 DEBUG Start standing subprocess with cmd: adb -s 0001201904000455 shell "uname -m"
11-06 16:30:23.050 DEBUG cmd: adb -s 0001201904000455 shell "uname -m", stdout: armv8l
, stderr: , ret: 0
11-06 16:30:23.056 DEBUG Start standing subprocess with cmd: adb -s 0001201904000455 shell "chmod 755 /data/local/tmp/32/vts_hal_agent32; chmod 755 /data/local/tmp/32/vts_hal_driver32; chmod 755 /data/local/tmp/32/vts_shell_driver32; LD_LIBRARY_PATH=/data/local/tmp/32 /data/local/tmp/32/vts_hal_agent32 --hal_driver_path_32=/data/local/tmp/32/vts_hal_driver32 --hal_driver_path_64=/data/local/tmp/64/vts_hal_driver64 --spec_dir=/data/local/tmp/spec --shell_driver_path_32=/data/local/tmp/32/vts_shell_driver32 --shell_driver_path_64=/data/local/tmp/64/vts_shell_driver64 -l DEBUG" >> /tmp/vts-runner-log1697553995138094944/VtsTrebleVendorVintfTest/11-06-2020_16-30-22-476/AndroidDevice0001201904000455/vts_agent_32_0001201904000455.log 2>&1
11-06 16:30:24.064 DEBUG Start standing subprocess with cmd: adb -s 0001201904000455 shell "cat /data/local/tmp/vts_tcp_server_port"
11-06 16:30:24.180 DEBUG cmd: adb -s 0001201904000455 shell "cat /data/local/tmp/vts_tcp_server_port", stdout: 46221, stderr: , ret: 0
11-06 16:30:24.180 DEBUG device_command_port: 46221
11-06 16:30:24.187 DEBUG Start standing subprocess with cmd: adb forward --list
11-06 16:30:24.196 DEBUG cmd: adb forward --list, stdout: 
, stderr: , ret: 0
11-06 16:30:24.202 DEBUG Start standing subprocess with cmd: adb -s 0001201904000455 forward tcp:2392 tcp:46221
11-06 16:30:24.211 DEBUG cmd: adb -s 0001201904000455 forward tcp:2392 tcp:46221, stdout: 2392
, stderr: , ret: 0
11-06 16:30:24.212 DEBUG TcpServer Thread-14 started (127.0.0.1:1597)
11-06 16:30:24.212 DEBUG Found 1 objects for controller AndroidDevice
11-06 16:30:24.213 DEBUG Missing optional user param 'precondition_feature' in configuration, continue.
11-06 16:30:24.213 DEBUG Feature precondition check pass.
11-06 16:30:24.219 DEBUG Start standing subprocess with cmd: adb -s 0001201904000455 shell "setprop vts.native_server.on \"0\""
11-06 16:30:24.335 DEBUG cmd: adb -s 0001201904000455 shell "setprop vts.native_server.on \"0\"", stdout: , stderr: , ret: 0
11-06 16:30:24.336 DEBUG starting Android framework
11-06 16:30:24.342 DEBUG Start standing subprocess with cmd: adb -s 0001201904000455 shell "start"
11-06 16:30:24.409 DEBUG cmd: adb -s 0001201904000455 shell "start", stdout: , stderr: , ret: 0
11-06 16:30:24.416 DEBUG Start standing subprocess with cmd: adb -s 0001201904000455 wait-for-device 
11-06 16:30:24.425 DEBUG cmd: adb -s 0001201904000455 wait-for-device , stdout: , stderr: , ret: 0
11-06 16:30:24.431 DEBUG Start standing subprocess with cmd: adb -s 0001201904000455 shell "getprop sys.boot_completed"
11-06 16:30:24.464 DEBUG cmd: adb -s 0001201904000455 shell "getprop sys.boot_completed", stdout: 1
, stderr: , ret: 0
11-06 16:30:24.470 DEBUG Start standing subprocess with cmd: adb -s 0001201904000455 shell "getprop dev.bootcomplete"
11-06 16:30:24.536 DEBUG cmd: adb -s 0001201904000455 shell "getprop dev.bootcomplete", stdout: 1
, stderr: , ret: 0
11-06 16:30:24.542 DEBUG Start standing subprocess with cmd: adb -s 0001201904000455 shell "ps -g system | grep system_server"
11-06 16:30:24.657 DEBUG cmd: adb -s 0001201904000455 shell "ps -g system | grep system_server", stdout: system        3754  3446 1789408 208700 SyS_epoll_wait      0 S system_server
, stderr: , ret: 0
11-06 16:30:24.658 INFO Android framework started.
11-06 16:30:24.659 DEBUG Missing optional user param 'binary_test_envp' in configuration, continue.
11-06 16:30:24.659 DEBUG Missing optional user param 'binary_test_args' in configuration, continue.
11-06 16:30:24.659 DEBUG Missing optional user param 'binary_test_ld_library_path' in configuration, continue.
11-06 16:30:24.660 DEBUG Missing optional user param 'binary_test_profiling_library_path' in configuration, continue.
11-06 16:30:24.660 DEBUG Missing optional user param 'native_server_process_name' in configuration, continue.
11-06 16:30:24.660 DEBUG Missing optional user param 'precondition_file_path_prefix' in configuration, continue.
11-06 16:30:24.660 DEBUG Missing optional user param 'precondition_sysprop' in configuration, continue.
11-06 16:30:24.660 DEBUG data_file_path: /home/tcrd3/Downloads/Q/android-vts/tools/../../android-vts/testcases
11-06 16:30:24.661 DEBUG Bitness of test source, /home/tcrd3/Downloads/Q/android-vts/tools/../../android-vts/testcases/DATA/nativetest64/vts_treble_vintf_vendor_test/vts_treble_vintf_vendor_test, does not match the abi_bitness, 32, of test run. Skipping
11-06 16:30:24.661 DEBUG Parsed test sources: [('/home/tcrd3/Downloads/Q/android-vts/tools/../../android-vts/testcases/DATA/nativetest/vts_treble_vintf_vendor_test/vts_treble_vintf_vendor_test', '/data/nativetest/vts_treble_vintf_vendor_test', u'_32bit')]
11-06 16:30:24.662 DEBUG Pushing from /home/tcrd3/Downloads/Q/android-vts/tools/../../android-vts/testcases/DATA/nativetest/vts_treble_vintf_vendor_test/vts_treble_vintf_vendor_test to /data/nativetest/vts_treble_vintf_vendor_test.
11-06 16:30:24.668 DEBUG Start standing subprocess with cmd: adb -s 0001201904000455 push /home/tcrd3/Downloads/Q/android-vts/tools/../../android-vts/testcases/DATA/nativetest/vts_treble_vintf_vendor_test/vts_treble_vintf_vendor_test /data/nativetest/vts_treble_vintf_vendor_test
11-06 16:30:24.783 DEBUG cmd: adb -s 0001201904000455 push /home/tcrd3/Downloads/Q/android-vts/tools/../../android-vts/testcases/DATA/nativetest/vts_treble_vintf_vendor_test/vts_treble_vintf_vendor_test /data/nativetest/vts_treble_vintf_vendor_test, stdout: /home/tcrd3/Downloads/Q/android-vts/tools/../../android-vts/testcases/DATA/nativetest/vts_treble_vintf_vendor_test/vts_treble_vintf_vendor_test: 1 file pushed. 7.1 MB/s (483272 bytes in 0.065s)
, stderr: , ret: 0
11-06 16:30:24.783 DEBUG Init the driver service for shell, _default
11-06 16:30:24.784 DEBUG service_name: shell__default
11-06 16:30:24.784 DEBUG file_path: None
11-06 16:30:24.784 DEBUG bits: 32
11-06 16:30:24.784 DEBUG driver_type: 21
11-06 16:30:24.784 DEBUG sending a command (type LAUNCH_DRIVER_SERVICE)
11-06 16:30:24.814 DEBUG command command_type: LAUNCH_DRIVER_SERVICE
service_name: "shell__default"
driver_type: VTS_DRIVER_TYPE_SHELL
bits: 32

11-06 16:30:24.814 DEBUG sending 27 bytes
11-06 16:30:25.834 DEBUG resp 29 bytes
11-06 16:30:25.835 DEBUG Response success
11-06 16:30:25.836 DEBUG resp for LAUNCH_DRIVER_SERVICE: response_code: SUCCESS
reason: "Loaded the shell driver."

11-06 16:30:25.837 DEBUG sending a command (type VTS_AGENT_COMMAND_EXECUTE_SHELL_COMMAND)
11-06 16:30:25.837 DEBUG command command_type: VTS_AGENT_COMMAND_EXECUTE_SHELL_COMMAND
shell_command: "ls /data/nativetest/vts_treble_vintf_vendor_test"

11-06 16:30:25.838 DEBUG sending 55 bytes
11-06 16:30:25.993 DEBUG resp 57 bytes
11-06 16:30:26.037 DEBUG Response success
11-06 16:30:26.038 DEBUG resp for VTS_AGENT_COMMAND_EXECUTE_SHELL_COMMAND: response_code: SUCCESS
stdout: "/data/nativetest/vts_treble_vintf_vendor_test\n"
stderr: ""
exit_code: 0

11-06 16:30:26.042 DEBUG resp for VTS_AGENT_COMMAND_EXECUTE_SHELL_COMMAND: {'stderrs': [''], 'return_codes': [0], 'stdouts': ['/data/nativetest/vts_treble_vintf_vendor_test\n']}
11-06 16:30:26.043 DEBUG Creating test case from /data/nativetest/vts_treble_vintf_vendor_test with tag _32bit
11-06 16:30:26.043 DEBUG sending a command (type VTS_AGENT_COMMAND_EXECUTE_SHELL_COMMAND)
11-06 16:30:26.044 DEBUG command command_type: VTS_AGENT_COMMAND_EXECUTE_SHELL_COMMAND
shell_command: "chmod 755 /data/nativetest/vts_treble_vintf_vendor_test"
shell_command: "cd /data/nativetest/ && env LD_LIBRARY_PATH=/data/local/tmp/32/  /data/nativetest/vts_treble_vintf_vendor_test --gtest_list_tests"

11-06 16:30:26.044 DEBUG sending 196 bytes
11-06 16:30:26.242 DEBUG resp 489 bytes
11-06 16:30:26.286 DEBUG Response success
11-06 16:30:26.286 DEBUG resp for VTS_AGENT_COMMAND_EXECUTE_SHELL_COMMAND: response_code: SUCCESS
stdout: ""
stdout: "DeviceManifestTest.\n  ShippingFcmVersion\n  NoDeprecatedHalsOnManifest\n  GnssHalVersionCompatibility\nDeviceMatrixTest.\n  VndkVersion\nDeviceManifest/SingleManifestTest.\n  HalsAreBinderized/0  # GetParam() = device manifest\n  HalsAreServed/0  # GetParam() = device manifest\n  ServedHwbinderHalsAreInManifest/0  # GetParam() = device manifest\n  ServedPassthroughHalsAreInManifest/0  # GetParam() = device manifest\n  InterfacesAreReleased/0  # GetParam() = device manifest\n"
stderr: ""
stderr: ""
exit_code: 0
exit_code: 0

11-06 16:30:26.287 DEBUG resp for VTS_AGENT_COMMAND_EXECUTE_SHELL_COMMAND: {'stderrs': ['', ''], 'return_codes': [0, 0], 'stdouts': ['', 'DeviceManifestTest.\n  ShippingFcmVersion\n  NoDeprecatedHalsOnManifest\n  GnssHalVersionCompatibility\nDeviceMatrixTest.\n  VndkVersion\nDeviceManifest/SingleManifestTest.\n  HalsAreBinderized/0  # GetParam() = device manifest\n  HalsAreServed/0  # GetParam() = device manifest\n  ServedHwbinderHalsAreInManifest/0  # GetParam() = device manifest\n  ServedPassthroughHalsAreInManifest/0  # GetParam() = device manifest\n  InterfacesAreReleased/0  # GetParam() = device manifest\n']}
11-06 16:30:26.287 DEBUG Gtest test case: DeviceManifestTest.ShippingFcmVersion_32bit
11-06 16:30:26.288 DEBUG Gtest test case: DeviceManifestTest.NoDeprecatedHalsOnManifest_32bit
11-06 16:30:26.288 DEBUG Gtest test case: DeviceManifestTest.GnssHalVersionCompatibility_32bit
11-06 16:30:26.288 DEBUG Gtest test case: DeviceMatrixTest.VndkVersion_32bit
11-06 16:30:26.289 DEBUG Gtest test case: DeviceManifest/SingleManifestTest.HalsAreBinderized/0_32bit
11-06 16:30:26.289 DEBUG Gtest test case: DeviceManifest/SingleManifestTest.HalsAreServed/0_32bit
11-06 16:30:26.289 DEBUG Gtest test case: DeviceManifest/SingleManifestTest.ServedHwbinderHalsAreInManifest/0_32bit
11-06 16:30:26.289 DEBUG Gtest test case: DeviceManifest/SingleManifestTest.ServedPassthroughHalsAreInManifest/0_32bit
11-06 16:30:26.290 DEBUG Gtest test case: DeviceManifest/SingleManifestTest.InterfacesAreReleased/0_32bit
11-06 16:30:26.290 DEBUG sending a command (type VTS_AGENT_COMMAND_EXECUTE_SHELL_COMMAND)
11-06 16:30:26.290 DEBUG command command_type: VTS_AGENT_COMMAND_EXECUTE_SHELL_COMMAND
shell_command: "chmod 755 /data/nativetest/vts_treble_vintf_vendor_test"

11-06 16:30:26.291 DEBUG sending 62 bytes
11-06 16:30:26.353 DEBUG resp 11 bytes
11-06 16:30:26.397 DEBUG Response success
11-06 16:30:26.398 DEBUG resp for VTS_AGENT_COMMAND_EXECUTE_SHELL_COMMAND: response_code: SUCCESS
stdout: ""
stderr: ""
exit_code: 0

11-06 16:30:26.399 DEBUG resp for VTS_AGENT_COMMAND_EXECUTE_SHELL_COMMAND: {'stderrs': [''], 'return_codes': [0], 'stdouts': ['']}
11-06 16:30:26.399 DEBUG Executing generated test trigger function 'generateAllTests'
11-06 16:30:26.400 INFO [Test Case] 1/9 DeviceManifestTest.ShippingFcmVersion_32bit
11-06 16:30:26.401 INFO [Test Case] 1/8 DeviceManifestTest.NoDeprecatedHalsOnManifest_32bit
11-06 16:30:26.401 INFO [Test Case] 1/7 DeviceManifestTest.GnssHalVersionCompatibility_32bit
11-06 16:30:26.402 INFO [Test Case] 1/6 DeviceMatrixTest.VndkVersion_32bit
11-06 16:30:26.402 INFO [Test Case] 1/5 DeviceManifest/SingleManifestTest.HalsAreBinderized/0_32bit
11-06 16:30:26.403 INFO [Test Case] 1/4 DeviceManifest/SingleManifestTest.HalsAreServed/0_32bit
11-06 16:30:26.403 INFO [Test Case] 1/3 DeviceManifest/SingleManifestTest.ServedHwbinderHalsAreInManifest/0_32bit
11-06 16:30:26.403 INFO [Test Case] 1/2 DeviceManifest/SingleManifestTest.ServedPassthroughHalsAreInManifest/0_32bit
11-06 16:30:26.404 INFO [Test Case] 1/1 DeviceManifest/SingleManifestTest.InterfacesAreReleased/0_32bit
11-06 16:30:26.405 DEBUG Start standing subprocess with cmd: adb -s 0001201904000455 shell "getprop ro.build.version.sdk"
11-06 16:30:26.437 DEBUG cmd: adb -s 0001201904000455 shell "getprop ro.build.version.sdk", stdout: 29
, stderr: , ret: 0
11-06 16:30:26.439 DEBUG Executing binary test command: ['cd /data/nativetest/ && env LD_LIBRARY_PATH=/data/local/tmp/32/  /data/nativetest/vts_treble_vintf_vendor_test --gtest_filter=DeviceManifest/SingleManifestTest.InterfacesAreReleased/0 --gtest_output=xml:/data/nativetest/gtest_output_DeviceManifest_SingleManifestTest_InterfacesAreReleased_0_32bit.xml', 'cat /data/nativetest/gtest_output_DeviceManifest_SingleManifestTest_InterfacesAreReleased_0_32bit.xml && rm -rf /data/nativetest/gtest_output_DeviceManifest_SingleManifestTest_InterfacesAreReleased_0_32bit.xml']
11-06 16:30:26.439 DEBUG sending a command (type VTS_AGENT_COMMAND_EXECUTE_SHELL_COMMAND)
11-06 16:30:26.440 DEBUG command command_type: VTS_AGENT_COMMAND_EXECUTE_SHELL_COMMAND
shell_command: "cd /data/nativetest/ && env LD_LIBRARY_PATH=/data/local/tmp/32/  /data/nativetest/vts_treble_vintf_vendor_test --gtest_filter=DeviceManifest/SingleManifestTest.InterfacesAreReleased/0 --gtest_output=xml:/data/nativetest/gtest_output_DeviceManifest_SingleManifestTest_InterfacesAreReleased_0_32bit.xml"
shell_command: "cat /data/nativetest/gtest_output_DeviceManifest_SingleManifestTest_InterfacesAreReleased_0_32bit.xml && rm -rf /data/nativetest/gtest_output_DeviceManifest_SingleManifestTest_InterfacesAreReleased_0_32bit.xml"

11-06 16:30:26.440 DEBUG sending 522 bytes
11-06 16:30:26.921 DEBUG resp 11688 bytes
11-06 16:30:26.922 DEBUG Response success
11-06 16:30:26.923 DEBUG resp for VTS_AGENT_COMMAND_EXECUTE_SHELL_COMMAND: response_code: SUCCESS
stdout: "Note: Google Test filter = DeviceManifest/SingleManifestTest.InterfacesAreReleased/0\n[==========] Running 1 test from 1 test suite.\n[----------] Global test environment set-up.\n[----------] 1 test from DeviceManifest/SingleManifestTest\n[ RUN      ] DeviceManifest/SingleManifestTest.InterfacesAreReleased/0\nGetting: android.hardware.atrace@1.0::IAtraceDevice/default\nGetting: android.hardware.audio@5.0::IDevicesFactory/default\nGetting: android.hardware.audio@5.0::IDevicesFactory/default\nGetting: android.hardware.audio.effect@5.0::IEffectsFactory/default\nGetting: android.hardware.audio.effect@5.0::IEffectsFactory/default\nGetting: android.hardware.bluetooth@1.0::IBluetoothHci/default\nGetting: android.hardware.bluetooth@1.0::IBluetoothHci/default\nGetting: android.hardware.bluetooth.audio@2.0::IBluetoothAudioProvidersFactory/default\nGetting: android.hardware.bluetooth.audio@2.0::IBluetoothAudioProvidersFactory/default\nGetting: android.hardware.camera.provider@2.5::ICameraProvider/legacy/0\nGetting: android.hardware.camera.provider@2.5::ICameraProvider/legacy/0\nGetting: android.hardware.cas@1.1::IMediaCasService/default\nGetting: android.hardware.configstore@1.1::ISurfaceFlingerConfigs/default\nGetting: android.hardware.configstore@1.1::ISurfaceFlingerConfigs/default\nGetting: android.hardware.drm@1.0::ICryptoFactory/default\nGetting: android.hardware.drm@1.0::ICryptoFactory/widevine\nGetting: android.hardware.drm@1.0::IDrmFactory/default\nGetting: android.hardware.drm@1.0::IDrmFactory/widevine\nGetting: android.hardware.drm@1.0::ICryptoFactory/default\nGetting: android.hardware.drm@1.0::IDrmFactory/default\nGetting: android.hardware.drm@1.2::ICryptoFactory/clearkey\nGetting: android.hardware.drm@1.2::ICryptoFactory/widevine\nGetting: android.hardware.drm@1.2::IDrmFactory/clearkey\nGetting: android.hardware.drm@1.2::IDrmFactory/widevine\nGetting: android.hardware.gatekeeper@1.0::IGatekeeper/default\nGetting: android.hardware.gatekeeper@1.0::IGatekeeper/default\nGetting: android.hardware.graphics.allocator@3.0::IAllocator/default\nGetting: android.hardware.graphics.allocator@3.0::IAllocator/default\nGetting: android.hardware.graphics.composer@2.3::IComposer/default\nGetting: android.hardware.graphics.mapper@3.0::IMapper/default\nGetting: android.hardware.graphics.mapper@3.0::IMapper/default\nGetting: android.hardware.health@2.0::IHealth/default\nGetting: android.hardware.health@2.0::IHealth/default\nGetting: android.hardware.ir@1.0::IConsumerIr/default\nGetting: android.hardware.ir@1.0::IConsumerIr/default\nGetting: android.hardware.keymaster@4.0::IKeymasterDevice/default\nGetting: android.hardware.keymaster@4.0::IKeymasterDevice/default\nGetting: android.hardware.light@2.0::ILight/default\nGetting: android.hardware.light@2.0::ILight/default\nGetting: android.hardware.media.omx@1.0::IOmx/default\nGetting: android.hardware.media.omx@1.0::IOmxStore/default\nGetting: android.hardware.media.omx@1.0::IOmx/default\nGetting: android.hardware.media.omx@1.0::IOmxStore/default\nGetting: android.hardware.memtrack@1.0::IMemtrack/default\nGetting: android.hardware.memtrack@1.0::IMemtrack/default\nGetting: android.hardware.power@1.0::IPower/default\nGetting: android.hardware.power@1.0::IPower/default\nGetting: android.hardware.power.stats@1.0::IPowerStats/default\nGetting: android.hardware.soundtrigger@2.2::ISoundTriggerHw/default\nGetting: android.hardware.soundtrigger@2.2::ISoundTriggerHw/default\nGetting: android.hardware.thermal@1.0::IThermal/default\nGetting: android.hardware.thermal@2.0::IThermal/default\nGetting: android.hardware.tv.cec@1.0::IHdmiCec/default\nGetting: android.hardware.tv.cec@1.0::IHdmiCec/default\nGetting: android.hardware.usb@1.0::IUsb/default\nGetting: android.hardware.usb@1.0::IUsb/default\nGetting: android.hardware.wifi@1.3::IWifi/default\nGetting: android.hardware.wifi@1.3::IWifi/default\nGetting: com.skb.btvpropertyservice@1.0::IBtvPropertyService/default\ntest/vts-testcase/hal/treble/vintf/SingleManifestTest.cpp:63: Failure\nFailed\ncom.skb.btvpropertyservice@1.0::IBtvPropertyService has an empty hash. This is because it was compiled without being frozen in a corresponding current.txt file.\nGetting: com.skb.btvpropertyservice@1.0::IBtvPropertyService/default\ntest/vts-testcase/hal/treble/vintf/SingleManifestTest.cpp:63: Failure\nFailed\ncom.skb.btvpropertyservice@1.0::IBtvPropertyService has an empty hash. This is because it was compiled without being frozen in a corresponding current.txt file.\nGetting: com.skb.btvservice@1.0::IBtvMediaPlayer/btv_main\ntest/vts-testcase/hal/treble/vintf/SingleManifestTest.cpp:63: Failure\nFailed\ncom.skb.btvservice@1.0::IBtvMediaPlayer has an empty hash. This is because it was compiled without being frozen in a corresponding current.txt file.\nGetting: com.skb.btvservice@1.0::IBtvMediaPlayer/btv_pip\ntest/vts-testcase/hal/treble/vintf/SingleManifestTest.cpp:63: Failure\nFailed\ncom.skb.btvservice@1.0::IBtvMediaPlayer has an empty hash. This is because it was compiled without being frozen in a corresponding current.txt file.\nGetting: com.skb.btvservice@1.0::ITVService/default\ntest/vts-testcase/hal/treble/vintf/SingleManifestTest.cpp:63: Failure\nFailed\ncom.skb.btvservice@1.0::ITVService has an empty hash. This is because it was compiled without being frozen in a corresponding current.txt file.\nGetting: com.skb.btvservice@1.0::IBtvMediaPlayer/btv_main\ntest/vts-testcase/hal/treble/vintf/SingleManifestTest.cpp:63: Failure\nFailed\ncom.skb.btvservice@1.0::IBtvMediaPlayer has an empty hash. This is because it was compiled without being frozen in a corresponding current.txt file.\nGetting: com.skb.btvservice@1.0::IBtvMediaPlayer/btv_pip\ntest/vts-testcase/hal/treble/vintf/SingleManifestTest.cpp:63: Failure\nFailed\ncom.skb.btvservice@1.0::IBtvMediaPlayer has an empty hash. This is because it was compiled without being frozen in a corresponding current.txt file.\nGetting: com.skb.btvservice@1.0::ITVService/default\ntest/vts-testcase/hal/treble/vintf/SingleManifestTest.cpp:63: Failure\nFailed\ncom.skb.btvservice@1.0::ITVService has an empty hash. This is because it was compiled without being frozen in a corresponding current.txt file.\nGetting: vendor.amlogic.hardware.hdmicec@1.0::IDroidHdmiCEC/default\nGetting: vendor.amlogic.hardware.hdmicec@1.0::IDroidHdmiCEC/default\nGetting: vendor.amlogic.hardware.remotecontrol@1.0::IRemoteControl/default\nGetting: vendor.amlogic.hardware.remotecontrol@1.0::IRemoteControl/default\nGetting: vendor.amlogic.hardware.subtitleserver@1.0::ISubtitleServer/default\nGetting: vendor.amlogic.hardware.subtitleserver@1.0::ISubtitleServer/default\nGetting: vendor.amlogic.hardware.systemcontrol@1.1::ISystemControl/default\nGetting: vendor.amlogic.hardware.systemcontrol@1.1::ISystemControl/default\n[  FAILED  ] DeviceManifest/SingleManifestTest.InterfacesAreReleased/0, where GetParam() = device manifest (298 ms)\n[----------] 1 test from DeviceManifest/SingleManifestTest (298 ms total)\n\n[----------] Global test environment tear-down\n[==========] 1 test from 1 test suite ran. (298 ms total)\n[  PASSED  ] 0 tests.\n[  FAILED  ] 1 test, listed below:\n[  FAILED  ] DeviceManifest/SingleManifestTest.InterfacesAreReleased/0, where GetParam() = device manifest\n\n 1 FAILED TEST\n"
stdout: "<?xml version=\"1.0\" encoding=\"UTF-8\"?>\n<testsuites tests=\"1\" failures=\"1\" disabled=\"0\" errors=\"0\" timestamp=\"2020-11-06T08:30:26\" time=\"0.298\" name=\"AllTests\">\n  <testsuite name=\"DeviceManifest/SingleManifestTest\" tests=\"1\" failures=\"1\" disabled=\"0\" errors=\"0\" time=\"0.298\">\n    <testcase name=\"InterfacesAreReleased/0\" value_param=\"device manifest\" status=\"run\" time=\"0.298\" classname=\"DeviceManifest/SingleManifestTest\">\n      <failure message=\"test/vts-testcase/hal/treble/vintf/SingleManifestTest.cpp:63&#x0A;Failed&#x0A;com.skb.btvpropertyservice@1.0::IBtvPropertyService has an empty hash. This is because it was compiled without being frozen in a corresponding current.txt file.\" type=\"\"><![CDATA[test/vts-testcase/hal/treble/vintf/SingleManifestTest.cpp:63\nFailed\ncom.skb.btvpropertyservice@1.0::IBtvPropertyService has an empty hash. This is because it was compiled without being frozen in a corresponding current.txt file.]]></failure>\n      <failure message=\"test/vts-testcase/hal/treble/vintf/SingleManifestTest.cpp:63&#x0A;Failed&#x0A;com.skb.btvpropertyservice@1.0::IBtvPropertyService has an empty hash. This is because it was compiled without being frozen in a corresponding current.txt file.\" type=\"\"><![CDATA[test/vts-testcase/hal/treble/vintf/SingleManifestTest.cpp:63\nFailed\ncom.skb.btvpropertyservice@1.0::IBtvPropertyService has an empty hash. This is because it was compiled without being frozen in a corresponding current.txt file.]]></failure>\n      <failure message=\"test/vts-testcase/hal/treble/vintf/SingleManifestTest.cpp:63&#x0A;Failed&#x0A;com.skb.btvservice@1.0::IBtvMediaPlayer has an empty hash. This is because it was compiled without being frozen in a corresponding current.txt file.\" type=\"\"><![CDATA[test/vts-testcase/hal/treble/vintf/SingleManifestTest.cpp:63\nFailed\ncom.skb.btvservice@1.0::IBtvMediaPlayer has an empty hash. This is because it was compiled without being frozen in a corresponding current.txt file.]]></failure>\n      <failure message=\"test/vts-testcase/hal/treble/vintf/SingleManifestTest.cpp:63&#x0A;Failed&#x0A;com.skb.btvservice@1.0::IBtvMediaPlayer has an empty hash. This is because it was compiled without being frozen in a corresponding current.txt file.\" type=\"\"><![CDATA[test/vts-testcase/hal/treble/vintf/SingleManifestTest.cpp:63\nFailed\ncom.skb.btvservice@1.0::IBtvMediaPlayer has an empty hash. This is because it was compiled without being frozen in a corresponding current.txt file.]]></failure>\n      <failure message=\"test/vts-testcase/hal/treble/vintf/SingleManifestTest.cpp:63&#x0A;Failed&#x0A;com.skb.btvservice@1.0::ITVService has an empty hash. This is because it was compiled without being frozen in a corresponding current.txt file.\" type=\"\"><![CDATA[test/vts-testcase/hal/treble/vintf/SingleManifestTest.cpp:63\nFailed\ncom.skb.btvservice@1.0::ITVService has an empty hash. This is because it was compiled without being frozen in a corresponding current.txt file.]]></failure>\n      <failure message=\"test/vts-testcase/hal/treble/vintf/SingleManifestTest.cpp:63&#x0A;Failed&#x0A;com.skb.btvservice@1.0::IBtvMediaPlayer has an empty hash. This is because it was compiled without being frozen in a corresponding current.txt file.\" type=\"\"><![CDATA[test/vts-testcase/hal/treble/vintf/SingleManifestTest.cpp:63\nFailed\ncom.skb.btvservice@1.0::IBtvMediaPlayer has an empty hash. This is because it was compiled without being frozen in a corresponding current.txt file.]]></failure>\n      <failure message=\"test/vts-testcase/hal/treble/vintf/SingleManifestTest.cpp:63&#x0A;Failed&#x0A;com.skb.btvservice@1.0::IBtvMediaPlayer has an empty hash. This is because it was compiled without being frozen in a corresponding current.txt file.\" type=\"\"><![CDATA[test/vts-testcase/hal/treble/vintf/SingleManifestTest.cpp:63\nFailed\ncom.skb.btvservice@1.0::IBtvMediaPlayer has an empty hash. This is because it was compiled without being frozen in a corresponding current.txt file.]]></failure>\n      <failure message=\"test/vts-testcase/hal/treble/vintf/SingleManifestTest.cpp:63&#x0A;Failed&#x0A;com.skb.btvservice@1.0::ITVService has an empty hash. This is because it was compiled without being frozen in a corresponding current.txt file.\" type=\"\"><![CDATA[test/vts-testcase/hal/treble/vintf/SingleManifestTest.cpp:63\nFailed\ncom.skb.btvservice@1.0::ITVService has an empty hash. This is because it was compiled without being frozen in a corresponding current.txt file.]]></failure>\n    </testcase>\n  </testsuite>\n</testsuites>\n"
stderr: ""
stderr: ""
exit_code: 1
exit_code: 0

11-06 16:30:26.924 DEBUG resp for VTS_AGENT_COMMAND_EXECUTE_SHELL_COMMAND: {'stderrs': ['', ''], 'return_codes': [1, 0], 'stdouts': ['Note: Google Test filter = DeviceManifest/SingleManifestTest.InterfacesAreReleased/0\n[==========] Running 1 test from 1 test suite.\n[----------] Global test environment set-up.\n[----------] 1 test from DeviceManifest/SingleManifestTest\n[ RUN      ] DeviceManifest/SingleManifestTest.InterfacesAreReleased/0\nGetting: android.hardware.atrace@1.0::IAtraceDevice/default\nGetting: android.hardware.audio@5.0::IDevicesFactory/default\nGetting: android.hardware.audio@5.0::IDevicesFactory/default\nGetting: android.hardware.audio.effect@5.0::IEffectsFactory/default\nGetting: android.hardware.audio.effect@5.0::IEffectsFactory/default\nGetting: android.hardware.bluetooth@1.0::IBluetoothHci/default\nGetting: android.hardware.bluetooth@1.0::IBluetoothHci/default\nGetting: android.hardware.bluetooth.audio@2.0::IBluetoothAudioProvidersFactory/default\nGetting: android.hardware.bluetooth.audio@2.0::IBluetoothAudioProvidersFactory/default\nGetting: android.hardware.camera.provider@2.5::ICameraProvider/legacy/0\nGetting: android.hardware.camera.provider@2.5::ICameraProvider/legacy/0\nGetting: android.hardware.cas@1.1::IMediaCasService/default\nGetting: android.hardware.configstore@1.1::ISurfaceFlingerConfigs/default\nGetting: android.hardware.configstore@1.1::ISurfaceFlingerConfigs/default\nGetting: android.hardware.drm@1.0::ICryptoFactory/default\nGetting: android.hardware.drm@1.0::ICryptoFactory/widevine\nGetting: android.hardware.drm@1.0::IDrmFactory/default\nGetting: android.hardware.drm@1.0::IDrmFactory/widevine\nGetting: android.hardware.drm@1.0::ICryptoFactory/default\nGetting: android.hardware.drm@1.0::IDrmFactory/default\nGetting: android.hardware.drm@1.2::ICryptoFactory/clearkey\nGetting: android.hardware.drm@1.2::ICryptoFactory/widevine\nGetting: android.hardware.drm@1.2::IDrmFactory/clearkey\nGetting: android.hardware.drm@1.2::IDrmFactory/widevine\nGetting: android.hardware.gatekeeper@1.0::IGatekeeper/default\nGetting: android.hardware.gatekeeper@1.0::IGatekeeper/default\nGetting: android.hardware.graphics.allocator@3.0::IAllocator/default\nGetting: android.hardware.graphics.allocator@3.0::IAllocator/default\nGetting: android.hardware.graphics.composer@2.3::IComposer/default\nGetting: android.hardware.graphics.mapper@3.0::IMapper/default\nGetting: android.hardware.graphics.mapper@3.0::IMapper/default\nGetting: android.hardware.health@2.0::IHealth/default\nGetting: android.hardware.health@2.0::IHealth/default\nGetting: android.hardware.ir@1.0::IConsumerIr/default\nGetting: android.hardware.ir@1.0::IConsumerIr/default\nGetting: android.hardware.keymaster@4.0::IKeymasterDevice/default\nGetting: android.hardware.keymaster@4.0::IKeymasterDevice/default\nGetting: android.hardware.light@2.0::ILight/default\nGetting: android.hardware.light@2.0::ILight/default\nGetting: android.hardware.media.omx@1.0::IOmx/default\nGetting: android.hardware.media.omx@1.0::IOmxStore/default\nGetting: android.hardware.media.omx@1.0::IOmx/default\nGetting: android.hardware.media.omx@1.0::IOmxStore/default\nGetting: android.hardware.memtrack@1.0::IMemtrack/default\nGetting: android.hardware.memtrack@1.0::IMemtrack/default\nGetting: android.hardware.power@1.0::IPower/default\nGetting: android.hardware.power@1.0::IPower/default\nGetting: android.hardware.power.stats@1.0::IPowerStats/default\nGetting: android.hardware.soundtrigger@2.2::ISoundTriggerHw/default\nGetting: android.hardware.soundtrigger@2.2::ISoundTriggerHw/default\nGetting: android.hardware.thermal@1.0::IThermal/default\nGetting: android.hardware.thermal@2.0::IThermal/default\nGetting: android.hardware.tv.cec@1.0::IHdmiCec/default\nGetting: android.hardware.tv.cec@1.0::IHdmiCec/default\nGetting: android.hardware.usb@1.0::IUsb/default\nGetting: android.hardware.usb@1.0::IUsb/default\nGetting: android.hardware.wifi@1.3::IWifi/default\nGetting: android.hardware.wifi@1.3::IWifi/default\nGetting: com.skb.btvpropertyservice@1.0::IBtvPropertyService/default\ntest/vts-testcase/hal/treble/vintf/SingleManifestTest.cpp:63: Failure\nFailed\ncom.skb.btvpropertyservice@1.0::IBtvPropertyService has an empty hash. This is because it was compiled without being frozen in a corresponding current.txt file.\nGetting: com.skb.btvpropertyservice@1.0::IBtvPropertyService/default\ntest/vts-testcase/hal/treble/vintf/SingleManifestTest.cpp:63: Failure\nFailed\ncom.skb.btvpropertyservice@1.0::IBtvPropertyService has an empty hash. This is because it was compiled without being frozen in a corresponding current.txt file.\nGetting: com.skb.btvservice@1.0::IBtvMediaPlayer/btv_main\ntest/vts-testcase/hal/treble/vintf/SingleManifestTest.cpp:63: Failure\nFailed\ncom.skb.btvservice@1.0::IBtvMediaPlayer has an empty hash. This is because it was compiled without being frozen in a corresponding current.txt file.\nGetting: com.skb.btvservice@1.0::IBtvMediaPlayer/btv_pip\ntest/vts-testcase/hal/treble/vintf/SingleManifestTest.cpp:63: Failure\nFailed\ncom.skb.btvservice@1.0::IBtvMediaPlayer has an empty hash. This is because it was compiled without being frozen in a corresponding current.txt file.\nGetting: com.skb.btvservice@1.0::ITVService/default\ntest/vts-testcase/hal/treble/vintf/SingleManifestTest.cpp:63: Failure\nFailed\ncom.skb.btvservice@1.0::ITVService has an empty hash. This is because it was compiled without being frozen in a corresponding current.txt file.\nGetting: com.skb.btvservice@1.0::IBtvMediaPlayer/btv_main\ntest/vts-testcase/hal/treble/vintf/SingleManifestTest.cpp:63: Failure\nFailed\ncom.skb.btvservice@1.0::IBtvMediaPlayer has an empty hash. This is because it was compiled without being frozen in a corresponding current.txt file.\nGetting: com.skb.btvservice@1.0::IBtvMediaPlayer/btv_pip\ntest/vts-testcase/hal/treble/vintf/SingleManifestTest.cpp:63: Failure\nFailed\ncom.skb.btvservice@1.0::IBtvMediaPlayer has an empty hash. This is because it was compiled without being frozen in a corresponding current.txt file.\nGetting: com.skb.btvservice@1.0::ITVService/default\ntest/vts-testcase/hal/treble/vintf/SingleManifestTest.cpp:63: Failure\nFailed\ncom.skb.btvservice@1.0::ITVService has an empty hash. This is because it was compiled without being frozen in a corresponding current.txt file.\nGetting: vendor.amlogic.hardware.hdmicec@1.0::IDroidHdmiCEC/default\nGetting: vendor.amlogic.hardware.hdmicec@1.0::IDroidHdmiCEC/default\nGetting: vendor.amlogic.hardware.remotecontrol@1.0::IRemoteControl/default\nGetting: vendor.amlogic.hardware.remotecontrol@1.0::IRemoteControl/default\nGetting: vendor.amlogic.hardware.subtitleserver@1.0::ISubtitleServer/default\nGetting: vendor.amlogic.hardware.subtitleserver@1.0::ISubtitleServer/default\nGetting: vendor.amlogic.hardware.systemcontrol@1.1::ISystemControl/default\nGetting: vendor.amlogic.hardware.systemcontrol@1.1::ISystemControl/default\n[  FAILED  ] DeviceManifest/SingleManifestTest.InterfacesAreReleased/0, where GetParam() = device manifest (298 ms)\n[----------] 1 test from DeviceManifest/SingleManifestTest (298 ms total)\n\n[----------] Global test environment tear-down\n[==========] 1 test from 1 test suite ran. (298 ms total)\n[  PASSED  ] 0 tests.\n[  FAILED  ] 1 test, listed below:\n[  FAILED  ] DeviceManifest/SingleManifestTest.InterfacesAreReleased/0, where GetParam() = device manifest\n\n 1 FAILED TEST\n', '<?xml version="1.0" encoding="UTF-8"?>\n<testsuites tests="1" failures="1" disabled="0" errors="0" timestamp="2020-11-06T08:30:26" time="0.298" name="AllTests">\n  <testsuite name="DeviceManifest/SingleManifestTest" tests="1" failures="1" disabled="0" errors="0" time="0.298">\n    <testcase name="InterfacesAreReleased/0" value_param="device manifest" status="run" time="0.298" classname="DeviceManifest/SingleManifestTest">\n      <failure message="test/vts-testcase/hal/treble/vintf/SingleManifestTest.cpp:63&#x0A;Failed&#x0A;com.skb.btvpropertyservice@1.0::IBtvPropertyService has an empty hash. This is because it was compiled without being frozen in a corresponding current.txt file." type=""><![CDATA[test/vts-testcase/hal/treble/vintf/SingleManifestTest.cpp:63\nFailed\ncom.skb.btvpropertyservice@1.0::IBtvPropertyService has an empty hash. This is because it was compiled without being frozen in a corresponding current.txt file.]]></failure>\n      <failure message="test/vts-testcase/hal/treble/vintf/SingleManifestTest.cpp:63&#x0A;Failed&#x0A;com.skb.btvpropertyservice@1.0::IBtvPropertyService has an empty hash. This is because it was compiled without being frozen in a corresponding current.txt file." type=""><![CDATA[test/vts-testcase/hal/treble/vintf/SingleManifestTest.cpp:63\nFailed\ncom.skb.btvpropertyservice@1.0::IBtvPropertyService has an empty hash. This is because it was compiled without being frozen in a corresponding current.txt file.]]></failure>\n      <failure message="test/vts-testcase/hal/treble/vintf/SingleManifestTest.cpp:63&#x0A;Failed&#x0A;com.skb.btvservice@1.0::IBtvMediaPlayer has an empty hash. This is because it was compiled without being frozen in a corresponding current.txt file." type=""><![CDATA[test/vts-testcase/hal/treble/vintf/SingleManifestTest.cpp:63\nFailed\ncom.skb.btvservice@1.0::IBtvMediaPlayer has an empty hash. This is because it was compiled without being frozen in a corresponding current.txt file.]]></failure>\n      <failure message="test/vts-testcase/hal/treble/vintf/SingleManifestTest.cpp:63&#x0A;Failed&#x0A;com.skb.btvservice@1.0::IBtvMediaPlayer has an empty hash. This is because it was compiled without being frozen in a corresponding current.txt file." type=""><![CDATA[test/vts-testcase/hal/treble/vintf/SingleManifestTest.cpp:63\nFailed\ncom.skb.btvservice@1.0::IBtvMediaPlayer has an empty hash. This is because it was compiled without being frozen in a corresponding current.txt file.]]></failure>\n      <failure message="test/vts-testcase/hal/treble/vintf/SingleManifestTest.cpp:63&#x0A;Failed&#x0A;com.skb.btvservice@1.0::ITVService has an empty hash. This is because it was compiled without being frozen in a corresponding current.txt file." type=""><![CDATA[test/vts-testcase/hal/treble/vintf/SingleManifestTest.cpp:63\nFailed\ncom.skb.btvservice@1.0::ITVService has an empty hash. This is because it was compiled without being frozen in a corresponding current.txt file.]]></failure>\n      <failure message="test/vts-testcase/hal/treble/vintf/SingleManifestTest.cpp:63&#x0A;Failed&#x0A;com.skb.btvservice@1.0::IBtvMediaPlayer has an empty hash. This is because it was compiled without being frozen in a corresponding current.txt file." type=""><![CDATA[test/vts-testcase/hal/treble/vintf/SingleManifestTest.cpp:63\nFailed\ncom.skb.btvservice@1.0::IBtvMediaPlayer has an empty hash. This is because it was compiled without being frozen in a corresponding current.txt file.]]></failure>\n      <failure message="test/vts-testcase/hal/treble/vintf/SingleManifestTest.cpp:63&#x0A;Failed&#x0A;com.skb.btvservice@1.0::IBtvMediaPlayer has an empty hash. This is because it was compiled without being frozen in a corresponding current.txt file." type=""><![CDATA[test/vts-testcase/hal/treble/vintf/SingleManifestTest.cpp:63\nFailed\ncom.skb.btvservice@1.0::IBtvMediaPlayer has an empty hash. This is because it was compiled without being frozen in a corresponding current.txt file.]]></failure>\n      <failure message="test/vts-testcase/hal/treble/vintf/SingleManifestTest.cpp:63&#x0A;Failed&#x0A;com.skb.btvservice@1.0::ITVService has an empty hash. This is because it was compiled without being frozen in a corresponding current.txt file." type=""><![CDATA[test/vts-testcase/hal/treble/vintf/SingleManifestTest.cpp:63\nFailed\ncom.skb.btvservice@1.0::ITVService has an empty hash. This is because it was compiled without being frozen in a corresponding current.txt file.]]></failure>\n    </testcase>\n  </testsuite>\n</testsuites>\n']}
11-06 16:30:26.929 ERROR Note: Google Test filter = DeviceManifest/SingleManifestTest.InterfacesAreReleased/0
11-06 16:30:26.929 ERROR [==========] Running 1 test from 1 test suite.
11-06 16:30:26.929 ERROR [----------] Global test environment set-up.
11-06 16:30:26.930 ERROR [----------] 1 test from DeviceManifest/SingleManifestTest
11-06 16:30:26.930 ERROR [ RUN      ] DeviceManifest/SingleManifestTest.InterfacesAreReleased/0
11-06 16:30:26.930 ERROR Getting: android.hardware.atrace@1.0::IAtraceDevice/default
11-06 16:30:26.930 ERROR Getting: android.hardware.audio@5.0::IDevicesFactory/default
11-06 16:30:26.931 ERROR Getting: android.hardware.audio@5.0::IDevicesFactory/default
11-06 16:30:26.931 ERROR Getting: android.hardware.audio.effect@5.0::IEffectsFactory/default
11-06 16:30:26.931 ERROR Getting: android.hardware.audio.effect@5.0::IEffectsFactory/default
11-06 16:30:26.932 ERROR Getting: android.hardware.bluetooth@1.0::IBluetoothHci/default
11-06 16:30:26.932 ERROR Getting: android.hardware.bluetooth@1.0::IBluetoothHci/default
11-06 16:30:26.932 ERROR Getting: android.hardware.bluetooth.audio@2.0::IBluetoothAudioProvidersFactory/default
11-06 16:30:26.932 ERROR Getting: android.hardware.bluetooth.audio@2.0::IBluetoothAudioProvidersFactory/default
11-06 16:30:26.933 ERROR Getting: android.hardware.camera.provider@2.5::ICameraProvider/legacy/0
11-06 16:30:26.933 ERROR Getting: android.hardware.camera.provider@2.5::ICameraProvider/legacy/0
11-06 16:30:26.933 ERROR Getting: android.hardware.cas@1.1::IMediaCasService/default
11-06 16:30:26.933 ERROR Getting: android.hardware.configstore@1.1::ISurfaceFlingerConfigs/default
11-06 16:30:26.934 ERROR Getting: android.hardware.configstore@1.1::ISurfaceFlingerConfigs/default
11-06 16:30:26.934 ERROR Getting: android.hardware.drm@1.0::ICryptoFactory/default
11-06 16:30:26.934 ERROR Getting: android.hardware.drm@1.0::ICryptoFactory/widevine
11-06 16:30:26.934 ERROR Getting: android.hardware.drm@1.0::IDrmFactory/default
11-06 16:30:26.935 ERROR Getting: android.hardware.drm@1.0::IDrmFactory/widevine
11-06 16:30:26.935 ERROR Getting: android.hardware.drm@1.0::ICryptoFactory/default
11-06 16:30:26.935 ERROR Getting: android.hardware.drm@1.0::IDrmFactory/default
11-06 16:30:26.936 ERROR Getting: android.hardware.drm@1.2::ICryptoFactory/clearkey
11-06 16:30:26.936 ERROR Getting: android.hardware.drm@1.2::ICryptoFactory/widevine
11-06 16:30:26.936 ERROR Getting: android.hardware.drm@1.2::IDrmFactory/clearkey
11-06 16:30:26.936 ERROR Getting: android.hardware.drm@1.2::IDrmFactory/widevine
11-06 16:30:26.937 ERROR Getting: android.hardware.gatekeeper@1.0::IGatekeeper/default
11-06 16:30:26.937 ERROR Getting: android.hardware.gatekeeper@1.0::IGatekeeper/default
11-06 16:30:26.937 ERROR Getting: android.hardware.graphics.allocator@3.0::IAllocator/default
11-06 16:30:26.937 ERROR Getting: android.hardware.graphics.allocator@3.0::IAllocator/default
11-06 16:30:26.938 ERROR Getting: android.hardware.graphics.composer@2.3::IComposer/default
11-06 16:30:26.938 ERROR Getting: android.hardware.graphics.mapper@3.0::IMapper/default
11-06 16:30:26.938 ERROR Getting: android.hardware.graphics.mapper@3.0::IMapper/default
11-06 16:30:26.938 ERROR Getting: android.hardware.health@2.0::IHealth/default
11-06 16:30:26.939 ERROR Getting: android.hardware.health@2.0::IHealth/default
11-06 16:30:26.939 ERROR Getting: android.hardware.ir@1.0::IConsumerIr/default
11-06 16:30:26.939 ERROR Getting: android.hardware.ir@1.0::IConsumerIr/default
11-06 16:30:26.939 ERROR Getting: android.hardware.keymaster@4.0::IKeymasterDevice/default
11-06 16:30:26.940 ERROR Getting: android.hardware.keymaster@4.0::IKeymasterDevice/default
11-06 16:30:26.940 ERROR Getting: android.hardware.light@2.0::ILight/default
11-06 16:30:26.940 ERROR Getting: android.hardware.light@2.0::ILight/default
11-06 16:30:26.941 ERROR Getting: android.hardware.media.omx@1.0::IOmx/default
11-06 16:30:26.941 ERROR Getting: android.hardware.media.omx@1.0::IOmxStore/default
11-06 16:30:26.941 ERROR Getting: android.hardware.media.omx@1.0::IOmx/default
11-06 16:30:26.941 ERROR Getting: android.hardware.media.omx@1.0::IOmxStore/default
11-06 16:30:26.942 ERROR Getting: android.hardware.memtrack@1.0::IMemtrack/default
11-06 16:30:26.942 ERROR Getting: android.hardware.memtrack@1.0::IMemtrack/default
11-06 16:30:26.942 ERROR Getting: android.hardware.power@1.0::IPower/default
11-06 16:30:26.942 ERROR Getting: android.hardware.power@1.0::IPower/default
11-06 16:30:26.943 ERROR Getting: android.hardware.power.stats@1.0::IPowerStats/default
11-06 16:30:26.943 ERROR Getting: android.hardware.soundtrigger@2.2::ISoundTriggerHw/default
11-06 16:30:26.943 ERROR Getting: android.hardware.soundtrigger@2.2::ISoundTriggerHw/default
11-06 16:30:26.943 ERROR Getting: android.hardware.thermal@1.0::IThermal/default
11-06 16:30:26.944 ERROR Getting: android.hardware.thermal@2.0::IThermal/default
11-06 16:30:26.944 ERROR Getting: android.hardware.tv.cec@1.0::IHdmiCec/default
11-06 16:30:26.944 ERROR Getting: android.hardware.tv.cec@1.0::IHdmiCec/default
11-06 16:30:26.945 ERROR Getting: android.hardware.usb@1.0::IUsb/default
11-06 16:30:26.945 ERROR Getting: android.hardware.usb@1.0::IUsb/default
11-06 16:30:26.945 ERROR Getting: android.hardware.wifi@1.3::IWifi/default
11-06 16:30:26.945 ERROR Getting: android.hardware.wifi@1.3::IWifi/default
11-06 16:30:26.946 ERROR Getting: com.skb.btvpropertyservice@1.0::IBtvPropertyService/default
11-06 16:30:26.946 ERROR test/vts-testcase/hal/treble/vintf/SingleManifestTest.cpp:63: Failure
11-06 16:30:26.946 ERROR Failed
11-06 16:30:26.946 ERROR com.skb.btvpropertyservice@1.0::IBtvPropertyService has an empty hash. This is because it was compiled without being frozen in a corresponding current.txt file.
11-06 16:30:26.947 ERROR Getting: com.skb.btvpropertyservice@1.0::IBtvPropertyService/default
11-06 16:30:26.947 ERROR test/vts-testcase/hal/treble/vintf/SingleManifestTest.cpp:63: Failure
11-06 16:30:26.947 ERROR Failed
11-06 16:30:26.947 ERROR com.skb.btvpropertyservice@1.0::IBtvPropertyService has an empty hash. This is because it was compiled without being frozen in a corresponding current.txt file.
11-06 16:30:26.948 ERROR Getting: com.skb.btvservice@1.0::IBtvMediaPlayer/btv_main
11-06 16:30:26.948 ERROR test/vts-testcase/hal/treble/vintf/SingleManifestTest.cpp:63: Failure
11-06 16:30:26.948 ERROR Failed
11-06 16:30:26.948 ERROR com.skb.btvservice@1.0::IBtvMediaPlayer has an empty hash. This is because it was compiled without being frozen in a corresponding current.txt file.
11-06 16:30:26.949 ERROR Getting: com.skb.btvservice@1.0::IBtvMediaPlayer/btv_pip
11-06 16:30:26.949 ERROR test/vts-testcase/hal/treble/vintf/SingleManifestTest.cpp:63: Failure
11-06 16:30:26.949 ERROR Failed
11-06 16:30:26.950 ERROR com.skb.btvservice@1.0::IBtvMediaPlayer has an empty hash. This is because it was compiled without being frozen in a corresponding current.txt file.
11-06 16:30:26.950 ERROR Getting: com.skb.btvservice@1.0::ITVService/default
11-06 16:30:26.950 ERROR test/vts-testcase/hal/treble/vintf/SingleManifestTest.cpp:63: Failure
11-06 16:30:26.950 ERROR Failed
11-06 16:30:26.951 ERROR com.skb.btvservice@1.0::ITVService has an empty hash. This is because it was compiled without being frozen in a corresponding current.txt file.
11-06 16:30:26.951 ERROR Getting: com.skb.btvservice@1.0::IBtvMediaPlayer/btv_main
11-06 16:30:26.951 ERROR test/vts-testcase/hal/treble/vintf/SingleManifestTest.cpp:63: Failure
11-06 16:30:26.951 ERROR Failed
11-06 16:30:26.952 ERROR com.skb.btvservice@1.0::IBtvMediaPlayer has an empty hash. This is because it was compiled without being frozen in a corresponding current.txt file.
11-06 16:30:26.952 ERROR Getting: com.skb.btvservice@1.0::IBtvMediaPlayer/btv_pip
11-06 16:30:26.952 ERROR test/vts-testcase/hal/treble/vintf/SingleManifestTest.cpp:63: Failure
11-06 16:30:26.953 ERROR Failed
11-06 16:30:26.953 ERROR com.skb.btvservice@1.0::IBtvMediaPlayer has an empty hash. This is because it was compiled without being frozen in a corresponding current.txt file.
11-06 16:30:26.953 ERROR Getting: com.skb.btvservice@1.0::ITVService/default
11-06 16:30:26.953 ERROR test/vts-testcase/hal/treble/vintf/SingleManifestTest.cpp:63: Failure
11-06 16:30:26.954 ERROR Failed
11-06 16:30:26.954 ERROR com.skb.btvservice@1.0::ITVService has an empty hash. This is because it was compiled without being frozen in a corresponding current.txt file.
11-06 16:30:26.954 ERROR Getting: vendor.amlogic.hardware.hdmicec@1.0::IDroidHdmiCEC/default
11-06 16:30:26.954 ERROR Getting: vendor.amlogic.hardware.hdmicec@1.0::IDroidHdmiCEC/default
11-06 16:30:26.955 ERROR Getting: vendor.amlogic.hardware.remotecontrol@1.0::IRemoteControl/default
11-06 16:30:26.955 ERROR Getting: vendor.amlogic.hardware.remotecontrol@1.0::IRemoteControl/default
11-06 16:30:26.955 ERROR Getting: vendor.amlogic.hardware.subtitleserver@1.0::ISubtitleServer/default
11-06 16:30:26.955 ERROR Getting: vendor.amlogic.hardware.subtitleserver@1.0::ISubtitleServer/default
11-06 16:30:26.956 ERROR Getting: vendor.amlogic.hardware.systemcontrol@1.1::ISystemControl/default
11-06 16:30:26.956 ERROR Getting: vendor.amlogic.hardware.systemcontrol@1.1::ISystemControl/default
11-06 16:30:26.956 ERROR [  FAILED  ] DeviceManifest/SingleManifestTest.InterfacesAreReleased/0, where GetParam() = device manifest (298 ms)
11-06 16:30:26.956 ERROR [----------] 1 test from DeviceManifest/SingleManifestTest (298 ms total)
11-06 16:30:26.956 ERROR 
11-06 16:30:26.956 ERROR [----------] Global test environment tear-down
11-06 16:30:26.957 ERROR [==========] 1 test from 1 test suite ran. (298 ms total)
11-06 16:30:26.957 ERROR [  PASSED  ] 0 tests.
11-06 16:30:26.957 ERROR [  FAILED  ] 1 test, listed below:
11-06 16:30:26.957 ERROR [  FAILED  ] DeviceManifest/SingleManifestTest.InterfacesAreReleased/0, where GetParam() = device manifest
11-06 16:30:26.957 ERROR 
11-06 16:30:26.958 ERROR  1 FAILED TEST
11-06 16:30:26.958 ERROR 
11-06 16:30:26.958 ERROR <?xml version="1.0" encoding="UTF-8"?>
11-06 16:30:26.958 ERROR <testsuites tests="1" failures="1" disabled="0" errors="0" timestamp="2020-11-06T08:30:26" time="0.298" name="AllTests">
11-06 16:30:26.958 ERROR   <testsuite name="DeviceManifest/SingleManifestTest" tests="1" failures="1" disabled="0" errors="0" time="0.298">
11-06 16:30:26.959 ERROR     <testcase name="InterfacesAreReleased/0" value_param="device manifest" status="run" time="0.298" classname="DeviceManifest/SingleManifestTest">
11-06 16:30:26.959 ERROR       <failure message="test/vts-testcase/hal/treble/vintf/SingleManifestTest.cpp:63&#x0A;Failed&#x0A;com.skb.btvpropertyservice@1.0::IBtvPropertyService has an empty hash. This is because it was compiled without being frozen in a corresponding current.txt file." type=""><![CDATA[test/vts-testcase/hal/treble/vintf/SingleManifestTest.cpp:63
11-06 16:30:26.959 ERROR Failed
11-06 16:30:26.959 ERROR com.skb.btvpropertyservice@1.0::IBtvPropertyService has an empty hash. This is because it was compiled without being frozen in a corresponding current.txt file.]]></failure>
11-06 16:30:26.959 ERROR       <failure message="test/vts-testcase/hal/treble/vintf/SingleManifestTest.cpp:63&#x0A;Failed&#x0A;com.skb.btvpropertyservice@1.0::IBtvPropertyService has an empty hash. This is because it was compiled without being frozen in a corresponding current.txt file." type=""><![CDATA[test/vts-testcase/hal/treble/vintf/SingleManifestTest.cpp:63
11-06 16:30:26.960 ERROR Failed
11-06 16:30:26.960 ERROR com.skb.btvpropertyservice@1.0::IBtvPropertyService has an empty hash. This is because it was compiled without being frozen in a corresponding current.txt file.]]></failure>
11-06 16:30:26.960 ERROR       <failure message="test/vts-testcase/hal/treble/vintf/SingleManifestTest.cpp:63&#x0A;Failed&#x0A;com.skb.btvservice@1.0::IBtvMediaPlayer has an empty hash. This is because it was compiled without being frozen in a corresponding current.txt file." type=""><![CDATA[test/vts-testcase/hal/treble/vintf/SingleManifestTest.cpp:63
11-06 16:30:26.960 ERROR Failed
11-06 16:30:26.960 ERROR com.skb.btvservice@1.0::IBtvMediaPlayer has an empty hash. This is because it was compiled without being frozen in a corresponding current.txt file.]]></failure>
11-06 16:30:26.960 ERROR       <failure message="test/vts-testcase/hal/treble/vintf/SingleManifestTest.cpp:63&#x0A;Failed&#x0A;com.skb.btvservice@1.0::IBtvMediaPlayer has an empty hash. This is because it was compiled without being frozen in a corresponding current.txt file." type=""><![CDATA[test/vts-testcase/hal/treble/vintf/SingleManifestTest.cpp:63
11-06 16:30:26.961 ERROR Failed
11-06 16:30:26.961 ERROR com.skb.btvservice@1.0::IBtvMediaPlayer has an empty hash. This is because it was compiled without being frozen in a corresponding current.txt file.]]></failure>
11-06 16:30:26.961 ERROR       <failure message="test/vts-testcase/hal/treble/vintf/SingleManifestTest.cpp:63&#x0A;Failed&#x0A;com.skb.btvservice@1.0::ITVService has an empty hash. This is because it was compiled without being frozen in a corresponding current.txt file." type=""><![CDATA[test/vts-testcase/hal/treble/vintf/SingleManifestTest.cpp:63
11-06 16:30:26.961 ERROR Failed
11-06 16:30:26.961 ERROR com.skb.btvservice@1.0::ITVService has an empty hash. This is because it was compiled without being frozen in a corresponding current.txt file.]]></failure>
11-06 16:30:26.961 ERROR       <failure message="test/vts-testcase/hal/treble/vintf/SingleManifestTest.cpp:63&#x0A;Failed&#x0A;com.skb.btvservice@1.0::IBtvMediaPlayer has an empty hash. This is because it was compiled without being frozen in a corresponding current.txt file." type=""><![CDATA[test/vts-testcase/hal/treble/vintf/SingleManifestTest.cpp:63
11-06 16:30:26.961 ERROR Failed
11-06 16:30:26.962 ERROR com.skb.btvservice@1.0::IBtvMediaPlayer has an empty hash. This is because it was compiled without being frozen in a corresponding current.txt file.]]></failure>
11-06 16:30:26.962 ERROR       <failure message="test/vts-testcase/hal/treble/vintf/SingleManifestTest.cpp:63&#x0A;Failed&#x0A;com.skb.btvservice@1.0::IBtvMediaPlayer has an empty hash. This is because it was compiled without being frozen in a corresponding current.txt file." type=""><![CDATA[test/vts-testcase/hal/treble/vintf/SingleManifestTest.cpp:63
11-06 16:30:26.962 ERROR Failed
11-06 16:30:26.962 ERROR com.skb.btvservice@1.0::IBtvMediaPlayer has an empty hash. This is because it was compiled without being frozen in a corresponding current.txt file.]]></failure>
11-06 16:30:26.962 ERROR       <failure message="test/vts-testcase/hal/treble/vintf/SingleManifestTest.cpp:63&#x0A;Failed&#x0A;com.skb.btvservice@1.0::ITVService has an empty hash. This is because it was compiled without being frozen in a corresponding current.txt file." type=""><![CDATA[test/vts-testcase/hal/treble/vintf/SingleManifestTest.cpp:63
11-06 16:30:26.962 ERROR Failed
11-06 16:30:26.962 ERROR com.skb.btvservice@1.0::ITVService has an empty hash. This is because it was compiled without being frozen in a corresponding current.txt file.]]></failure>
11-06 16:30:26.963 ERROR     </testcase>
11-06 16:30:26.963 ERROR   </testsuite>
11-06 16:30:26.963 ERROR </testsuites>
11-06 16:30:26.963 ERROR 
11-06 16:30:26.963 ERROR test/vts-testcase/hal/treble/vintf/SingleManifestTest.cpp:63
Failed
com.skb.btvpropertyservice@1.0::IBtvPropertyService has an empty hash. This is because it was compiled without being frozen in a corresponding current.txt file.
test/vts-testcase/hal/treble/vintf/SingleManifestTest.cpp:63
Failed
com.skb.btvpropertyservice@1.0::IBtvPropertyService has an empty hash. This is because it was compiled without being frozen in a corresponding current.txt file.
test/vts-testcase/hal/treble/vintf/SingleManifestTest.cpp:63
Failed
com.skb.btvservice@1.0::IBtvMediaPlayer has an empty hash. This is because it was compiled without being frozen in a corresponding current.txt file.
test/vts-testcase/hal/treble/vintf/SingleManifestTest.cpp:63
Failed
com.skb.btvservice@1.0::IBtvMediaPlayer has an empty hash. This is because it was compiled without being frozen in a corresponding current.txt file.
test/vts-testcase/hal/treble/vintf/SingleManifestTest.cpp:63
Failed
com.skb.btvservice@1.0::ITVService has an empty hash. This is because it was compiled without being frozen in a corresponding current.txt file.
test/vts-testcase/hal/treble/vintf/SingleManifestTest.cpp:63
Failed
com.skb.btvservice@1.0::IBtvMediaPlayer has an empty hash. This is because it was compiled without being frozen in a corresponding current.txt file.
test/vts-testcase/hal/treble/vintf/SingleManifestTest.cpp:63
Failed
com.skb.btvservice@1.0::IBtvMediaPlayer has an empty hash. This is because it was compiled without being frozen in a corresponding current.txt file.
test/vts-testcase/hal/treble/vintf/SingleManifestTest.cpp:63
Failed
com.skb.btvservice@1.0::ITVService has an empty hash. This is because it was compiled without being frozen in a corresponding current.txt file.
11-06 16:30:26.964 ERROR [Test Case] 1/1 DeviceManifest/SingleManifestTest.InterfacesAreReleased/0_32bit FAIL
11-06 16:30:26.965 INFO Dumping logcat /tmp/vts-runner-log1697553995138094944/VtsTrebleVendorVintfTest/11-06-2020_16-30-22-476/logcat/logcat_DeviceManifest_SingleManifestTest.InterfacesAreReleased_0_32bit__radio_0001201904000455.txt...
11-06 16:30:26.968 DEBUG Start standing subprocess with cmd: adb -s 0001201904000455 logcat -b radio -d > /tmp/vts-runner-log1697553995138094944/VtsTrebleVendorVintfTest/11-06-2020_16-30-22-476/logcat/logcat_DeviceManifest_SingleManifestTest.InterfacesAreReleased_0_32bit__radio_0001201904000455.txt
11-06 16:30:27.032 DEBUG cmd: adb -s 0001201904000455 logcat -b radio -d > /tmp/vts-runner-log1697553995138094944/VtsTrebleVendorVintfTest/11-06-2020_16-30-22-476/logcat/logcat_DeviceManifest_SingleManifestTest.InterfacesAreReleased_0_32bit__radio_0001201904000455.txt, stdout: , stderr: , ret: 0
11-06 16:30:27.033 INFO Dumping logcat /tmp/vts-runner-log1697553995138094944/VtsTrebleVendorVintfTest/11-06-2020_16-30-22-476/logcat/logcat_DeviceManifest_SingleManifestTest.InterfacesAreReleased_0_32bit__events_0001201904000455.txt...
11-06 16:30:27.039 DEBUG Start standing subprocess with cmd: adb -s 0001201904000455 logcat -b events -d > /tmp/vts-runner-log1697553995138094944/VtsTrebleVendorVintfTest/11-06-2020_16-30-22-476/logcat/logcat_DeviceManifest_SingleManifestTest.InterfacesAreReleased_0_32bit__events_0001201904000455.txt
11-06 16:30:27.155 DEBUG cmd: adb -s 0001201904000455 logcat -b events -d > /tmp/vts-runner-log1697553995138094944/VtsTrebleVendorVintfTest/11-06-2020_16-30-22-476/logcat/logcat_DeviceManifest_SingleManifestTest.InterfacesAreReleased_0_32bit__events_0001201904000455.txt, stdout: , stderr: , ret: 0
11-06 16:30:27.155 INFO Dumping logcat /tmp/vts-runner-log1697553995138094944/VtsTrebleVendorVintfTest/11-06-2020_16-30-22-476/logcat/logcat_DeviceManifest_SingleManifestTest.InterfacesAreReleased_0_32bit__main_0001201904000455.txt...
11-06 16:30:27.165 DEBUG Start standing subprocess with cmd: adb -s 0001201904000455 logcat -b main -d > /tmp/vts-runner-log1697553995138094944/VtsTrebleVendorVintfTest/11-06-2020_16-30-22-476/logcat/logcat_DeviceManifest_SingleManifestTest.InterfacesAreReleased_0_32bit__main_0001201904000455.txt
11-06 16:30:27.335 DEBUG cmd: adb -s 0001201904000455 logcat -b main -d > /tmp/vts-runner-log1697553995138094944/VtsTrebleVendorVintfTest/11-06-2020_16-30-22-476/logcat/logcat_DeviceManifest_SingleManifestTest.InterfacesAreReleased_0_32bit__main_0001201904000455.txt, stdout: , stderr: , ret: 0
11-06 16:30:27.335 INFO Dumping logcat /tmp/vts-runner-log1697553995138094944/VtsTrebleVendorVintfTest/11-06-2020_16-30-22-476/logcat/logcat_DeviceManifest_SingleManifestTest.InterfacesAreReleased_0_32bit__system_0001201904000455.txt...
11-06 16:30:27.338 DEBUG Start standing subprocess with cmd: adb -s 0001201904000455 logcat -b system -d > /tmp/vts-runner-log1697553995138094944/VtsTrebleVendorVintfTest/11-06-2020_16-30-22-476/logcat/logcat_DeviceManifest_SingleManifestTest.InterfacesAreReleased_0_32bit__system_0001201904000455.txt
11-06 16:30:27.502 DEBUG cmd: adb -s 0001201904000455 logcat -b system -d > /tmp/vts-runner-log1697553995138094944/VtsTrebleVendorVintfTest/11-06-2020_16-30-22-476/logcat/logcat_DeviceManifest_SingleManifestTest.InterfacesAreReleased_0_32bit__system_0001201904000455.txt, stdout: , stderr: , ret: 0
11-06 16:30:27.502 INFO Dumping logcat /tmp/vts-runner-log1697553995138094944/VtsTrebleVendorVintfTest/11-06-2020_16-30-22-476/logcat/logcat_DeviceManifest_SingleManifestTest.InterfacesAreReleased_0_32bit__crash_0001201904000455.txt...
11-06 16:30:27.504 DEBUG Start standing subprocess with cmd: adb -s 0001201904000455 logcat -b crash -d > /tmp/vts-runner-log1697553995138094944/VtsTrebleVendorVintfTest/11-06-2020_16-30-22-476/logcat/logcat_DeviceManifest_SingleManifestTest.InterfacesAreReleased_0_32bit__crash_0001201904000455.txt
11-06 16:30:27.568 DEBUG cmd: adb -s 0001201904000455 logcat -b crash -d > /tmp/vts-runner-log1697553995138094944/VtsTrebleVendorVintfTest/11-06-2020_16-30-22-476/logcat/logcat_DeviceManifest_SingleManifestTest.InterfacesAreReleased_0_32bit__crash_0001201904000455.txt, stdout: , stderr: , ret: 0
11-06 16:30:27.570 DEBUG Finished 'generateAllTests'
11-06 16:30:27.570 DEBUG Start class cleaning up jobs.
11-06 16:30:27.571 DEBUG sending a command (type VTS_AGENT_COMMAND_EXECUTE_SHELL_COMMAND)
11-06 16:30:27.571 DEBUG command command_type: VTS_AGENT_COMMAND_EXECUTE_SHELL_COMMAND
shell_command: "rm -rf /data/nativetest/vts_treble_vintf_vendor_test"
shell_command: "rm -rf /data/nativetest64/vts_treble_vintf_vendor_test"

11-06 16:30:27.572 DEBUG sending 117 bytes
11-06 16:30:27.695 DEBUG resp 20 bytes
11-06 16:30:27.696 DEBUG Response success
11-06 16:30:27.696 DEBUG resp for VTS_AGENT_COMMAND_EXECUTE_SHELL_COMMAND: response_code: SUCCESS
stdout: ""
stdout: ""
stderr: ""
stderr: ""
exit_code: 0
exit_code: 0

11-06 16:30:27.698 DEBUG resp for VTS_AGENT_COMMAND_EXECUTE_SHELL_COMMAND: {'stderrs': ['', ''], 'return_codes': [0, 0], 'stdouts': ['', '']}
11-06 16:30:27.698 DEBUG sending a command (type VTS_AGENT_COMMAND_EXECUTE_SHELL_COMMAND)
11-06 16:30:27.699 DEBUG command command_type: VTS_AGENT_COMMAND_EXECUTE_SHELL_COMMAND
shell_command: "rmdir /data/local/tmp/vts_binary_test_GtestBinaryTest/"
shell_command: "rmdir /data/nativetest64"
shell_command: "rmdir /data/nativetest"

11-06 16:30:27.699 DEBUG sending 115 bytes
11-06 16:30:27.883 DEBUG resp 165 bytes
11-06 16:30:27.929 DEBUG Response success
11-06 16:30:27.930 DEBUG resp for VTS_AGENT_COMMAND_EXECUTE_SHELL_COMMAND: response_code: SUCCESS
stdout: ""
stdout: ""
stdout: ""
stderr: "rmdir: /data/local/tmp/vts_binary_test_GtestBinaryTest/: No such file or directory\n"
stderr: "rmdir: /data/nativetest64: No such file or directory\n"
stderr: ""
exit_code: 1
exit_code: 1
exit_code: 0

11-06 16:30:27.930 DEBUG resp for VTS_AGENT_COMMAND_EXECUTE_SHELL_COMMAND: {'stderrs': ['rmdir: /data/local/tmp/vts_binary_test_GtestBinaryTest/: No such file or directory\n', 'rmdir: /data/nativetest64: No such file or directory\n', ''], 'return_codes': [1, 1, 0], 'stdouts': ['', '', '']}
11-06 16:30:27.931 WARNING Failed to remove: {'stderrs': ['rmdir: /data/local/tmp/vts_binary_test_GtestBinaryTest/: No such file or directory\n', 'rmdir: /data/nativetest64: No such file or directory\n', ''], 'return_codes': [1, 1, 0], 'stdouts': ['', '', '']}
11-06 16:30:27.931 DEBUG Finished class cleaning up jobs.
11-06 16:30:27.932 INFO Summary for test class VtsTrebleVendorVintfTest: Error 0, Executed 1, Failed 1, Passed 0, Requested 0, Skipped 0
11-06 16:30:27.932 DEBUG Destroying android_device.
11-06 16:30:27.932 DEBUG Stop standing subprocess 27598
11-06 16:30:27.933 DEBUG Stop standing subprocess 27612
11-06 16:30:28.223 DEBUG Start standing subprocess with cmd: adb -s 0001201904000455 shell "start llkd-1"
11-06 16:30:28.338 DEBUG cmd: adb -s 0001201904000455 shell "start llkd-1", stdout: , stderr: , ret: 0
11-06 16:30:28.345 DEBUG Start standing subprocess with cmd: adb -s 0001201904000455 forward --remove tcp:2392
11-06 16:30:28.353 DEBUG cmd: adb -s 0001201904000455 forward --remove tcp:2392, stdout: , stderr: , ret: 0
11-06 16:30:28.355 INFO Summary for test run VtsTrebleVendorVintfTest@11-06-2020_16-30-22-476: Error 0, Executed 1, Failed 1, Passed 0, Requested 0, Skipped 0
