01-17 10:04:56 D/Configuration: Resolve and download remote files from @Option
01-17 10:04:56 I/TestInvocation: Invocation was started with cmd: gts -m GtsNetStatsHostTestCases -t com.google.android.gts.netstats.NetStatsHostTest#testASetThreadStatsUid -s SKBFXYZO0DKW
01-17 10:04:56 D/InvocationExecution: Skip linking external directory as FileProperty was set.
01-17 10:04:56 D/RunUtil: Running command [adb, version] with timeout: 2m 0s
01-17 10:04:57 D/TestInvocation: Fetch build duration: 17 ms
01-17 10:04:57 D/ArtifactsAnalyzer: Build analysis report: BuildAnalysis [mDeviceImageChanged=true, mHasTestsArtifacts=true, mHasChangesInTests=false, imageDigests={}]
01-17 10:04:57 D/ArtifactsAnalyzer: Analysis report after test analysis: BuildAnalysis [mDeviceImageChanged=true, mHasTestsArtifacts=true, mHasChangesInTests=true, imageDigests={}]
01-17 10:04:57 D/RunUtil: Running command [adb, -s, SKBFXYZO0DKW, shell, getprop, ro.build.version.sdk] with timeout: 45s
01-17 10:04:57 D/GlobalTestFilter: Setting up global filters
01-17 10:04:57 D/InvocationExecution: IShardHelper selected: com.android.tradefed.invoker.shard.StrictShardHelper@2360a5f8
01-17 10:04:57 D/BackgroundDeviceAction: Sleep for 5000 before starting logcat for SKBFXYZO0DKW.
01-17 10:04:57 I/TestInvocation: Starting invocation for 'gts' with '[ DeviceBuildInfo{bid=12590200, serial=SKBFXYZO0DKW} on device 'SKBFXYZO0DKW'] 
01-17 10:04:57 D/FileUtil: Creating temp directory at /tmp/12590200/gts with prefix "inv_"
01-17 10:04:57 D/RunUtil: Running command [chmod, ug+rwx, /tmp/12590200/gts/inv_9995701857283177694] with timeout: 10s
01-17 10:04:57 D/FileSystemLogSaver: Using log file directory /tmp/12590200/gts/inv_9995701857283177694
01-17 10:04:57 D/FileUtil: Creating temp directory at /tmp/12590200/gts/inv_9995701857283177694 with prefix "inv_"
01-17 10:04:57 I/LogFileSaver: Using log file directory /tmp/12590200/gts/inv_9995701857283177694/inv_6133494755912331788
01-17 10:04:57 D/CompatibilityProtoResultReporter: Proto Results Directory: /tmp/xts-root-dir-52536fdc-556b-4164-880a-cc980d7f5c50/android-gts/results/2025.01.17_10.04.56/proto
01-17 10:04:57 D/FileUtil: Creating temp file at /tmp/xts-root-dir-52536fdc-556b-4164-880a-cc980d7f5c50/android-gts/results/2025.01.17_10.04.56/proto with prefix "tmp-proto" suffix ""
01-17 10:04:57 D/CompatibilityProtoResultReporter: Proto Results Directory: /tmp/xts-root-dir-52536fdc-556b-4164-880a-cc980d7f5c50/android-gts/results/2025.01.17_10.04.56/proto
01-17 10:04:57 D/CertificationSuiteResultReporter: Initializing result directory
01-17 10:04:57 D/CertificationSuiteResultReporter: Results Directory: /tmp/xts-root-dir-52536fdc-556b-4164-880a-cc980d7f5c50/android-gts/results/2025.01.17_10.04.56
01-17 10:04:57 D/CertificationSuiteResultReporter: Created log dir /tmp/xts-root-dir-52536fdc-556b-4164-880a-cc980d7f5c50/android-gts/logs/2025.01.17_10.04.56
01-17 10:04:57 D/FileUtil: Creating temp directory at /tmp/xts-root-dir-52536fdc-556b-4164-880a-cc980d7f5c50/android-gts/logs/2025.01.17_10.04.56 with prefix "inv_"
01-17 10:04:57 I/LogFileSaver: Using log file directory /tmp/xts-root-dir-52536fdc-556b-4164-880a-cc980d7f5c50/android-gts/logs/2025.01.17_10.04.56/inv_16366652287964525487
01-17 10:04:57 D/LogFileSaver: Log data for tradefed-expanded-config is already compressed, skipping compression
01-17 10:04:57 D/FileUtil: Creating temp file at /tmp/xts-root-dir-52536fdc-556b-4164-880a-cc980d7f5c50/android-gts/logs/2025.01.17_10.04.56/inv_16366652287964525487 with prefix "tradefed-expanded-config_" suffix ".xml"
01-17 10:04:57 I/LogFileSaver: Saved log file /tmp/xts-root-dir-52536fdc-556b-4164-880a-cc980d7f5c50/android-gts/logs/2025.01.17_10.04.56/inv_16366652287964525487/tradefed-expanded-config_4976948099625618989.xml. [size=17697, elapsed=1ms]
01-17 10:04:57 D/CertificationSuiteResultReporter: Saved logs for tradefed-expanded-config in /tmp/xts-root-dir-52536fdc-556b-4164-880a-cc980d7f5c50/android-gts/logs/2025.01.17_10.04.56/inv_16366652287964525487/tradefed-expanded-config_4976948099625618989.xml
01-17 10:04:57 D/LogFileSaver: Log data for tradefed-expanded-config is already compressed, skipping compression
01-17 10:04:57 D/FileUtil: Creating temp file at /tmp/12590200/gts/inv_9995701857283177694/inv_6133494755912331788 with prefix "tradefed-expanded-config_" suffix ".xml"
01-17 10:04:57 I/LogFileSaver: Saved log file /tmp/12590200/gts/inv_9995701857283177694/inv_6133494755912331788/tradefed-expanded-config_169222139855074675.xml. [size=17697, elapsed=1ms]
01-17 10:04:57 D/InvocationExecution: Starting device pre invocation setup for : 'SKBFXYZO0DKW'
01-17 10:04:57 D/DefaultConnection: Instance type for connection: GCE
01-17 10:04:57 D/DefaultConnection: Instance type for connection: GCE
01-17 10:04:57 D/NativeDevice: Using connection: com.android.tradefed.device.connection.DefaultConnection@1bc9f1b3 (SKBFXYZO0DKW)
01-17 10:04:57 I/CommandInterrupter: Interrupt allowed
01-17 10:04:57 D/InvocationExecution: Starting setup for device: 'SKBFXYZO0DKW'
01-17 10:04:57 D/InvocationExecution: starting preparer 'com.android.compatibility.common.tradefed.targetprep.DynamicConfigPusher@6decfc71' on device: 'SKBFXYZO0DKW'
01-17 10:04:57 I/UrlReplacement: UrlReplacement file [/home/dev2-google03/android-gts/android-gts-12-R2-12590200/android-gts/tools/UrlReplacement.xml] does not exist
01-17 10:04:58 D/InvocationExecution: done with preparer 'com.android.compatibility.common.tradefed.targetprep.DynamicConfigPusher@6decfc71' on device: 'SKBFXYZO0DKW' in 640 ms
01-17 10:04:58 D/InvocationExecution: starting preparer 'com.android.compatibility.common.tradefed.targetprep.StayAwakePreparer@19059561' on device: 'SKBFXYZO0DKW'
01-17 10:04:58 D/InvocationExecution: done with preparer 'com.android.compatibility.common.tradefed.targetprep.StayAwakePreparer@19059561' on device: 'SKBFXYZO0DKW' in 102 ms
01-17 10:04:58 D/InvocationExecution: starting preparer 'com.android.compatibility.common.tradefed.targetprep.SettingsPreparer@13ebb72c' on device: 'SKBFXYZO0DKW'
01-17 10:04:58 D/SettingsPreparer: Setting verifier_verify_adb_installs to value 0
01-17 10:04:58 D/InvocationExecution: done with preparer 'com.android.compatibility.common.tradefed.targetprep.SettingsPreparer@13ebb72c' on device: 'SKBFXYZO0DKW' in 64 ms
01-17 10:04:58 D/InvocationExecution: starting preparer 'com.android.compatibility.common.tradefed.targetprep.ApkPreconditionCheck@9b48b9f' on device: 'SKBFXYZO0DKW'
01-17 10:04:58 I/NativeDeviceStateMonitor: Device SKBFXYZO0DKW is already ONLINE
01-17 10:04:58 I/NativeDeviceStateMonitor: Waiting 360000 ms for device SKBFXYZO0DKW boot complete
01-17 10:04:58 I/DeviceStateMonitor: Waiting 359960 ms for device SKBFXYZO0DKW package manager
01-17 10:04:58 I/NativeDeviceStateMonitor: Waiting 359898 ms for device SKBFXYZO0DKW external store
01-17 10:04:58 I/ApkInstrumentationPreparer: Instrumenting package: com.android.preconditions.gts
01-17 10:04:58 D/NativeDevice: Using property ro.build.version.sdk=31 from cache.
01-17 10:04:58 D/RunUtil: Running command [adb, -s, SKBFXYZO0DKW, shell, getprop, ro.build.version.codename] with timeout: 45s
01-17 10:04:58 D/NativeDevice: Using property ro.build.version.sdk=31 from cache.
01-17 10:04:58 D/NativeDevice: Using property ro.build.version.codename=REL from cache.
01-17 10:04:58 D/AndroidJUnitTest: Disabled test storage as it's not supported on that branch.
01-17 10:04:58 D/NativeDevice: Using property ro.build.version.sdk=31 from cache.
01-17 10:04:58 D/NativeDevice: Using property ro.build.version.codename=REL from cache.
01-17 10:04:58 D/NativeDevice: Using property ro.build.version.sdk=31 from cache.
01-17 10:05:00 D/RunUtil: Running command [aapt, dump, badging, /tmp/xts-root-dir-52536fdc-556b-4164-880a-cc980d7f5c50/android-gts/testcases/GtsPreconditions.apk] with timeout: 1m 0s
01-17 10:05:00 D/RunUtil: Running command [aapt, dump, xmltree, /tmp/xts-root-dir-52536fdc-556b-4164-880a-cc980d7f5c50/android-gts/testcases/GtsPreconditions.apk, AndroidManifest.xml] with timeout: 1m 0s
01-17 10:05:00 D/RunUtil: Running command [adb, -s, SKBFXYZO0DKW, shell, appops, write-settings] with timeout: 2m 0s
01-17 10:05:00 D/ListInstrumentationParser: instrumentation:com.android.preconditions.gts/androidx.test.runner.AndroidJUnitRunner (target=com.android.preconditions.gts)
01-17 10:05:00 D/ListInstrumentationParser: 
01-17 10:05:00 I/InstrumentationTest: No runner name specified. Using: androidx.test.runner.AndroidJUnitRunner.
01-17 10:05:00 D/NativeDevice: Using property ro.build.version.sdk=31 from cache.
01-17 10:05:00 D/NativeDevice: Using property ro.build.version.sdk=31 from cache.
01-17 10:05:00 D/NativeDevice: Using property ro.build.version.codename=REL from cache.
01-17 10:05:00 D/InstrumentationTest: Initializing com.android.tradefed.device.metric.CountTestCasesCollector for instrumentation.
01-17 10:05:00 I/RemoteAndroidTestRunner: Running am instrument -w -r --no-isolated-storage  -e newRunListenerMode true -e timeout_msec 300000 com.android.preconditions.gts/androidx.test.runner.AndroidJUnitRunner on foxconn-bfx_at100-SKBFXYZO0DKW
01-17 10:05:02 D/BackgroundDeviceAction: Waiting for device SKBFXYZO0DKW online before starting.
01-17 10:05:02 D/BackgroundDeviceAction: Device SKBFXYZO0DKW now online.
01-17 10:05:02 D/BackgroundDeviceAction: Starting logcat for SKBFXYZO0DKW.
01-17 10:05:03 D/TestDevice: Uninstalling com.android.preconditions.gts with extra args 
01-17 10:05:03 D/ApkInstrumentationPreparer: Target preparation successful
01-17 10:05:04 D/InvocationExecution: done with preparer 'com.android.compatibility.common.tradefed.targetprep.ApkPreconditionCheck@9b48b9f' on device: 'SKBFXYZO0DKW' in 5s
01-17 10:05:04 D/InvocationExecution: starting preparer 'com.android.compatibility.common.tradefed.targetprep.WifiCheck@79f35d7d' on device: 'SKBFXYZO0DKW'
01-17 10:05:04 I/NativeDeviceStateMonitor: Device SKBFXYZO0DKW is already ONLINE
01-17 10:05:04 I/NativeDeviceStateMonitor: Waiting 359999 ms for device SKBFXYZO0DKW boot complete
01-17 10:05:04 I/DeviceStateMonitor: Waiting 359926 ms for device SKBFXYZO0DKW package manager
01-17 10:05:04 I/NativeDeviceStateMonitor: Waiting 359743 ms for device SKBFXYZO0DKW external store
01-17 10:05:04 D/NativeDevice: Using property ro.build.version.sdk=31 from cache.
01-17 10:05:04 D/NativeDevice: Using property ro.build.version.codename=REL from cache.
01-17 10:05:04 D/NativeDevice: Using property ro.build.version.sdk=31 from cache.
01-17 10:05:05 D/RunUtil: Running command [aapt, dump, badging, /tmp/WifiUtil.apk15218620972259667048.apk] with timeout: 1m 0s
01-17 10:05:05 D/RunUtil: Running command [aapt, dump, xmltree, /tmp/WifiUtil.apk15218620972259667048.apk, AndroidManifest.xml] with timeout: 1m 0s
01-17 10:05:05 D/RunUtil: Running command [adb, -s, SKBFXYZO0DKW, shell, appops, write-settings] with timeout: 2m 0s
01-17 10:05:07 I/WifiCheck: Wifi is connected
01-17 10:05:07 D/InvocationExecution: done with preparer 'com.android.compatibility.common.tradefed.targetprep.WifiCheck@79f35d7d' on device: 'SKBFXYZO0DKW' in 3s
01-17 10:05:07 D/InvocationExecution: starting preparer 'com.android.tradefed.targetprep.RunCommandTargetPreparer@727f3ab6' on device: 'SKBFXYZO0DKW'
01-17 10:05:07 D/RunUtil: Running command [adb, -s, SKBFXYZO0DKW, shell, rm, -rf, /sdcard/device-info-files] with timeout: 2m 0s
01-17 10:05:07 D/RunUtil: Running command [adb, -s, SKBFXYZO0DKW, shell, rm, -rf, /sdcard/report-log-files] with timeout: 2m 0s
01-17 10:05:07 D/InvocationExecution: done with preparer 'com.android.tradefed.targetprep.RunCommandTargetPreparer@727f3ab6' on device: 'SKBFXYZO0DKW' in 375 ms
01-17 10:05:07 D/InvocationExecution: starting preparer 'com.android.compatibility.common.tradefed.targetprep.DeviceInfoCollector@503b0810' on device: 'SKBFXYZO0DKW'
01-17 10:05:07 D/RunUtil: Running command [adb, -s, SKBFXYZO0DKW, shell, getprop, ro.product.model] with timeout: 45s
01-17 10:05:07 D/RunUtil: Running command [adb, -s, SKBFXYZO0DKW, shell, getprop, ro.product.device] with timeout: 45s
01-17 10:05:07 D/RunUtil: Running command [adb, -s, SKBFXYZO0DKW, shell, getprop, ro.build.id] with timeout: 45s
01-17 10:05:07 D/RunUtil: Running command [adb, -s, SKBFXYZO0DKW, shell, getprop, ro.bootimage.build.fingerprint] with timeout: 45s
01-17 10:05:07 D/NativeDevice: Using property ro.build.version.sdk=31 from cache.
01-17 10:05:07 D/RunUtil: Running command [adb, -s, SKBFXYZO0DKW, shell, getprop, ro.product.manufacturer] with timeout: 45s
01-17 10:05:08 D/RunUtil: Running command [adb, -s, SKBFXYZO0DKW, shell, getprop, ro.serialno] with timeout: 45s
01-17 10:05:08 D/RunUtil: Running command [adb, -s, SKBFXYZO0DKW, shell, getprop, ro.build.version.security_patch] with timeout: 45s
01-17 10:05:08 D/RunUtil: Running command [adb, -s, SKBFXYZO0DKW, shell, getprop, ro.product.cpu.abilist32] with timeout: 45s
01-17 10:05:08 D/RunUtil: Running command [adb, -s, SKBFXYZO0DKW, shell, getprop, ro.build.reference.fingerprint] with timeout: 45s
01-17 10:05:08 D/RunUtil: Running command [adb, -s, SKBFXYZO0DKW, shell, getprop, ro.product.cpu.abi] with timeout: 45s
01-17 10:05:08 D/RunUtil: Running command [adb, -s, SKBFXYZO0DKW, shell, getprop, ro.product.cpu.abilist64] with timeout: 45s
01-17 10:05:08 D/RunUtil: Running command [adb, -s, SKBFXYZO0DKW, shell, getprop, ro.product.name] with timeout: 45s
01-17 10:05:08 D/RunUtil: Running command [adb, -s, SKBFXYZO0DKW, shell, getprop, ro.build.tags] with timeout: 45s
01-17 10:05:08 D/RunUtil: Running command [adb, -s, SKBFXYZO0DKW, shell, getprop, ro.build.version.incremental] with timeout: 45s
01-17 10:05:08 D/RunUtil: Running command [adb, -s, SKBFXYZO0DKW, shell, getprop, ro.product.brand] with timeout: 45s
01-17 10:05:08 D/RunUtil: Running command [adb, -s, SKBFXYZO0DKW, shell, getprop, ro.build.fingerprint] with timeout: 45s
01-17 10:05:08 D/RunUtil: Running command [adb, -s, SKBFXYZO0DKW, shell, getprop, ro.vendor.build.fingerprint] with timeout: 45s
01-17 10:05:08 D/RunUtil: Running command [adb, -s, SKBFXYZO0DKW, shell, getprop, ro.build.version.base_os] with timeout: 45s
01-17 10:05:08 D/RunUtil: Running command [adb, -s, SKBFXYZO0DKW, shell, getprop, ro.product.cpu.abilist] with timeout: 45s
01-17 10:05:08 D/RunUtil: Running command [adb, -s, SKBFXYZO0DKW, shell, getprop, ro.product.board] with timeout: 45s
01-17 10:05:08 D/RunUtil: Running command [adb, -s, SKBFXYZO0DKW, shell, getprop, ro.build.type] with timeout: 45s
01-17 10:05:08 D/RunUtil: Running command [adb, -s, SKBFXYZO0DKW, shell, getprop, ro.build.version.release] with timeout: 45s
01-17 10:05:08 D/RunUtil: Running command [adb, -s, SKBFXYZO0DKW, shell, getprop, ro.product.cpu.abi2] with timeout: 45s
01-17 10:05:08 I/NativeDeviceStateMonitor: Device SKBFXYZO0DKW is already ONLINE
01-17 10:05:08 I/NativeDeviceStateMonitor: Waiting 359999 ms for device SKBFXYZO0DKW boot complete
01-17 10:05:09 I/DeviceStateMonitor: Waiting 359957 ms for device SKBFXYZO0DKW package manager
01-17 10:05:09 I/NativeDeviceStateMonitor: Waiting 359895 ms for device SKBFXYZO0DKW external store
01-17 10:05:09 I/ApkInstrumentationPreparer: Instrumenting package: com.android.compatibility.common.deviceinfo
01-17 10:05:09 D/NativeDevice: Using property ro.build.version.sdk=31 from cache.
01-17 10:05:09 D/NativeDevice: Using property ro.build.version.codename=REL from cache.
01-17 10:05:09 D/NativeDevice: Using property ro.build.version.sdk=31 from cache.
01-17 10:05:09 D/NativeDevice: Using property ro.build.version.codename=REL from cache.
01-17 10:05:09 D/AndroidJUnitTest: Disabled test storage as it's not supported on that branch.
01-17 10:05:09 D/NativeDevice: Using property ro.build.version.sdk=31 from cache.
01-17 10:05:09 D/NativeDevice: Using property ro.build.version.codename=REL from cache.
01-17 10:05:09 D/NativeDevice: Using property ro.build.version.sdk=31 from cache.
01-17 10:05:12 D/RunUtil: Running command [aapt, dump, badging, /tmp/xts-root-dir-52536fdc-556b-4164-880a-cc980d7f5c50/android-gts/testcases/GtsDeviceInfo.apk] with timeout: 1m 0s
01-17 10:05:12 D/RunUtil: Running command [aapt, dump, xmltree, /tmp/xts-root-dir-52536fdc-556b-4164-880a-cc980d7f5c50/android-gts/testcases/GtsDeviceInfo.apk, AndroidManifest.xml] with timeout: 1m 0s
01-17 10:05:12 D/RunUtil: Running command [adb, -s, SKBFXYZO0DKW, shell, appops, write-settings] with timeout: 2m 0s
01-17 10:05:12 D/ListInstrumentationParser: instrumentation:com.android.compatibility.common.deviceinfo/androidx.test.runner.AndroidJUnitRunner (target=com.android.compatibility.common.deviceinfo)
01-17 10:05:12 D/ListInstrumentationParser: instrumentation:com.android.tradefed.utils.wifi/.WifiUtil (target=com.android.tradefed.utils.wifi)
01-17 10:05:12 D/ListInstrumentationParser: 
01-17 10:05:12 I/InstrumentationTest: No runner name specified. Using: androidx.test.runner.AndroidJUnitRunner.
01-17 10:05:12 D/NativeDevice: Using property ro.build.version.sdk=31 from cache.
01-17 10:05:12 D/NativeDevice: Using property ro.build.version.sdk=31 from cache.
01-17 10:05:12 D/NativeDevice: Using property ro.build.version.codename=REL from cache.
01-17 10:05:12 D/InstrumentationTest: Initializing com.android.tradefed.device.metric.CountTestCasesCollector for instrumentation.
01-17 10:05:12 I/RemoteAndroidTestRunner: Running am instrument -w -r --no-isolated-storage  -e newRunListenerMode true -e timeout_msec 300000 com.android.compatibility.common.deviceinfo/androidx.test.runner.AndroidJUnitRunner on foxconn-bfx_at100-SKBFXYZO0DKW
01-17 10:05:39 D/TestDevice: Uninstalling com.android.compatibility.common.deviceinfo with extra args 
01-17 10:05:40 D/ApkInstrumentationPreparer: Target preparation successful
01-17 10:05:40 D/NativeDevice: Using property ro.build.version.sdk=31 from cache.
01-17 10:05:40 D/NativeDevice: Using 'ls' to check doesFileExist(/storage/emulated/0/device-info-files/)
01-17 10:05:40 D/RunUtil: Running command [adb, -s, SKBFXYZO0DKW, shell, ls, '/storage/emulated/0/device-info-files/'] with timeout: 2m 0s
01-17 10:05:41 D/FileUtil: Creating temp file at /tmp/12590200/gts/inv_9995701857283177694/inv_6133494755912331788 with prefix "UserDeviceInfo.deviceinfo.json_" suffix ".txt.gz"
01-17 10:05:41 I/LogFileSaver: Saved gzip log file /tmp/12590200/gts/inv_9995701857283177694/inv_6133494755912331788/UserDeviceInfo.deviceinfo.json_6324843080492137284.txt.gz. [size=10, elapsed=2ms]
01-17 10:05:41 D/FileUtil: Creating temp file at /tmp/xts-root-dir-52536fdc-556b-4164-880a-cc980d7f5c50/android-gts/logs/2025.01.17_10.04.56/inv_16366652287964525487 with prefix "device_compatibility_matrix.xml_" suffix ".txt.gz"
01-17 10:05:41 I/LogFileSaver: Saved gzip log file /tmp/xts-root-dir-52536fdc-556b-4164-880a-cc980d7f5c50/android-gts/logs/2025.01.17_10.04.56/inv_16366652287964525487/device_compatibility_matrix.xml_3151970080041106148.txt.gz. [size=10, elapsed=1ms]
01-17 10:05:41 D/CertificationSuiteResultReporter: Saved logs for device_compatibility_matrix.xml in /tmp/xts-root-dir-52536fdc-556b-4164-880a-cc980d7f5c50/android-gts/logs/2025.01.17_10.04.56/inv_16366652287964525487/device_compatibility_matrix.xml_3151970080041106148.txt.gz
01-17 10:05:41 D/FileUtil: Creating temp file at /tmp/12590200/gts/inv_9995701857283177694/inv_6133494755912331788 with prefix "device_compatibility_matrix.xml_" suffix ".txt.gz"
01-17 10:05:41 I/LogFileSaver: Saved gzip log file /tmp/12590200/gts/inv_9995701857283177694/inv_6133494755912331788/device_compatibility_matrix.xml_1487213612440885366.txt.gz. [size=10, elapsed=0ms]
01-17 10:05:41 D/FileUtil: Creating temp file at /tmp/12590200/gts/inv_9995701857283177694/inv_6133494755912331788 with prefix "ConfigurationDeviceInfo.deviceinfo.json_" suffix ".txt.gz"
01-17 10:05:41 I/LogFileSaver: Saved gzip log file /tmp/12590200/gts/inv_9995701857283177694/inv_6133494755912331788/ConfigurationDeviceInfo.deviceinfo.json_9561233282119507224.txt.gz. [size=10, elapsed=1ms]
01-17 10:05:41 D/FileUtil: Creating temp file at /tmp/12590200/gts/inv_9995701857283177694/inv_6133494755912331788 with prefix "BackupPermissionHoldersDeviceInfo.deviceinfo.json_" suffix ".txt.gz"
01-17 10:05:41 I/LogFileSaver: Saved gzip log file /tmp/12590200/gts/inv_9995701857283177694/inv_6133494755912331788/BackupPermissionHoldersDeviceInfo.deviceinfo.json_9593618926705442357.txt.gz. [size=10, elapsed=1ms]
01-17 10:05:41 D/FileUtil: Creating temp file at /tmp/12590200/gts/inv_9995701857283177694/inv_6133494755912331788 with prefix "MemoryDeviceInfo.deviceinfo.json_" suffix ".txt.gz"
01-17 10:05:41 I/LogFileSaver: Saved gzip log file /tmp/12590200/gts/inv_9995701857283177694/inv_6133494755912331788/MemoryDeviceInfo.deviceinfo.json_1858519085366751503.txt.gz. [size=10, elapsed=0ms]
01-17 10:05:41 D/FileUtil: Creating temp file at /tmp/12590200/gts/inv_9995701857283177694/inv_6133494755912331788 with prefix "CpuDeviceInfo.deviceinfo.json_" suffix ".txt.gz"
01-17 10:05:41 I/LogFileSaver: Saved gzip log file /tmp/12590200/gts/inv_9995701857283177694/inv_6133494755912331788/CpuDeviceInfo.deviceinfo.json_14204567906162816689.txt.gz. [size=10, elapsed=0ms]
01-17 10:05:41 D/FileUtil: Creating temp file at /tmp/12590200/gts/inv_9995701857283177694/inv_6133494755912331788 with prefix "MediaDeviceInfo.deviceinfo.json_" suffix ".txt.gz"
01-17 10:05:41 I/LogFileSaver: Saved gzip log file /tmp/12590200/gts/inv_9995701857283177694/inv_6133494755912331788/MediaDeviceInfo.deviceinfo.json_2124297279520449719.txt.gz. [size=10, elapsed=2ms]
01-17 10:05:41 D/FileUtil: Creating temp file at /tmp/12590200/gts/inv_9995701857283177694/inv_6133494755912331788 with prefix "VintfDeviceInfo.deviceinfo.json_" suffix ".txt.gz"
01-17 10:05:41 I/LogFileSaver: Saved gzip log file /tmp/12590200/gts/inv_9995701857283177694/inv_6133494755912331788/VintfDeviceInfo.deviceinfo.json_12384427466843972627.txt.gz. [size=10, elapsed=1ms]
01-17 10:05:41 D/FileUtil: Creating temp file at /tmp/12590200/gts/inv_9995701857283177694/inv_6133494755912331788 with prefix "WidevineDeviceInfo.deviceinfo.json_" suffix ".txt.gz"
01-17 10:05:41 I/LogFileSaver: Saved gzip log file /tmp/12590200/gts/inv_9995701857283177694/inv_6133494755912331788/WidevineDeviceInfo.deviceinfo.json_12323335570161273413.txt.gz. [size=10, elapsed=0ms]
01-17 10:05:41 D/FileUtil: Creating temp file at /tmp/12590200/gts/inv_9995701857283177694/inv_6133494755912331788 with prefix "MainlineDeviceInfo.deviceinfo.json_" suffix ".txt.gz"
01-17 10:05:41 I/LogFileSaver: Saved gzip log file /tmp/12590200/gts/inv_9995701857283177694/inv_6133494755912331788/MainlineDeviceInfo.deviceinfo.json_16152629072941168641.txt.gz. [size=10, elapsed=1ms]
01-17 10:05:41 D/FileUtil: Creating temp file at /tmp/12590200/gts/inv_9995701857283177694/inv_6133494755912331788 with prefix "GraphicsDeviceInfo.deviceinfo.json_" suffix ".txt.gz"
01-17 10:05:41 I/LogFileSaver: Saved gzip log file /tmp/12590200/gts/inv_9995701857283177694/inv_6133494755912331788/GraphicsDeviceInfo.deviceinfo.json_15110186275802730415.txt.gz. [size=10, elapsed=1ms]
01-17 10:05:41 D/FileUtil: Creating temp file at /tmp/12590200/gts/inv_9995701857283177694/inv_6133494755912331788 with prefix "KeystoreAttestationDeviceInfo.deviceinfo.json_" suffix ".txt.gz"
01-17 10:05:41 I/LogFileSaver: Saved gzip log file /tmp/12590200/gts/inv_9995701857283177694/inv_6133494755912331788/KeystoreAttestationDeviceInfo.deviceinfo.json_3381597577578806404.txt.gz. [size=10, elapsed=0ms]
01-17 10:05:41 D/FileUtil: Creating temp file at /tmp/12590200/gts/inv_9995701857283177694/inv_6133494755912331788 with prefix "VendorApexDeviceInfo.deviceinfo.json_" suffix ".txt.gz"
01-17 10:05:41 I/LogFileSaver: Saved gzip log file /tmp/12590200/gts/inv_9995701857283177694/inv_6133494755912331788/VendorApexDeviceInfo.deviceinfo.json_17754843585475072483.txt.gz. [size=10, elapsed=1ms]
01-17 10:05:41 D/FileUtil: Creating temp file at /tmp/xts-root-dir-52536fdc-556b-4164-880a-cc980d7f5c50/android-gts/logs/2025.01.17_10.04.56/inv_16366652287964525487 with prefix "framework_compatibility_matrix.xml_" suffix ".txt.gz"
01-17 10:05:41 I/LogFileSaver: Saved gzip log file /tmp/xts-root-dir-52536fdc-556b-4164-880a-cc980d7f5c50/android-gts/logs/2025.01.17_10.04.56/inv_16366652287964525487/framework_compatibility_matrix.xml_10315299982887805573.txt.gz. [size=10, elapsed=6ms]
01-17 10:05:41 D/CertificationSuiteResultReporter: Saved logs for framework_compatibility_matrix.xml in /tmp/xts-root-dir-52536fdc-556b-4164-880a-cc980d7f5c50/android-gts/logs/2025.01.17_10.04.56/inv_16366652287964525487/framework_compatibility_matrix.xml_10315299982887805573.txt.gz
01-17 10:05:41 D/FileUtil: Creating temp file at /tmp/12590200/gts/inv_9995701857283177694/inv_6133494755912331788 with prefix "framework_compatibility_matrix.xml_" suffix ".txt.gz"
01-17 10:05:41 I/LogFileSaver: Saved gzip log file /tmp/12590200/gts/inv_9995701857283177694/inv_6133494755912331788/framework_compatibility_matrix.xml_13312305799694335914.txt.gz. [size=10, elapsed=6ms]
01-17 10:05:41 D/FileUtil: Creating temp file at /tmp/12590200/gts/inv_9995701857283177694/inv_6133494755912331788 with prefix "HapticsDeviceInfo.deviceinfo.json_" suffix ".txt.gz"
01-17 10:05:41 I/LogFileSaver: Saved gzip log file /tmp/12590200/gts/inv_9995701857283177694/inv_6133494755912331788/HapticsDeviceInfo.deviceinfo.json_5046603401848514115.txt.gz. [size=10, elapsed=0ms]
01-17 10:05:41 D/FileUtil: Creating temp file at /tmp/12590200/gts/inv_9995701857283177694/inv_6133494755912331788 with prefix "TelephonyDeviceInfo.deviceinfo.json_" suffix ".txt.gz"
01-17 10:05:41 I/LogFileSaver: Saved gzip log file /tmp/12590200/gts/inv_9995701857283177694/inv_6133494755912331788/TelephonyDeviceInfo.deviceinfo.json_15229252480615493362.txt.gz. [size=10, elapsed=1ms]
01-17 10:05:41 D/FileUtil: Creating temp file at /tmp/12590200/gts/inv_9995701857283177694/inv_6133494755912331788 with prefix "GenericDeviceInfo.deviceinfo.json_" suffix ".txt.gz"
01-17 10:05:41 I/LogFileSaver: Saved gzip log file /tmp/12590200/gts/inv_9995701857283177694/inv_6133494755912331788/GenericDeviceInfo.deviceinfo.json_13779241258509919643.txt.gz. [size=10, elapsed=1ms]
01-17 10:05:41 D/FileUtil: Creating temp file at /tmp/12590200/gts/inv_9995701857283177694/inv_6133494755912331788 with prefix "FeatureDeviceInfo.deviceinfo.json_" suffix ".txt.gz"
01-17 10:05:41 I/LogFileSaver: Saved gzip log file /tmp/12590200/gts/inv_9995701857283177694/inv_6133494755912331788/FeatureDeviceInfo.deviceinfo.json_314024162849353663.txt.gz. [size=10, elapsed=0ms]
01-17 10:05:41 D/FileUtil: Creating temp file at /tmp/12590200/gts/inv_9995701857283177694/inv_6133494755912331788 with prefix "PackageDeviceInfo.deviceinfo.json_" suffix ".txt.gz"
01-17 10:05:41 I/LogFileSaver: Saved gzip log file /tmp/12590200/gts/inv_9995701857283177694/inv_6133494755912331788/PackageDeviceInfo.deviceinfo.json_3590559959020044541.txt.gz. [size=22313, elapsed=6ms]
01-17 10:05:41 D/FileUtil: Creating temp file at /tmp/12590200/gts/inv_9995701857283177694/inv_6133494755912331788 with prefix "LocaleDeviceInfo.deviceinfo.json_" suffix ".txt.gz"
01-17 10:05:41 I/LogFileSaver: Saved gzip log file /tmp/12590200/gts/inv_9995701857283177694/inv_6133494755912331788/LocaleDeviceInfo.deviceinfo.json_2079194733868664333.txt.gz. [size=10, elapsed=0ms]
01-17 10:05:41 D/FileUtil: Creating temp file at /tmp/12590200/gts/inv_9995701857283177694/inv_6133494755912331788 with prefix "StorageDeviceInfo.deviceinfo.json_" suffix ".txt.gz"
01-17 10:05:41 I/LogFileSaver: Saved gzip log file /tmp/12590200/gts/inv_9995701857283177694/inv_6133494755912331788/StorageDeviceInfo.deviceinfo.json_9021779455252798305.txt.gz. [size=10, elapsed=0ms]
01-17 10:05:41 D/FileUtil: Creating temp file at /tmp/12590200/gts/inv_9995701857283177694/inv_6133494755912331788 with prefix "ScreenDeviceInfo.deviceinfo.json_" suffix ".txt.gz"
01-17 10:05:41 I/LogFileSaver: Saved gzip log file /tmp/12590200/gts/inv_9995701857283177694/inv_6133494755912331788/ScreenDeviceInfo.deviceinfo.json_1638209209094113645.txt.gz. [size=10, elapsed=0ms]
01-17 10:05:41 D/FileUtil: Creating temp file at /tmp/12590200/gts/inv_9995701857283177694/inv_6133494755912331788 with prefix "PermissionDeviceInfo.deviceinfo.json_" suffix ".txt.gz"
01-17 10:05:41 I/LogFileSaver: Saved gzip log file /tmp/12590200/gts/inv_9995701857283177694/inv_6133494755912331788/PermissionDeviceInfo.deviceinfo.json_15039456579698338244.txt.gz. [size=10, elapsed=0ms]
01-17 10:05:41 D/FileUtil: Creating temp file at /tmp/xts-root-dir-52536fdc-556b-4164-880a-cc980d7f5c50/android-gts/logs/2025.01.17_10.04.56/inv_16366652287964525487 with prefix "framework_manifest.xml_" suffix ".txt.gz"
01-17 10:05:41 I/LogFileSaver: Saved gzip log file /tmp/xts-root-dir-52536fdc-556b-4164-880a-cc980d7f5c50/android-gts/logs/2025.01.17_10.04.56/inv_16366652287964525487/framework_manifest.xml_12195088069201165608.txt.gz. [size=10, elapsed=0ms]
01-17 10:05:41 D/CertificationSuiteResultReporter: Saved logs for framework_manifest.xml in /tmp/xts-root-dir-52536fdc-556b-4164-880a-cc980d7f5c50/android-gts/logs/2025.01.17_10.04.56/inv_16366652287964525487/framework_manifest.xml_12195088069201165608.txt.gz
01-17 10:05:41 D/FileUtil: Creating temp file at /tmp/12590200/gts/inv_9995701857283177694/inv_6133494755912331788 with prefix "framework_manifest.xml_" suffix ".txt.gz"
01-17 10:05:41 I/LogFileSaver: Saved gzip log file /tmp/12590200/gts/inv_9995701857283177694/inv_6133494755912331788/framework_manifest.xml_5563680550615455123.txt.gz. [size=10, elapsed=1ms]
01-17 10:05:41 D/FileUtil: Creating temp file at /tmp/12590200/gts/inv_9995701857283177694/inv_6133494755912331788 with prefix "SecurityDeviceInfo.deviceinfo.json_" suffix ".txt.gz"
01-17 10:05:41 I/LogFileSaver: Saved gzip log file /tmp/12590200/gts/inv_9995701857283177694/inv_6133494755912331788/SecurityDeviceInfo.deviceinfo.json_3553034834016436529.txt.gz. [size=10, elapsed=0ms]
01-17 10:05:41 D/FileUtil: Creating temp file at /tmp/xts-root-dir-52536fdc-556b-4164-880a-cc980d7f5c50/android-gts/logs/2025.01.17_10.04.56/inv_16366652287964525487 with prefix "device_manifest.xml_" suffix ".txt.gz"
01-17 10:05:41 I/LogFileSaver: Saved gzip log file /tmp/xts-root-dir-52536fdc-556b-4164-880a-cc980d7f5c50/android-gts/logs/2025.01.17_10.04.56/inv_16366652287964525487/device_manifest.xml_15858915948374791280.txt.gz. [size=10, elapsed=0ms]
01-17 10:05:41 D/CertificationSuiteResultReporter: Saved logs for device_manifest.xml in /tmp/xts-root-dir-52536fdc-556b-4164-880a-cc980d7f5c50/android-gts/logs/2025.01.17_10.04.56/inv_16366652287964525487/device_manifest.xml_15858915948374791280.txt.gz
01-17 10:05:41 D/FileUtil: Creating temp file at /tmp/12590200/gts/inv_9995701857283177694/inv_6133494755912331788 with prefix "device_manifest.xml_" suffix ".txt.gz"
01-17 10:05:41 I/LogFileSaver: Saved gzip log file /tmp/12590200/gts/inv_9995701857283177694/inv_6133494755912331788/device_manifest.xml_13920846633983392785.txt.gz. [size=10, elapsed=0ms]
01-17 10:05:41 D/FileUtil: Creating temp file at /tmp/12590200/gts/inv_9995701857283177694/inv_6133494755912331788 with prefix "ClientIdDeviceInfo.deviceinfo.json_" suffix ".txt.gz"
01-17 10:05:41 I/LogFileSaver: Saved gzip log file /tmp/12590200/gts/inv_9995701857283177694/inv_6133494755912331788/ClientIdDeviceInfo.deviceinfo.json_10187039574424486376.txt.gz. [size=10, elapsed=0ms]
01-17 10:05:41 D/InvocationExecution: done with preparer 'com.android.compatibility.common.tradefed.targetprep.DeviceInfoCollector@503b0810' on device: 'SKBFXYZO0DKW' in 33s
01-17 10:05:41 D/InvocationExecution: starting preparer 'com.android.compatibility.common.tradefed.targetprep.ReportLogCollector@4099a644' on device: 'SKBFXYZO0DKW'
01-17 10:05:41 D/InvocationExecution: done with preparer 'com.android.compatibility.common.tradefed.targetprep.ReportLogCollector@4099a644' on device: 'SKBFXYZO0DKW' in 1 ms
01-17 10:05:41 D/InvocationExecution: starting preparer 'com.android.tradefed.targetprep.RunCommandTargetPreparer@ccc39d4' on device: 'SKBFXYZO0DKW'
01-17 10:05:41 D/RunUtil: Running command [adb, -s, SKBFXYZO0DKW, shell, settings, put, global, package_verifier_enable, 0] with timeout: 2m 0s
01-17 10:05:41 D/InvocationExecution: done with preparer 'com.android.tradefed.targetprep.RunCommandTargetPreparer@ccc39d4' on device: 'SKBFXYZO0DKW' in 111 ms
01-17 10:05:41 D/InvocationExecution: starting preparer 'com.android.tradefed.targetprep.RunCommandTargetPreparer@4a16e313' on device: 'SKBFXYZO0DKW'
01-17 10:05:41 D/RunUtil: Running command [adb, -s, SKBFXYZO0DKW, shell, settings, put, global, verifier_engprod, 1] with timeout: 2m 0s
01-17 10:05:41 D/InvocationExecution: done with preparer 'com.android.tradefed.targetprep.RunCommandTargetPreparer@4a16e313' on device: 'SKBFXYZO0DKW' in 72 ms
01-17 10:05:41 D/InvocationExecution: starting preparer 'com.android.compatibility.common.tradefed.targetprep.BusinessLogicPreparer@44834b4c' on device: 'SKBFXYZO0DKW'
01-17 10:05:41 W/BusinessLogicPreparer: Option config-filename isn't set. Using empty string instead.
01-17 10:05:41 W/BusinessLogicPreparer: Option version isn't set. Using 'null' instead.
01-17 10:05:41 D/BusinessLogicPreparer: original version: 12_r2, extracted version: 12_r2
01-17 10:05:41 D/NativeDevice: Using property ro.product.manufacturer=Foxconn from cache.
01-17 10:05:41 I/BusinessLogicPreparer: Using gts from TestSuiteInfo to get value from dynamic config
01-17 10:05:41 I/DynamicConfigFileReader: config files: {gts=/tmp/gts1829483643786074316.dynamic}
01-17 10:05:42 I/BusinessLogicPreparer: Using gts from TestSuiteInfo to get value from dynamic config
01-17 10:05:42 I/DynamicConfigFileReader: config files: {gts=/tmp/gts1829483643786074316.dynamic}
01-17 10:05:42 D/RunUtil: Running command [adb, -s, SKBFXYZO0DKW, shell, getprop, ro.boot.hardware.sku] with timeout: 45s
01-17 10:05:43 D/RunUtil: Running command [adb, -s, SKBFXYZO0DKW, shell, getprop, ro.boot.product.hardware.sku] with timeout: 45s
01-17 10:05:43 D/RunUtil: Running command [adb, -s, SKBFXYZO0DKW, shell, getprop, ro.boot.product.vendor.sku] with timeout: 45s
01-17 10:05:43 D/NativeDevice: Using property ro.build.fingerprint=SKB/BFX_AT100/BFX-AT100:12/STTC.220724.001/15.543.44-20250107:user/release-keys from cache.
01-17 10:05:43 D/NativeDevice: Using property ro.product.device=BFX-AT100 from cache.
01-17 10:05:43 D/NativeDevice: Using property ro.build.version.release=12 from cache.
01-17 10:05:43 D/NativeDevice: Using property ro.build.version.sdk=31 from cache.
01-17 10:05:43 D/NativeDevice: Using property ro.product.brand=SKB from cache.
01-17 10:05:43 D/RunUtil: Running command [adb, -s, SKBFXYZO0DKW, shell, getprop, ro.product.first_api_level] with timeout: 45s
01-17 10:05:43 D/NativeDevice: Using property ro.product.manufacturer=Foxconn from cache.
01-17 10:05:43 D/NativeDevice: Using property ro.product.model=BFX-AT100 from cache.
01-17 10:05:43 D/NativeDevice: Using property ro.product.name=BFX_AT100 from cache.
01-17 10:05:43 I/BusinessLogicPreparer: Using gts from TestSuiteInfo to get value from dynamic config
01-17 10:05:43 I/DynamicConfigFileReader: config files: {gts=/tmp/gts1829483643786074316.dynamic}
01-17 10:05:43 I/BusinessLogicPreparer: Using gts from TestSuiteInfo to get value from dynamic config
01-17 10:05:43 I/DynamicConfigFileReader: config files: {gts=/tmp/gts1829483643786074316.dynamic}
01-17 10:05:43 D/BusinessLogicPreparer: Built param string: "suite_version=12_r2&module_version=null&oem=Foxconn&features=android.hardware.type.television&features=android.software.leanback&properties=search_client_id%3Ams-android-foxconn2-tv&properties=playax_client_id%3Aplay-ad-ms-android-foxconn2-tv&properties=program_client_id%3Apg-android-foxconn2-tv&properties=base_client_id%3Aandroid-foxconn2-tv&properties=playtx_client_id%3Aplay-ms-android-foxconn2-tv&properties=market_client_id%3Aam-android-foxconn2-tv&properties=voicesearch_client_id%3Ams-android-foxconn2-tv&properties=client_id%3Aandroid-foxconn2-tv&properties=ro.boot.hardware.sku%3Anull&properties=ro.boot.product.hardware.sku%3Anull&properties=ro.boot.product.vendor.sku%3Anull&properties=ro.build.fingerprint%3ASKB%2FBFX_AT100%2FBFX-AT100%3A12%2FSTTC.220724.001%2F15.543.44-20250107%3Auser%2Frelease-keys&properties=ro.product.device%3ABFX-AT100&properties=ro.build.version.release%3A12&properties=ro.build.version.sdk%3A31&properties=ro.product.brand%3ASKB&properties=ro.product.first_api_level%3A28&properties=ro.product.manufacturer%3AFoxconn&properties=ro.product.model%3ABFX-AT100&properties=ro.product.name%3ABFX_AT100&packages=com.google.android.gms&packages=com.android.vending&device_info=MemoryDeviceInfo%3Atotal_memory%3A3083894784"
01-17 10:05:43 I/BusinessLogicPreparer: Using gts from TestSuiteInfo to get value from dynamic config
01-17 10:05:43 I/BusinessLogicPreparer: Attempting to connect to business logic service...
01-17 10:05:43 D/BusinessLogicPreparer: Unable to fetch the service key because neither environment variable APE_API_KEY is set nor the key file is dynamically downloaded.
01-17 10:05:46 D/BusinessLogicPreparer: Business Logic Service Response Code : 200
01-17 10:05:46 D/NativeDevice: Using property ro.build.version.sdk=31 from cache.
01-17 10:05:46 D/NativeDevice: Using property ro.build.version.sdk=31 from cache.
01-17 10:05:46 D/NativeDevice: Using property ro.build.version.sdk=31 from cache.
01-17 10:05:46 D/NativeDevice: Using property ro.build.version.sdk=31 from cache.
01-17 10:05:47 D/NativeDevice: Using property ro.build.version.sdk=31 from cache.
01-17 10:05:47 D/RunUtil: Running command [aapt, dump, badging, /tmp/TradefedContentProvider.apk15594654363287609385.apk] with timeout: 1m 0s
01-17 10:05:47 D/RunUtil: Running command [aapt, dump, xmltree, /tmp/TradefedContentProvider.apk15594654363287609385.apk, AndroidManifest.xml] with timeout: 1m 0s
01-17 10:05:47 D/RunUtil: Running command [adb, -s, SKBFXYZO0DKW, shell, appops, write-settings] with timeout: 2m 0s
01-17 10:05:47 D/RunUtil: Running command [adb, -s, SKBFXYZO0DKW, shell, cmd, appops, set, android.tradefed.contentprovider, android:legacy_storage, allow] with timeout: 2m 0s
01-17 10:05:47 D/RunUtil: Running command [adb, -s, SKBFXYZO0DKW, shell, cmd, appops, get, android.tradefed.contentprovider] with timeout: 2m 0s
01-17 10:05:48 D/InvocationExecution: done with preparer 'com.android.compatibility.common.tradefed.targetprep.BusinessLogicPreparer@44834b4c' on device: 'SKBFXYZO0DKW' in 6s
01-17 10:05:48 D/InvocationExecution: starting preparer 'com.android.compatibility.common.tradefed.targetprep.PropertyCheck@2119b0da' on device: 'SKBFXYZO0DKW'
01-17 10:05:48 D/NativeDevice: Using property ro.build.type=user from cache.
01-17 10:05:48 D/InvocationExecution: done with preparer 'com.android.compatibility.common.tradefed.targetprep.PropertyCheck@2119b0da' on device: 'SKBFXYZO0DKW' in 0 ms
01-17 10:05:48 D/InvocationExecution: starting preparer 'com.android.compatibility.common.tradefed.targetprep.PropertyCheck@66f3b280' on device: 'SKBFXYZO0DKW'
01-17 10:05:48 D/RunUtil: Running command [adb, -s, SKBFXYZO0DKW, shell, getprop, ro.product.locale] with timeout: 45s
01-17 10:05:48 W/PropertyCheck: Expected "en-US" but found "ko-KR" for property: ro.product.locale
01-17 10:05:48 D/InvocationExecution: done with preparer 'com.android.compatibility.common.tradefed.targetprep.PropertyCheck@66f3b280' on device: 'SKBFXYZO0DKW' in 48 ms
01-17 10:05:48 D/InvocationExecution: Done with setup of device: 'SKBFXYZO0DKW'
01-17 10:05:48 D/RunUtil: Running command [adb, -s, SKBFXYZO0DKW, shell, uname, -a] with timeout: 2m 0s
01-17 10:05:48 I/InvocationExecution: Device SKBFXYZO0DKW kernel information: 'Linux localhost 4.9.269-abk000c-543r44-20250107 #1 SMP PREEMPT Tue Jan 7 15:21:37 KST 2025 armv8l'
01-17 10:05:48 D/RunUtil: Running command [adb, -s, SKBFXYZO0DKW, shell, getprop, ro.system.build.fingerprint] with timeout: 45s
01-17 10:05:48 I/InvocationExecution: Device SKBFXYZO0DKW system image build information: 'SKB/BFX_AT100/BFX-AT100:12/STTC.220724.001/15.543.44-20250107:user/release-keys'
01-17 10:05:48 D/NativeDevice: Using property ro.vendor.build.fingerprint=SKB/BFX_AT100/BFX-AT100:12/STTC.220724.001/15.543.44-20250107:user/release-keys from cache.
01-17 10:05:48 I/InvocationExecution: Device SKBFXYZO0DKW vendor image build information: 'SKB/BFX_AT100/BFX-AT100:12/STTC.220724.001/15.543.44-20250107:user/release-keys'
01-17 10:05:48 D/InvocationExecution: Total setup duration: 50s'
01-17 10:05:48 D/LogFileSaver: Log data for device_logcat_setup_SKBFXYZO0DKW is already compressed, skipping compression
01-17 10:05:48 D/FileUtil: Creating temp file at /tmp/xts-root-dir-52536fdc-556b-4164-880a-cc980d7f5c50/android-gts/logs/2025.01.17_10.04.56/inv_16366652287964525487 with prefix "device_logcat_setup_SKBFXYZO0DKW_" suffix ".txt"
01-17 10:05:48 I/LogFileSaver: Saved log file /tmp/xts-root-dir-52536fdc-556b-4164-880a-cc980d7f5c50/android-gts/logs/2025.01.17_10.04.56/inv_16366652287964525487/device_logcat_setup_SKBFXYZO0DKW_5522742343444412890.txt. [size=3249251, elapsed=11ms]
01-17 10:05:48 D/CertificationSuiteResultReporter: Saved logs for device_logcat_setup_SKBFXYZO0DKW in /tmp/xts-root-dir-52536fdc-556b-4164-880a-cc980d7f5c50/android-gts/logs/2025.01.17_10.04.56/inv_16366652287964525487/device_logcat_setup_SKBFXYZO0DKW_5522742343444412890.txt
01-17 10:05:48 D/LogFileSaver: Log data for device_logcat_setup_SKBFXYZO0DKW is already compressed, skipping compression
01-17 10:05:48 D/FileUtil: Creating temp file at /tmp/12590200/gts/inv_9995701857283177694/inv_6133494755912331788 with prefix "device_logcat_setup_SKBFXYZO0DKW_" suffix ".txt"
01-17 10:05:48 I/LogFileSaver: Saved log file /tmp/12590200/gts/inv_9995701857283177694/inv_6133494755912331788/device_logcat_setup_SKBFXYZO0DKW_11999455215967132839.txt. [size=3249251, elapsed=28ms]
01-17 10:05:48 D/TestDevice: No snapuserd notification in progress for BLOCK_BEFORE_TEST
01-17 10:05:48 D/PrettyPrintDelimiter: 
===============================
===== TEST PHASE STARTING =====
===============================
01-17 10:05:48 D/RunUtil: Running command [adb, -s, SKBFXYZO0DKW, shell, cmd, device_state, print-states] with timeout: 2m 0s
01-17 10:05:48 D/NativeDevice: Using property ro.product.cpu.abilist=armeabi-v7a,armeabi from cache.
01-17 10:05:48 D/ITestSuite: abi 'armeabi' is supported by device but not by this suite build ([arm64-v8a, armeabi-v7a, x86_64, x86]), tests will not run against it.
01-17 10:05:48 D/BaseTestSuite: Initializing ModuleRepo
ABIs:[{armeabi-v7a, bitness=32}]
Test Args:[com.android.tradefed.testtype.AndroidJUnitTest:exclude-annotation:com.android.interactive.annotations.Interactive, com.android.tradefed.testtype.HostTest:exclude-annotation:com.android.interactive.annotations.Interactive, com.android.compatibility.common.tradefed.testtype.JarHostTest:exclude-annotation:com.android.interactive.annotations.Interactive, com.android.tradefed.testtype.AndroidJUnitTest:exclude-annotation:com.android.xts.root.annotations.RequireAdbRoot, com.android.tradefed.testtype.HostTest:exclude-annotation:com.android.xts.root.annotations.RequireAdbRoot, com.android.compatibility.common.tradefed.testtype.JarHostTest:exclude-annotation:com.android.xts.root.annotations.RequireAdbRoot]
Module Args:[]
Includes: {armeabi-v7a GtsNetStatsHostTestCases=[GtsNetStatsHostTestCases com.google.android.gts.netstats.NetStatsHostTest#testASetThreadStatsUid], armeabi-v7a GtsNetStatsHostTestCases[instant]=[GtsNetStatsHostTestCases[instant] com.google.android.gts.netstats.NetStatsHostTest#testASetThreadStatsUid], armeabi-v7a GtsNetStatsHostTestCases[run-on-secondary-user]=[GtsNetStatsHostTestCases[run-on-secondary-user] com.google.android.gts.netstats.NetStatsHostTest#testASetThreadStatsUid], armeabi-v7a GtsNetStatsHostTestCases[run-on-work-profile]=[GtsNetStatsHostTestCases[run-on-work-profile] com.google.android.gts.netstats.NetStatsHostTest#testASetThreadStatsUid], armeabi-v7a GtsNetStatsHostTestCases[run-on-clone-profile]=[GtsNetStatsHostTestCases[run-on-clone-profile] com.google.android.gts.netstats.NetStatsHostTest#testASetThreadStatsUid], armeabi-v7a GtsNetStatsHostTestCases[run-on-private-profile]=[GtsNetStatsHostTestCases[run-on-private-profile] com.google.android.gts.netstats.NetStatsHostTest#testASetThreadStatsUid]}

01-17 10:05:48 D/BaseTestSuite: Foldable states: [foldable:0:DEFAULT]
01-17 10:05:48 D/BaseTestSuite: Loading tests from [/tmp/xts-root-dir-52536fdc-556b-4164-880a-cc980d7f5c50/android-gts/testcases]
01-17 10:05:49 D/ITestSuite: No remote build info, skipping stageTestArtifacts
01-17 10:05:49 D/ITestSuite: Resource not found for allowed preparers: /suite/google-allowed-preparers.txt
01-17 10:05:49 D/ITestSuite: [Total Unique Modules = 1]
01-17 10:05:49 I/ITestSuite: SKBFXYZO0DKW running 1 modules: [armeabi-v7a GtsNetStatsHostTestCases]
01-17 10:05:49 D/TradefedFeatureClient: invoking feature 'skipFeature'
01-17 10:05:49 D/TradefedFeatureClient: Using reference id from metrics.
01-17 10:05:49 D/TradefedFeatureClient: name: "skipFeature"
reference_id: "c61efc62-8558-4c62-9177-ad348b46518a"

01-17 10:05:49 D/TradefedFeatureServer: Executing com.android.tradefed.result.skipped.SkipFeature@225f7524 with [name: "skipFeature"
reference_id: "c61efc62-8558-4c62-9177-ad348b46518a"
]
01-17 10:05:49 D/TradefedFeatureClient: Feature name: skipFeature. response: multi_part_response {
  response_part {
    key: "delimiter"
    value: "\\+,"
  }
  response_part {
    key: "presubmit"
    value: "false"
  }
  response_part {
    key: "skipModules"
  }
  response_part {
    key: "imageDigests"
  }
}

01-17 10:05:49 D/BaseTestSuite: Filters for 'armeabi-v7a GtsNetStatsHostTestCases': []
01-17 10:05:49 D/FileUtil: Creating temp file at /tmp/tf-workfolder5919320616913033750 with prefix "GtsNetStatsHostTestCases" suffix ".xml"
01-17 10:05:49 D/LogFileSaver: Log data for module-configuration is already compressed, skipping compression
01-17 10:05:49 D/FileUtil: Creating temp file at /tmp/xts-root-dir-52536fdc-556b-4164-880a-cc980d7f5c50/android-gts/logs/2025.01.17_10.04.56/inv_16366652287964525487 with prefix "module-configuration_" suffix ".xml"
01-17 10:05:49 I/LogFileSaver: Saved log file /tmp/xts-root-dir-52536fdc-556b-4164-880a-cc980d7f5c50/android-gts/logs/2025.01.17_10.04.56/inv_16366652287964525487/module-configuration_14202503043360095368.xml. [size=1128, elapsed=1ms]
01-17 10:05:49 D/CertificationSuiteResultReporter: Saved logs for module-configuration in /tmp/xts-root-dir-52536fdc-556b-4164-880a-cc980d7f5c50/android-gts/logs/2025.01.17_10.04.56/inv_16366652287964525487/module-configuration_14202503043360095368.xml
01-17 10:05:49 D/LogFileSaver: Log data for module-configuration is already compressed, skipping compression
01-17 10:05:49 D/FileUtil: Creating temp file at /tmp/12590200/gts/inv_9995701857283177694/inv_6133494755912331788 with prefix "module-configuration_" suffix ".xml"
01-17 10:05:49 I/LogFileSaver: Saved log file /tmp/12590200/gts/inv_9995701857283177694/inv_6133494755912331788/module-configuration_16198589079006475899.xml. [size=1128, elapsed=0ms]
01-17 10:05:49 I/ITestSuite: Running system status checker before module execution: armeabi-v7a GtsNetStatsHostTestCases
01-17 10:05:49 D/NativeDevice: Using property ro.build.version.sdk=31 from cache.
01-17 10:05:49 D/NativeDevice: Using property ro.build.version.sdk=31 from cache.
01-17 10:05:50 D/NativeDevice: Using property ro.build.type=user from cache.
01-17 10:05:50 D/NativeDevice: Using property ro.build.version.sdk=31 from cache.
01-17 10:05:50 D/NativeDevice: Using property ro.build.version.codename=REL from cache.
01-17 10:05:50 D/NativeDevice: Using property ro.build.version.sdk=31 from cache.
01-17 10:05:50 D/NativeDevice: Using property ro.build.version.sdk=31 from cache.
01-17 10:05:50 D/NativeDevice: Using property ro.build.version.sdk=31 from cache.
01-17 10:05:50 D/NativeDevice: Using property ro.build.version.sdk=31 from cache.
01-17 10:05:50 D/NativeDevice: Using property ro.build.version.sdk=31 from cache.
01-17 10:05:50 D/NativeDevice: Using property ro.build.version.sdk=31 from cache.
01-17 10:05:50 D/NativeDevice: Using property ro.build.version.codename=REL from cache.
01-17 10:05:50 D/NativeDevice: Using property ro.build.version.sdk=31 from cache.
01-17 10:05:50 D/NativeDevice: Using property ro.build.version.codename=REL from cache.
01-17 10:05:50 D/NativeDevice: Using property ro.build.version.sdk=31 from cache.
01-17 10:05:50 D/NativeDevice: Using property ro.build.version.codename=REL from cache.
01-17 10:05:50 D/NativeDevice: Using property ro.build.version.sdk=31 from cache.
01-17 10:05:50 D/NativeDevice: Using property ro.build.version.sdk=31 from cache.
01-17 10:05:50 D/NativeDevice: Using property ro.build.version.sdk=31 from cache.
01-17 10:05:50 D/NativeDevice: Using property ro.build.version.sdk=31 from cache.
01-17 10:05:50 D/RunUtil: Running command [adb, -s, SKBFXYZO0DKW, shell, locksettings, get-disabled] with timeout: 2m 0s
01-17 10:05:51 D/RunUtil: Running command [adb, -s, SKBFXYZO0DKW, shell, locksettings, get-disabled] with timeout: 2m 0s
01-17 10:05:52 D/RunUtil: Running command [adb, -s, SKBFXYZO0DKW, shell, input, keyevent, KEYCODE_MENU] with timeout: 2m 0s
01-17 10:05:53 D/RunUtil: Running command [adb, -s, SKBFXYZO0DKW, shell, input, keyevent, KEYCODE_HOME] with timeout: 2m 0s
01-17 10:05:53 I/DeviceBaselineChecker: Enable device baselines disable_os_auto_update,hide_error_dialogs,keep_screen_on,disable_usb_app_verification,clear_lock_screen in 3145 millis.
01-17 10:05:53 D/ModuleDefinition: Running module armeabi-v7a GtsNetStatsHostTestCases
01-17 10:05:53 D/ModuleDefinition: Running setup preparer: SuiteApkInstaller
01-17 10:05:53 D/NativeDevice: Using property ro.build.version.sdk=31 from cache.
01-17 10:05:53 D/NativeDevice: Using property ro.build.version.sdk=31 from cache.
01-17 10:05:53 D/NativeDevice: Using property ro.build.version.codename=REL from cache.
01-17 10:05:53 D/NativeDevice: Using property ro.build.version.sdk=31 from cache.
01-17 10:05:53 D/RunUtil: Running command [adb, -s, SKBFXYZO0DKW, shell, pm, list, features] with timeout: 2m 0s
01-17 10:05:53 D/NativeDevice: Using property ro.build.version.sdk=31 from cache.
01-17 10:05:53 D/NativeDevice: Using property ro.build.version.codename=REL from cache.
01-17 10:05:53 W/SearchArtifactUtil: we have a module name: GtsNetStatsHostTestCases but no directory found in /tmp/xts-root-dir-52536fdc-556b-4164-880a-cc980d7f5c50/android-gts/testcases.
01-17 10:05:53 D/RunUtil: Running command [aapt2, dump, badging, /tmp/xts-root-dir-52536fdc-556b-4164-880a-cc980d7f5c50/android-gts/testcases/GtsNetStatsTestApp.apk] with timeout: 1m 0s
01-17 10:05:53 D/RunUtil: Running command [aapt2, dump, xmltree, /tmp/xts-root-dir-52536fdc-556b-4164-880a-cc980d7f5c50/android-gts/testcases/GtsNetStatsTestApp.apk, --file, AndroidManifest.xml] with timeout: 1m 0s
01-17 10:05:53 D/TestAppInstallSetup: Installing apk com.google.android.netstats.gts.test with [/tmp/xts-root-dir-52536fdc-556b-4164-880a-cc980d7f5c50/android-gts/testcases/GtsNetStatsTestApp.apk] ...
01-17 10:05:53 D/NativeDevice: Using property ro.build.version.sdk=31 from cache.
01-17 10:05:55 D/RunUtil: Running command [aapt, dump, badging, /tmp/xts-root-dir-52536fdc-556b-4164-880a-cc980d7f5c50/android-gts/testcases/GtsNetStatsTestApp.apk] with timeout: 1m 0s
01-17 10:05:55 D/RunUtil: Running command [aapt, dump, xmltree, /tmp/xts-root-dir-52536fdc-556b-4164-880a-cc980d7f5c50/android-gts/testcases/GtsNetStatsTestApp.apk, AndroidManifest.xml] with timeout: 1m 0s
01-17 10:05:55 D/RunUtil: Running command [adb, -s, SKBFXYZO0DKW, shell, appops, write-settings] with timeout: 2m 0s
01-17 10:05:55 W/SearchArtifactUtil: we have a module name: GtsNetStatsHostTestCases but no directory found in /tmp/xts-root-dir-52536fdc-556b-4164-880a-cc980d7f5c50/android-gts/testcases.
01-17 10:05:55 D/RunUtil: Running command [aapt2, dump, badging, /tmp/xts-root-dir-52536fdc-556b-4164-880a-cc980d7f5c50/android-gts/testcases/GtsNetStatsReceiverApp.apk] with timeout: 1m 0s
01-17 10:05:55 D/RunUtil: Running command [aapt2, dump, xmltree, /tmp/xts-root-dir-52536fdc-556b-4164-880a-cc980d7f5c50/android-gts/testcases/GtsNetStatsReceiverApp.apk, --file, AndroidManifest.xml] with timeout: 1m 0s
01-17 10:05:55 D/TestAppInstallSetup: Installing apk com.google.android.netstats.gts.receiver with [/tmp/xts-root-dir-52536fdc-556b-4164-880a-cc980d7f5c50/android-gts/testcases/GtsNetStatsReceiverApp.apk] ...
01-17 10:05:55 D/NativeDevice: Using property ro.build.version.sdk=31 from cache.
01-17 10:05:57 D/RunUtil: Running command [aapt, dump, badging, /tmp/xts-root-dir-52536fdc-556b-4164-880a-cc980d7f5c50/android-gts/testcases/GtsNetStatsReceiverApp.apk] with timeout: 1m 0s
01-17 10:05:57 D/RunUtil: Running command [aapt, dump, xmltree, /tmp/xts-root-dir-52536fdc-556b-4164-880a-cc980d7f5c50/android-gts/testcases/GtsNetStatsReceiverApp.apk, AndroidManifest.xml] with timeout: 1m 0s
01-17 10:05:57 D/RunUtil: Running command [adb, -s, SKBFXYZO0DKW, shell, appops, write-settings] with timeout: 2m 0s
01-17 10:05:57 W/SearchArtifactUtil: we have a module name: GtsNetStatsHostTestCases but no directory found in /tmp/xts-root-dir-52536fdc-556b-4164-880a-cc980d7f5c50/android-gts/testcases.
01-17 10:05:58 D/ModuleListener: ModuleListener.testRunStarted(com.android.compatibility.common.tradefed.testtype.JarHostTest, 1, 0) on SKBFXYZO0DKW
01-17 10:05:58 D/JarHostTest: HostTestListener.testRunStarted(com.google.android.gts.netstats.NetStatsHostTest, 1)
01-17 10:05:58 D/PrettyTestEventLogger: 
==================== com.google.android.gts.netstats.NetStatsHostTest#testASetThreadStatsUid STARTED: Fri Jan 17 10:05:58 KST 2025 ====================
01-17 10:05:58 D/ModuleListener: ModuleListener.testStarted(com.google.android.gts.netstats.NetStatsHostTest#testASetThreadStatsUid) on SKBFXYZO0DKW
01-17 10:05:58 D/NativeDevice: Using property ro.build.version.sdk=31 from cache.
01-17 10:05:58 D/NativeDevice: Using property ro.build.version.sdk=31 from cache.
01-17 10:05:58 D/NativeDevice: Using property ro.build.version.codename=REL from cache.
01-17 10:05:58 D/ListInstrumentationParser: instrumentation:com.android.tradefed.utils.wifi/.WifiUtil (target=com.android.tradefed.utils.wifi)
01-17 10:05:58 D/ListInstrumentationParser: instrumentation:com.google.android.netstats.gts.test/androidx.test.runner.AndroidJUnitRunner (target=com.android.vending)
01-17 10:05:58 D/ListInstrumentationParser: 
01-17 10:05:58 I/RemoteAndroidTestRunner: Running am instrument -w -r --abi armeabi-v7a  -e timeout_msec 600000 -e class 'com.google.android.netstats.gts.test.SetThreadStatsUidTest' com.google.android.netstats.gts.test/androidx.test.runner.AndroidJUnitRunner on foxconn-bfx_at100-SKBFXYZO0DKW
01-17 10:06:01 I/NativeDeviceStateMonitor: Device SKBFXYZO0DKW is already ONLINE
01-17 10:06:01 I/NativeDeviceStateMonitor: Waiting 360000 ms for device SKBFXYZO0DKW boot complete
01-17 10:06:01 I/DeviceStateMonitor: Waiting 359963 ms for device SKBFXYZO0DKW package manager
01-17 10:06:01 I/NativeDeviceStateMonitor: Waiting 359902 ms for device SKBFXYZO0DKW external store
01-17 10:06:01 D/PrettyTestEventLogger: 
==================== com.google.android.gts.netstats.NetStatsHostTest#testASetThreadStatsUid ENDED: Fri Jan 17 10:06:01 KST 2025 ====================
01-17 10:06:01 I/ModuleListener: [1/1] SKBFXYZO0DKW com.android.compatibility.common.tradefed.testtype.JarHostTest com.google.android.gts.netstats.NetStatsHostTest#testASetThreadStatsUid FAILURE: java.lang.AssertionError: Failed to successfully run device tests for com.google.android.netstats.gts.test: Instrumentation run failed due to 'Process crashed.'
	at com.android.tradefed.testtype.junit4.BaseHostJUnit4Test.runDeviceTests(BaseHostJUnit4Test.java:733)
	at com.android.tradefed.testtype.junit4.BaseHostJUnit4Test.runDeviceTests(BaseHostJUnit4Test.java:648)
	at com.android.tradefed.testtype.junit4.BaseHostJUnit4Test.runDeviceTests(BaseHostJUnit4Test.java:591)
	at com.android.tradefed.testtype.junit4.BaseHostJUnit4Test.runDeviceTests(BaseHostJUnit4Test.java:537)
	at com.android.tradefed.testtype.junit4.BaseHostJUnit4Test.runDeviceTests(BaseHostJUnit4Test.java:357)
	at com.android.tradefed.testtype.junit4.BaseHostJUnit4Test.runDeviceTests(BaseHostJUnit4Test.java:245)
	at com.google.android.gts.netstats.NetStatsHostTest.testASetThreadStatsUid(NetStatsHostTest.java:59)
	at java.base/jdk.internal.reflect.DirectMethodHandleAccessor.invoke(DirectMethodHandleAccessor.java:103)
	at java.base/java.lang.reflect.Method.invoke(Method.java:580)
	at org.junit.runners.model.FrameworkMethod$1.runReflectiveCall(FrameworkMethod.java:59)
	at org.junit.internal.runners.model.ReflectiveCallable.run(ReflectiveCallable.java:12)
	at org.junit.runners.model.FrameworkMethod.invokeExplosively(FrameworkMethod.java:61)
	at org.junit.internal.runners.statements.InvokeMethod.evaluate(InvokeMethod.java:17)
	at org.junit.internal.runners.statements.RunBefores.evaluate(RunBefores.java:26)
	at org.junit.internal.runners.statements.RunAfters.evaluate(RunAfters.java:27)
	at org.junit.runners.ParentRunner$3.evaluate(ParentRunner.java:306)
	at org.junit.runners.BlockJUnit4ClassRunner$1.evaluate(BlockJUnit4ClassRunner.java:100)
	at org.junit.runners.ParentRunner.runLeaf(ParentRunner.java:366)
	at org.junit.runners.BlockJUnit4ClassRunner.runChild(BlockJUnit4ClassRunner.java:103)
	at com.android.tradefed.testtype.DeviceJUnit4ClassRunner.runChild(DeviceJUnit4ClassRunner.java:111)
	at com.android.tradefed.testtype.DeviceJUnit4ClassRunner.runChild(DeviceJUnit4ClassRunner.java:63)
	at org.junit.runners.ParentRunner$4.run(ParentRunner.java:331)
	at org.junit.runners.ParentRunner$1.schedule(ParentRunner.java:79)
	at org.junit.runners.ParentRunner.runChildren(ParentRunner.java:329)
	at org.junit.runners.ParentRunner$2.evaluate(ParentRunner.java:293)
	at org.junit.runners.ParentRunner$3.evaluate(ParentRunner.java:306)
	at org.junit.runners.ParentRunner.run(ParentRunner.java:413)
	at com.android.tradefed.testtype.DeviceJUnit4ClassRunner.run(DeviceJUnit4ClassRunner.java:147)
	at com.android.tradefed.testtype.junit4.ExceptionThrowingRunnerWrapper.run(ExceptionThrowingRunnerWrapper.java:43)
	at org.junit.runner.JUnitCore.run(JUnitCore.java:137)
	at com.android.tradefed.testtype.HostTest.runJUnit4Tests(HostTest.java:765)
	at com.android.tradefed.testtype.HostTest.runTestClasses(HostTest.java:645)
	at com.android.tradefed.testtype.HostTest.run(HostTest.java:593)
	at com.android.compatibility.common.tradefed.testtype.JarHostTest.run(JarHostTest.java:56)
	at com.android.tradefed.testtype.suite.GranularRetriableTestWrapper.intraModuleRun(GranularRetriableTestWrapper.java:386)
	at com.android.tradefed.testtype.suite.GranularRetriableTestWrapper.run(GranularRetriableTestWrapper.java:283)
	at com.android.tradefed.testtype.suite.ModuleDefinition.run(ModuleDefinition.java:626)
	at com.android.tradefed.testtype.suite.ITestSuite.runSingleModule(ITestSuite.java:1260)
	at com.android.tradefed.testtype.suite.ITestSuite.run(ITestSuite.java:1027)
	at com.android.tradefed.invoker.InvocationExecution.runTest(InvocationExecution.java:1457)
	at com.android.tradefed.invoker.InvocationExecution.runTests(InvocationExecution.java:1232)
	at com.android.tradefed.invoker.TestInvocation.prepareAndRun(TestInvocation.java:636)
	at com.android.tradefed.invoker.TestInvocation.performInvocation(TestInvocation.java:291)
	at com.android.tradefed.invoker.TestInvocation.invoke(TestInvocation.java:1429)
	at com.android.tradefed.command.CommandScheduler$InvocationThread.run(CommandScheduler.java:692)

01-17 10:06:01 D/JarHostTest: HostTestListener.testRunEnded(3856, {})
01-17 10:06:01 D/ModuleListener: ModuleListener.testRunEnded(3860) on SKBFXYZO0DKW
01-17 10:06:01 D/TestDevice: Uninstalling com.google.android.netstats.gts.receiver with extra args 
01-17 10:06:02 D/TestDevice: Uninstalling com.google.android.netstats.gts.test with extra args 
01-17 10:06:03 I/NativeDeviceStateMonitor: Device SKBFXYZO0DKW is already ONLINE
01-17 10:06:03 I/NativeDeviceStateMonitor: Waiting 360000 ms for device SKBFXYZO0DKW boot complete
01-17 10:06:03 I/DeviceStateMonitor: Waiting 359928 ms for device SKBFXYZO0DKW package manager
01-17 10:06:03 I/NativeDeviceStateMonitor: Waiting 359781 ms for device SKBFXYZO0DKW external store
01-17 10:06:03 I/ConsoleReporter: [SKBFXYZO0DKW] Starting armeabi-v7a GtsNetStatsHostTestCases with 1 test
01-17 10:06:03 I/ConsoleReporter: [1/1 armeabi-v7a GtsNetStatsHostTestCases SKBFXYZO0DKW] com.google.android.gts.netstats.NetStatsHostTest#testASetThreadStatsUid fail: java.lang.AssertionError: Failed to successfully run device tests for com.google.android.netstats.gts.test: Instrumentation run failed due to 'Process crashed.'
	at com.android.tradefed.testtype.junit4.BaseHostJUnit4Test.runDeviceTests(BaseHostJUnit4Test.java:733)
	at com.android.tradefed.testtype.junit4.BaseHostJUnit4Test.runDeviceTests(BaseHostJUnit4Test.java:648)
	at com.android.tradefed.testtype.junit4.BaseHostJUnit4Test.runDeviceTests(BaseHostJUnit4Test.java:591)
	at com.android.tradefed.testtype.junit4.BaseHostJUnit4Test.runDeviceTests(BaseHostJUnit4Test.java:537)
	at com.android.tradefed.testtype.junit4.BaseHostJUnit4Test.runDeviceTests(BaseHostJUnit4Test.java:357)
	at com.android.tradefed.testtype.junit4.BaseHostJUnit4Test.runDeviceTests(BaseHostJUnit4Test.java:245)
	at com.google.android.gts.netstats.NetStatsHostTest.testASetThreadStatsUid(NetStatsHostTest.java:59)
	at java.base/jdk.internal.reflect.DirectMethodHandleAccessor.invoke(DirectMethodHandleAccessor.java:103)
	at java.base/java.lang.reflect.Method.invoke(Method.java:580)
	at org.junit.runners.model.FrameworkMethod$1.runReflectiveCall(FrameworkMethod.java:59)
	at org.junit.internal.runners.model.ReflectiveCallable.run(ReflectiveCallable.java:12)
	at org.junit.runners.model.FrameworkMethod.invokeExplosively(FrameworkMethod.java:61)
	at org.junit.internal.runners.statements.InvokeMethod.evaluate(InvokeMethod.java:17)
	at org.junit.internal.runners.statements.RunBefores.evaluate(RunBefores.java:26)
	at org.junit.internal.runners.statements.RunAfters.evaluate(RunAfters.java:27)
	at org.junit.runners.ParentRunner$3.evaluate(ParentRunner.java:306)
	at org.junit.runners.BlockJUnit4ClassRunner$1.evaluate(BlockJUnit4ClassRunner.java:100)
	at org.junit.runners.ParentRunner.runLeaf(ParentRunner.java:366)
	at org.junit.runners.BlockJUnit4ClassRunner.runChild(BlockJUnit4ClassRunner.java:103)
	at com.android.tradefed.testtype.DeviceJUnit4ClassRunner.runChild(DeviceJUnit4ClassRunner.java:111)
	at com.android.tradefed.testtype.DeviceJUnit4ClassRunner.runChild(DeviceJUnit4ClassRunner.java:63)
	at org.junit.runners.ParentRunner$4.run(ParentRunner.java:331)
	at org.junit.runners.ParentRunner$1.schedule(ParentRunner.java:79)
	at org.junit.runners.ParentRunner.runChildren(ParentRunner.java:329)
	at org.junit.runners.ParentRunner$2.evaluate(ParentRunner.java:293)
	at org.junit.runners.ParentRunner$3.evaluate(ParentRunner.java:306)
	at org.junit.runners.ParentRunner.run(ParentRunner.java:413)
	at com.android.tradefed.testtype.DeviceJUnit4ClassRunner.run(DeviceJUnit4ClassRunner.java:147)
	at com.android.tradefed.testtype.junit4.ExceptionThrowingRunnerWrapper.run(ExceptionThrowingRunnerWrapper.java:43)
	at org.junit.runner.JUnitCore.run(JUnitCore.java:137)
	at com.android.tradefed.testtype.HostTest.runJUnit4Tests(HostTest.java:765)
	at com.android.tradefed.testtype.HostTest.runTestClasses(HostTest.java:645)
	at com.android.tradefed.testtype.HostTest.run(HostTest.java:593)
	at com.android.compatibility.common.tradefed.testtype.JarHostTest.run(JarHostTest.java:56)
	at com.android.tradefed.testtype.suite.GranularRetriableTestWrapper.intraModuleRun(GranularRetriableTestWrapper.java:386)
	at com.android.tradefed.testtype.suite.GranularRetriableTestWrapper.run(GranularRetriableTestWrapper.java:283)
	at com.android.tradefed.testtype.suite.ModuleDefinition.run(ModuleDefinition.java:626)
	at com.android.tradefed.testtype.suite.ITestSuite.runSingleModule(ITestSuite.java:1260)
	at com.android.tradefed.testtype.suite.ITestSuite.run(ITestSuite.java:1027)
	at com.android.tradefed.invoker.InvocationExecution.runTest(InvocationExecution.java:1457)
	at com.android.tradefed.invoker.InvocationExecution.runTests(InvocationExecution.java:1232)
	at com.android.tradefed.invoker.TestInvocation.prepareAndRun(TestInvocation.java:636)
	at com.android.tradefed.invoker.TestInvocation.performInvocation(TestInvocation.java:291)
	at com.android.tradefed.invoker.TestInvocation.invoke(TestInvocation.java:1429)
	at com.android.tradefed.command.CommandScheduler$InvocationThread.run(CommandScheduler.java:692)

01-17 10:06:03 I/ConsoleReporter: [SKBFXYZO0DKW] armeabi-v7a GtsNetStatsHostTestCases completed in 6s. 0 passed, 1 failed, 0 not executed
01-17 10:06:03 I/ITestSuite: Running system status checker after module execution: armeabi-v7a GtsNetStatsHostTestCases
01-17 10:06:03 I/NativeDeviceStateMonitor: Device SKBFXYZO0DKW is already ONLINE
01-17 10:06:03 I/NativeDeviceStateMonitor: Waiting 360000 ms for device SKBFXYZO0DKW boot complete
01-17 10:06:04 I/DeviceStateMonitor: Waiting 359933 ms for device SKBFXYZO0DKW package manager
01-17 10:06:04 I/NativeDeviceStateMonitor: Waiting 359831 ms for device SKBFXYZO0DKW external store
01-17 10:06:06 I/MonitoringUtils: Wifi Connectivity: passed check.
01-17 10:06:06 D/TestDevice: Output from KeyguardController:   KeyguardController:
    mKeyguardShowing=false
    mAodShowing=false
    mKeyguardGoingAway=false

01-17 10:06:06 D/NativeDevice: Using property ro.build.version.sdk=31 from cache.
01-17 10:06:06 D/SystemServerFileDescriptorChecker: Skipping system_server fd check on user builds.
01-17 10:06:06 D/FileUtil: Creating temp file at /tmp/xts-root-dir-52536fdc-556b-4164-880a-cc980d7f5c50/android-gts/results/2025.01.17_10.04.56/proto with prefix "tmp-proto" suffix ""
01-17 10:06:06 D/PrettyPrintDelimiter: 
=============================
===== TEST PHASE ENDING =====
=============================
01-17 10:06:06 D/LogFileSaver: Log data for device_logcat_test_SKBFXYZO0DKW is already compressed, skipping compression
01-17 10:06:06 D/FileUtil: Creating temp file at /tmp/xts-root-dir-52536fdc-556b-4164-880a-cc980d7f5c50/android-gts/logs/2025.01.17_10.04.56/inv_16366652287964525487 with prefix "device_logcat_test_SKBFXYZO0DKW_" suffix ".txt"
01-17 10:06:06 I/LogFileSaver: Saved log file /tmp/xts-root-dir-52536fdc-556b-4164-880a-cc980d7f5c50/android-gts/logs/2025.01.17_10.04.56/inv_16366652287964525487/device_logcat_test_SKBFXYZO0DKW_7602904408205419954.txt. [size=560021, elapsed=1ms]
01-17 10:06:06 D/CertificationSuiteResultReporter: Saved logs for device_logcat_test_SKBFXYZO0DKW in /tmp/xts-root-dir-52536fdc-556b-4164-880a-cc980d7f5c50/android-gts/logs/2025.01.17_10.04.56/inv_16366652287964525487/device_logcat_test_SKBFXYZO0DKW_7602904408205419954.txt
01-17 10:06:06 D/LogFileSaver: Log data for device_logcat_test_SKBFXYZO0DKW is already compressed, skipping compression
01-17 10:06:06 D/FileUtil: Creating temp file at /tmp/12590200/gts/inv_9995701857283177694/inv_6133494755912331788 with prefix "device_logcat_test_SKBFXYZO0DKW_" suffix ".txt"
01-17 10:06:06 I/LogFileSaver: Saved log file /tmp/12590200/gts/inv_9995701857283177694/inv_6133494755912331788/device_logcat_test_SKBFXYZO0DKW_18045633498398747886.txt. [size=560021, elapsed=21ms]
01-17 10:06:06 I/CommandInterrupter: Interrupt blocked
01-17 10:06:06 D/TestInvocation: Testing minimum responsiveness.
01-17 10:06:06 I/NativeDeviceStateMonitor: Device SKBFXYZO0DKW is already ONLINE
01-17 10:06:06 D/RunUtil: Running command [adb, -s, SKBFXYZO0DKW, shell, getprop, ro.build.version.sdk] with timeout: 45s
01-17 10:06:06 D/FileUtil: Creating temp file at /tmp/xts-root-dir-52536fdc-556b-4164-880a-cc980d7f5c50/android-gts/logs/2025.01.17_10.04.56/inv_16366652287964525487 with prefix "executeShellCommandLog_SKBFXYZO0DKW_" suffix ".txt.gz"
01-17 10:06:06 I/LogFileSaver: Saved gzip log file /tmp/xts-root-dir-52536fdc-556b-4164-880a-cc980d7f5c50/android-gts/logs/2025.01.17_10.04.56/inv_16366652287964525487/executeShellCommandLog_SKBFXYZO0DKW_7175520500489623167.txt.gz. [size=10, elapsed=2ms]
01-17 10:06:06 D/CertificationSuiteResultReporter: Saved logs for executeShellCommandLog_SKBFXYZO0DKW in /tmp/xts-root-dir-52536fdc-556b-4164-880a-cc980d7f5c50/android-gts/logs/2025.01.17_10.04.56/inv_16366652287964525487/executeShellCommandLog_SKBFXYZO0DKW_7175520500489623167.txt.gz
01-17 10:06:06 D/FileUtil: Creating temp file at /tmp/12590200/gts/inv_9995701857283177694/inv_6133494755912331788 with prefix "executeShellCommandLog_SKBFXYZO0DKW_" suffix ".txt.gz"
01-17 10:06:06 I/LogFileSaver: Saved gzip log file /tmp/12590200/gts/inv_9995701857283177694/inv_6133494755912331788/executeShellCommandLog_SKBFXYZO0DKW_18405040642537105444.txt.gz. [size=10, elapsed=2ms]
01-17 10:06:06 D/TestInvocation: Checking that devices are online.
01-17 10:06:06 I/NativeDeviceStateMonitor: Device SKBFXYZO0DKW is already ONLINE
01-17 10:06:06 I/NativeDeviceStateMonitor: Waiting 180000 ms for device SKBFXYZO0DKW boot complete
01-17 10:06:06 I/DeviceStateMonitor: Waiting 179963 ms for device SKBFXYZO0DKW package manager
01-17 10:06:06 I/NativeDeviceStateMonitor: Waiting 179902 ms for device SKBFXYZO0DKW external store
01-17 10:06:06 D/InvocationExecution: starting tearDown 'com.android.compatibility.common.tradefed.targetprep.PropertyCheck@66f3b280' on device: 'SKBFXYZO0DKW'
01-17 10:06:06 D/InvocationExecution: done with tearDown 'com.android.compatibility.common.tradefed.targetprep.PropertyCheck@66f3b280' on device: 'SKBFXYZO0DKW' in 1 ms
01-17 10:06:06 D/InvocationExecution: starting tearDown 'com.android.compatibility.common.tradefed.targetprep.PropertyCheck@2119b0da' on device: 'SKBFXYZO0DKW'
01-17 10:06:06 D/InvocationExecution: done with tearDown 'com.android.compatibility.common.tradefed.targetprep.PropertyCheck@2119b0da' on device: 'SKBFXYZO0DKW' in 0 ms
01-17 10:06:06 D/InvocationExecution: starting tearDown 'com.android.compatibility.common.tradefed.targetprep.BusinessLogicPreparer@44834b4c' on device: 'SKBFXYZO0DKW'
01-17 10:06:06 D/NativeDevice: Using property ro.build.version.sdk=31 from cache.
01-17 10:06:06 D/InvocationExecution: done with tearDown 'com.android.compatibility.common.tradefed.targetprep.BusinessLogicPreparer@44834b4c' on device: 'SKBFXYZO0DKW' in 135 ms
01-17 10:06:06 D/InvocationExecution: starting tearDown 'com.android.tradefed.targetprep.RunCommandTargetPreparer@4a16e313' on device: 'SKBFXYZO0DKW'
01-17 10:06:06 D/RunUtil: Running command [adb, -s, SKBFXYZO0DKW, shell, settings, put, global, verifier_engprod, 0] with timeout: 2m 0s
01-17 10:06:07 D/InvocationExecution: done with tearDown 'com.android.tradefed.targetprep.RunCommandTargetPreparer@4a16e313' on device: 'SKBFXYZO0DKW' in 63 ms
01-17 10:06:07 D/InvocationExecution: starting tearDown 'com.android.tradefed.targetprep.RunCommandTargetPreparer@ccc39d4' on device: 'SKBFXYZO0DKW'
01-17 10:06:07 D/RunUtil: Running command [adb, -s, SKBFXYZO0DKW, shell, settings, put, global, package_verifier_enable, 1] with timeout: 2m 0s
01-17 10:06:07 D/InvocationExecution: done with tearDown 'com.android.tradefed.targetprep.RunCommandTargetPreparer@ccc39d4' on device: 'SKBFXYZO0DKW' in 64 ms
01-17 10:06:07 D/InvocationExecution: starting tearDown 'com.android.compatibility.common.tradefed.targetprep.ReportLogCollector@4099a644' on device: 'SKBFXYZO0DKW'
01-17 10:06:07 D/NativeDevice: Using property ro.build.version.sdk=31 from cache.
01-17 10:06:07 D/NativeDevice: Using 'ls' to check doesFileExist(/storage/emulated/0/report-log-files/)
01-17 10:06:07 D/RunUtil: Running command [adb, -s, SKBFXYZO0DKW, shell, ls, '/storage/emulated/0/report-log-files/'] with timeout: 2m 0s
01-17 10:06:07 D/NativeDevice: File /storage/emulated/0/report-log-files/ does not exist.
stdout: 
stderr: ls: /storage/emulated/0/report-log-files/: No such file or directory

01-17 10:06:07 E/NativeDevice: Device path /sdcard/report-log-files/ does not exist to be pulled.
01-17 10:06:07 D/InvocationExecution: done with tearDown 'com.android.compatibility.common.tradefed.targetprep.ReportLogCollector@4099a644' on device: 'SKBFXYZO0DKW' in 112 ms
01-17 10:06:07 D/InvocationExecution: starting tearDown 'com.android.compatibility.common.tradefed.targetprep.DeviceInfoCollector@503b0810' on device: 'SKBFXYZO0DKW'
01-17 10:06:07 D/InvocationExecution: done with tearDown 'com.android.compatibility.common.tradefed.targetprep.DeviceInfoCollector@503b0810' on device: 'SKBFXYZO0DKW' in 2 ms
01-17 10:06:07 D/InvocationExecution: starting tearDown 'com.android.tradefed.targetprep.RunCommandTargetPreparer@727f3ab6' on device: 'SKBFXYZO0DKW'
01-17 10:06:07 D/InvocationExecution: done with tearDown 'com.android.tradefed.targetprep.RunCommandTargetPreparer@727f3ab6' on device: 'SKBFXYZO0DKW' in 0 ms
01-17 10:06:07 D/InvocationExecution: starting tearDown 'com.android.compatibility.common.tradefed.targetprep.WifiCheck@79f35d7d' on device: 'SKBFXYZO0DKW'
01-17 10:06:07 D/InvocationExecution: done with tearDown 'com.android.compatibility.common.tradefed.targetprep.WifiCheck@79f35d7d' on device: 'SKBFXYZO0DKW' in 0 ms
01-17 10:06:07 D/InvocationExecution: starting tearDown 'com.android.compatibility.common.tradefed.targetprep.ApkPreconditionCheck@9b48b9f' on device: 'SKBFXYZO0DKW'
01-17 10:06:07 D/InvocationExecution: done with tearDown 'com.android.compatibility.common.tradefed.targetprep.ApkPreconditionCheck@9b48b9f' on device: 'SKBFXYZO0DKW' in 0 ms
01-17 10:06:07 D/InvocationExecution: starting tearDown 'com.android.compatibility.common.tradefed.targetprep.SettingsPreparer@13ebb72c' on device: 'SKBFXYZO0DKW'
01-17 10:06:07 D/InvocationExecution: done with tearDown 'com.android.compatibility.common.tradefed.targetprep.SettingsPreparer@13ebb72c' on device: 'SKBFXYZO0DKW' in 0 ms
01-17 10:06:07 D/InvocationExecution: starting tearDown 'com.android.compatibility.common.tradefed.targetprep.StayAwakePreparer@19059561' on device: 'SKBFXYZO0DKW'
01-17 10:06:07 D/InvocationExecution: done with tearDown 'com.android.compatibility.common.tradefed.targetprep.StayAwakePreparer@19059561' on device: 'SKBFXYZO0DKW' in 0 ms
01-17 10:06:07 D/InvocationExecution: starting tearDown 'com.android.compatibility.common.tradefed.targetprep.DynamicConfigPusher@6decfc71' on device: 'SKBFXYZO0DKW'
01-17 10:06:07 D/InvocationExecution: done with tearDown 'com.android.compatibility.common.tradefed.targetprep.DynamicConfigPusher@6decfc71' on device: 'SKBFXYZO0DKW' in 1 ms
01-17 10:06:07 D/TestDevice: Uninstalling android.tradefed.contentprovider with extra args 
01-17 10:06:07 D/TestDevice: Uninstalling com.android.tradefed.utils.wifi with extra args 
01-17 10:06:08 D/WifiHelper: Successfully clean up WifiHelper.
01-17 10:06:08 D/RunUtil: Running command [id, -u, dev2-google03] with timeout: 1m 0s
01-17 10:06:08 I/InvocationExecution: Did not find adb log file: /tmp/adb.1000.log, upload skipped.
01-17 10:06:08 D/LogFileSaver: Log data for device_logcat_teardown_SKBFXYZO0DKW is already compressed, skipping compression
01-17 10:06:08 D/FileUtil: Creating temp file at /tmp/xts-root-dir-52536fdc-556b-4164-880a-cc980d7f5c50/android-gts/logs/2025.01.17_10.04.56/inv_16366652287964525487 with prefix "device_logcat_teardown_SKBFXYZO0DKW_" suffix ".txt"
01-17 10:06:08 I/LogFileSaver: Saved log file /tmp/xts-root-dir-52536fdc-556b-4164-880a-cc980d7f5c50/android-gts/logs/2025.01.17_10.04.56/inv_16366652287964525487/device_logcat_teardown_SKBFXYZO0DKW_971446360940857316.txt. [size=64854, elapsed=0ms]
01-17 10:06:08 D/CertificationSuiteResultReporter: Saved logs for device_logcat_teardown_SKBFXYZO0DKW in /tmp/xts-root-dir-52536fdc-556b-4164-880a-cc980d7f5c50/android-gts/logs/2025.01.17_10.04.56/inv_16366652287964525487/device_logcat_teardown_SKBFXYZO0DKW_971446360940857316.txt
01-17 10:06:08 D/LogFileSaver: Log data for device_logcat_teardown_SKBFXYZO0DKW is already compressed, skipping compression
01-17 10:06:08 D/FileUtil: Creating temp file at /tmp/12590200/gts/inv_9995701857283177694/inv_6133494755912331788 with prefix "device_logcat_teardown_SKBFXYZO0DKW_" suffix ".txt"
01-17 10:06:08 I/LogFileSaver: Saved log file /tmp/12590200/gts/inv_9995701857283177694/inv_6133494755912331788/device_logcat_teardown_SKBFXYZO0DKW_1656161030281876237.txt. [size=64854, elapsed=1ms]
01-17 10:06:08 I/TestInvocation: Done stopping logcat for SKBFXYZO0DKW
01-17 10:06:08 D/BackgroundDeviceAction: com.android.ddmlib.TimeoutException while running logcat on SKBFXYZO0DKW. May see duplicated content in log.
01-17 10:06:08 D/BackgroundDeviceAction: Waiting for device SKBFXYZO0DKW online before starting.
01-17 10:06:08 D/CommandScheduler: TestDeviceState for releasing 'SKBFXYZO0DKW(class com.android.tradefed.device.TestDevice)' is 'ONLINE'
01-17 10:06:08 I/NativeDeviceStateMonitor: Waiting 30000 ms for device SKBFXYZO0DKW shell to be responsive
01-17 10:06:08 I/NativeDeviceStateMonitor: shell ready. id output: uid=2000(shell) gid=2000(shell) groups=2000(shell),1004(input),1007(log),1011(adb),1015(sdcard_rw),1028(sdcard_r),1078(ext_data_rw),1079(ext_obb_rw),3001(net_bt_admin),3002(net_bt),3003(inet),3006(net_bw_stats),3009(readproc),3011(uhid) context=u:r:shell:s0

01-17 10:06:08 D/CommandScheduler: Release map of the devices: {com.android.tradefed.device.TestDevice@7c6bb284=AVAILABLE}
01-17 10:06:08 W/NativeDevice: Attempting to stop logcat when not capturing for SKBFXYZO0DKW
01-17 10:06:08 D/TestDevice: No snapuserd notification in progress for BLOCK_BEFORE_RELEASING
