05-06 13:53:10 D/SkipManager: The granularity strategies for device image and build key are FULL_IMAGE and FULL_IMAGE
05-06 13:53:10 D/Configuration: Resolve and download remote files from @Option
05-06 13:53:10 I/TestInvocation: Invocation was started with cmd: tvts-maint-cert -m TvConcurrentMediaPlaybackHostTestCases --module-arg TvConcurrentMediaPlaybackHostTestCases:set-option:codec_combination:AVC-VP9-AV1-HEVC
05-06 13:53:10 I/TestInvocation: Global Config Env Vars: TF_GLOBAL_CONFIG=null, TF_GLOBAL_CONFIG_SERVER_CONFIG=null
05-06 13:53:10 I/TestInvocation: Effective Global Configuration Source: empty
05-06 13:53:10 D/InvocationExecution: Skip linking external directory as FileProperty was set.
05-06 13:53:10 D/RunUtil: Running command [adb, version] with timeout: 2m 0s
05-06 13:53:10 D/TestInvocation: Fetch build duration: 11 ms
05-06 13:53:10 D/ArtifactsAnalyzer: Build analysis report: BuildAnalysis [mDeviceImageChanged=true, mHasTestsArtifacts=true, mHasChangesInTests=false, mUnchangedModules=[], imageDigests={}, artifactDigests={}]
05-06 13:53:10 D/ArtifactsAnalyzer: Analysis report after test analysis: BuildAnalysis [mDeviceImageChanged=true, mHasTestsArtifacts=true, mHasChangesInTests=true, mUnchangedModules=[], imageDigests={}, artifactDigests={testsdir=null}]
05-06 13:53:10 D/NativeDevice: Using property ro.build.version.sdk=29 from cache.
05-06 13:53:10 D/GlobalTestFilter: Setting up global filters
05-06 13:53:10 D/InvocationExecution: IShardHelper selected: com.android.tradefed.invoker.shard.StrictShardHelper@6185479
05-06 13:53:10 D/BackgroundDeviceAction: Waiting for device SKBFXYWR0LWD online before starting.
05-06 13:53:10 D/BackgroundDeviceAction: Device SKBFXYWR0LWD now online.
05-06 13:53:10 D/BackgroundDeviceAction: Starting logcat for SKBFXYWR0LWD.
05-06 13:53:10 I/TestInvocation: Starting invocation for 'tvts' with '[ DeviceBuildInfo{bid=15298624, serial=SKBFXYWR0LWD} on device 'SKBFXYWR0LWD'] 
05-06 13:53:10 D/FileUtil: Creating temp directory at /tmp/15298624/tvts with prefix "inv_"
05-06 13:53:10 D/RunUtil: Running command [chmod, ug+rwx, /tmp/15298624/tvts/inv_13594903554352170475] with timeout: 10s
05-06 13:53:10 D/FileSystemLogSaver: Using log file directory /tmp/15298624/tvts/inv_13594903554352170475
05-06 13:53:10 D/FileUtil: Creating temp directory at /tmp/15298624/tvts/inv_13594903554352170475 with prefix "inv_"
05-06 13:53:10 I/LogFileSaver: Using log file directory /tmp/15298624/tvts/inv_13594903554352170475/inv_8065306156279417283
05-06 13:53:10 D/CertificationSuiteResultReporter: Initializing result directory
05-06 13:53:10 D/CertificationSuiteResultReporter: Results Directory: /home/dev2-google04/android-tvts/android-tvts-2.17r1-arm-15298624/android-tvts/tools/./../../android-tvts/results/2026.05.06_13.53.10
05-06 13:53:10 D/CertificationSuiteResultReporter: Created log dir /home/dev2-google04/android-tvts/android-tvts-2.17r1-arm-15298624/android-tvts/tools/./../../android-tvts/logs/2026.05.06_13.53.10
05-06 13:53:10 D/FileUtil: Creating temp directory at /home/dev2-google04/android-tvts/android-tvts-2.17r1-arm-15298624/android-tvts/tools/./../../android-tvts/logs/2026.05.06_13.53.10 with prefix "inv_"
05-06 13:53:10 I/LogFileSaver: Using log file directory /home/dev2-google04/android-tvts/android-tvts-2.17r1-arm-15298624/android-tvts/tools/./../../android-tvts/logs/2026.05.06_13.53.10/inv_6359429154753753061
05-06 13:53:10 D/CompatibilityProtoResultReporter: Proto Results Directory: /home/dev2-google04/android-tvts/android-tvts-2.17r1-arm-15298624/android-tvts/tools/./../../android-tvts/results/2026.05.06_13.53.10/proto
05-06 13:53:10 D/FileUtil: Creating temp file at /home/dev2-google04/android-tvts/android-tvts-2.17r1-arm-15298624/android-tvts/tools/./../../android-tvts/results/2026.05.06_13.53.10/proto with prefix "tmp-proto" suffix ""
05-06 13:53:10 D/CompatibilityProtoResultReporter: Proto Results Directory: /home/dev2-google04/android-tvts/android-tvts-2.17r1-arm-15298624/android-tvts/tools/./../../android-tvts/results/2026.05.06_13.53.10/proto
05-06 13:53:10 D/TvtsReporterBase: build id: 15298624
05-06 13:53:10 D/TvtsReporterBase: Initializing result directory
05-06 13:53:10 D/RunUtil: Running command [adb, -s, SKBFXYWR0LWD, shell, getprop, ro.build.fingerprint] with timeout: 45s
05-06 13:53:10 D/TvtsReporterBase: build id: 15298624
05-06 13:53:10 D/TvtsReporterBase: Initializing result directory
05-06 13:53:10 D/NativeDevice: Using property ro.build.fingerprint=SKB/BFX_UA300/BFX-UA300:10/QT/19.561.113-20260424:user/release-keys from cache.
05-06 13:53:10 D/TvtsReporterBase: build id: 15298624
05-06 13:53:10 D/TvtsReporterBase: Initializing result directory
05-06 13:53:10 D/NativeDevice: Using property ro.build.fingerprint=SKB/BFX_UA300/BFX-UA300:10/QT/19.561.113-20260424:user/release-keys from cache.
05-06 13:53:10 D/LogFileSaver: Log data for tradefed-expanded-config is already compressed, skipping compression
05-06 13:53:10 D/FileUtil: Creating temp file at /home/dev2-google04/android-tvts/android-tvts-2.17r1-arm-15298624/android-tvts/tools/./../../android-tvts/logs/2026.05.06_13.53.10/inv_6359429154753753061 with prefix "tradefed-expanded-config_" suffix ".xml"
05-06 13:53:10 I/LogFileSaver: Saved log file /home/dev2-google04/android-tvts/android-tvts-2.17r1-arm-15298624/android-tvts/tools/./../../android-tvts/logs/2026.05.06_13.53.10/inv_6359429154753753061/tradefed-expanded-config_7319863183854819477.xml. [size=14382, elapsed=0ms]
05-06 13:53:10 D/CertificationSuiteResultReporter: Saved logs for tradefed-expanded-config in /home/dev2-google04/android-tvts/android-tvts-2.17r1-arm-15298624/android-tvts/tools/./../../android-tvts/logs/2026.05.06_13.53.10/inv_6359429154753753061/tradefed-expanded-config_7319863183854819477.xml
05-06 13:53:10 D/LogFileSaver: Log data for tradefed-expanded-config is already compressed, skipping compression
05-06 13:53:10 D/FileUtil: Creating temp file at /tmp/15298624/tvts/inv_13594903554352170475/inv_8065306156279417283 with prefix "tradefed-expanded-config_" suffix ".xml"
05-06 13:53:10 I/LogFileSaver: Saved log file /tmp/15298624/tvts/inv_13594903554352170475/inv_8065306156279417283/tradefed-expanded-config_2461685829014500381.xml. [size=14382, elapsed=0ms]
05-06 13:53:10 D/RunUtil: Running command [adb, -s, SKBFXYWR0LWD, shell, dumpsys, battery] with timeout: 2m 0s
05-06 13:53:10 D/InvocationExecution: Starting device pre invocation setup for : 'SKBFXYWR0LWD'
05-06 13:53:10 D/DefaultConnection: Instance type for connection: GCE
05-06 13:53:10 D/DefaultConnection: Instance type for connection: GCE. Evaluating for connection type.
05-06 13:53:10 D/NativeDevice: Using connection: com.android.tradefed.device.connection.DefaultConnection@581d70f1 (SKBFXYWR0LWD)
05-06 13:53:10 I/CommandInterrupter: Interrupt allowed
05-06 13:53:10 D/InvocationExecution: Starting setup for device: 'SKBFXYWR0LWD'
05-06 13:53:10 D/InvocationExecution: starting preparer 'com.android.tradefed.targetprep.RunCommandTargetPreparer@1c8832dd' on device: 'SKBFXYWR0LWD'
05-06 13:53:10 D/RunUtil: Running command [adb, -s, SKBFXYWR0LWD, shell, rm, -rf, /sdcard/device-info-files] with timeout: 2m 0s
05-06 13:53:10 D/RunUtil: Running command [adb, -s, SKBFXYWR0LWD, shell, rm, -rf, /sdcard/report-log-files] with timeout: 2m 0s
05-06 13:53:11 D/RunUtil: Running command [adb, -s, SKBFXYWR0LWD, shell, rm, -rf, /storage/emulated/0/Download/failure-screenshots] with timeout: 2m 0s
05-06 13:53:11 D/RunUtil: Running command [adb, -s, SKBFXYWR0LWD, shell, rm, -rf, /sdcard/perfetto-traces] with timeout: 2m 0s
05-06 13:53:11 D/RunUtil: Running command [adb, -s, SKBFXYWR0LWD, shell, rm, -rf, /data/local/tmp/files/audio] with timeout: 2m 0s
05-06 13:53:11 D/InvocationExecution: done with preparer 'com.android.tradefed.targetprep.RunCommandTargetPreparer@1c8832dd' on device: 'SKBFXYWR0LWD' in 353 ms
05-06 13:53:11 D/InvocationExecution: starting preparer 'com.android.compatibility.common.tradefed.targetprep.DeviceInfoCollector@461e83d4' on device: 'SKBFXYWR0LWD'
05-06 13:53:11 D/NativeDevice: Using property ro.build.version.sdk=29 from cache.
05-06 13:53:11 D/RunUtil: Running command [adb, -s, SKBFXYWR0LWD, shell, getprop, ro.product.manufacturer] with timeout: 45s
05-06 13:53:11 D/RunUtil: Running command [adb, -s, SKBFXYWR0LWD, shell, getprop, ro.product.cpu.abilist32] with timeout: 45s
05-06 13:53:11 D/RunUtil: Running command [adb, -s, SKBFXYWR0LWD, shell, getprop, ro.build.reference.fingerprint] with timeout: 45s
05-06 13:53:11 D/RunUtil: Running command [adb, -s, SKBFXYWR0LWD, shell, getprop, ro.product.name] with timeout: 45s
05-06 13:53:11 D/RunUtil: Running command [adb, -s, SKBFXYWR0LWD, shell, getprop, ro.build.tags] with timeout: 45s
05-06 13:53:11 D/RunUtil: Running command [adb, -s, SKBFXYWR0LWD, shell, getprop, ro.build.version.incremental] with timeout: 45s
05-06 13:53:11 D/RunUtil: Running command [adb, -s, SKBFXYWR0LWD, shell, getprop, ro.product.brand] with timeout: 45s
05-06 13:53:11 D/NativeDevice: Using property ro.build.fingerprint=SKB/BFX_UA300/BFX-UA300:10/QT/19.561.113-20260424:user/release-keys from cache.
05-06 13:53:11 D/RunUtil: Running command [adb, -s, SKBFXYWR0LWD, shell, getprop, ro.product.model] with timeout: 45s
05-06 13:53:11 D/RunUtil: Running command [adb, -s, SKBFXYWR0LWD, shell, getprop, ro.product.device] with timeout: 45s
05-06 13:53:11 D/RunUtil: Running command [adb, -s, SKBFXYWR0LWD, shell, getprop, ro.build.id] with timeout: 45s
05-06 13:53:11 D/RunUtil: Running command [adb, -s, SKBFXYWR0LWD, shell, getprop, ro.bootimage.build.fingerprint] with timeout: 45s
05-06 13:53:11 D/NativeDevice: Using property ro.build.version.sdk=29 from cache.
05-06 13:53:11 D/RunUtil: Running command [adb, -s, SKBFXYWR0LWD, shell, getprop, ro.serialno] with timeout: 45s
05-06 13:53:11 D/RunUtil: Running command [adb, -s, SKBFXYWR0LWD, shell, getprop, ro.build.version.security_patch] with timeout: 45s
05-06 13:53:11 D/RunUtil: Running command [adb, -s, SKBFXYWR0LWD, shell, getprop, ro.product.cpu.abi] with timeout: 45s
05-06 13:53:11 D/RunUtil: Running command [adb, -s, SKBFXYWR0LWD, shell, getprop, ro.product.cpu.abilist64] with timeout: 45s
05-06 13:53:12 D/RunUtil: Running command [adb, -s, SKBFXYWR0LWD, shell, getprop, ro.vendor.build.fingerprint] with timeout: 45s
05-06 13:53:12 D/RunUtil: Running command [adb, -s, SKBFXYWR0LWD, shell, getprop, ro.build.version.base_os] with timeout: 45s
05-06 13:53:12 D/NativeDevice: Using property ro.build.version.sdk=29 from cache.
05-06 13:53:12 D/RunUtil: Running command [adb, -s, SKBFXYWR0LWD, shell, getprop, ro.product.cpu.abilist] with timeout: 45s
05-06 13:53:12 D/RunUtil: Running command [adb, -s, SKBFXYWR0LWD, shell, getprop, ro.product.board] with timeout: 45s
05-06 13:53:12 D/RunUtil: Running command [adb, -s, SKBFXYWR0LWD, shell, getprop, ro.build.type] with timeout: 45s
05-06 13:53:12 D/RunUtil: Running command [adb, -s, SKBFXYWR0LWD, shell, getprop, ro.build.version.release] with timeout: 45s
05-06 13:53:12 D/RunUtil: Running command [adb, -s, SKBFXYWR0LWD, shell, getprop, ro.product.cpu.abi2] with timeout: 45s
05-06 13:53:12 D/SearchArtifactUtil: Searching for file TvtsDeviceInfo.apk. Search directories: [./../../android-tvts/testcases, /tmp/tf-workfolder8409073234652177337]
05-06 13:53:12 D/SearchArtifactUtil: Found file /home/dev2-google04/android-tvts/android-tvts-2.17r1-arm-15298624/android-tvts/tools/./../../android-tvts/testcases/TvtsDeviceInfo.apk in search directory /home/dev2-google04/android-tvts/android-tvts-2.17r1-arm-15298624/android-tvts/tools/./../../android-tvts/testcases.
05-06 13:53:12 D/RunUtil: Running command [adb, -s, SKBFXYWR0LWD, shell, dumpsys, package, p] with timeout: 2m 0s
05-06 13:53:12 I/NativeDeviceStateMonitor: Device SKBFXYWR0LWD is already ONLINE
05-06 13:53:12 I/NativeDeviceStateMonitor: Waiting 359999 ms for device SKBFXYWR0LWD boot complete
05-06 13:53:12 D/RunUtil: Running command [adb, -s, SKBFXYWR0LWD, shell, getprop dev.bootcomplete] without timeout.
05-06 13:53:12 I/DeviceStateMonitor: Waiting 359935 ms for device SKBFXYWR0LWD package manager
05-06 13:53:12 D/RunUtil: Running command [adb, -s, SKBFXYWR0LWD, shell, pm path android] without timeout.
05-06 13:53:12 I/NativeDeviceStateMonitor: Waiting 359832 ms for device SKBFXYWR0LWD external store
05-06 13:53:12 D/RunUtil: Running command [adb, -s, SKBFXYWR0LWD, shell, echo, $EXTERNAL_STORAGE] with timeout: 2m 0s
05-06 13:53:12 D/RunUtil: Running command [adb, -s, SKBFXYWR0LWD, shell, stat -f -c "%t" /sdcard] without timeout.
05-06 13:53:12 D/RunUtil: Running command [adb, -s, SKBFXYWR0LWD, shell, echo 'number 1778043192759 one' > '/sdcard/1778043192759'] without timeout.
05-06 13:53:12 D/RunUtil: Running command [adb, -s, SKBFXYWR0LWD, shell, cat '/sdcard/1778043192759'] without timeout.
05-06 13:53:12 D/RunUtil: Running command [adb, -s, SKBFXYWR0LWD, shell, rm '/sdcard/1778043192759'] without timeout.
05-06 13:53:13 I/ApkInstrumentationPreparer: Instrumenting package: com.android.compatibility.common.deviceinfo
05-06 13:53:13 D/NativeDevice: Using property ro.build.version.sdk=29 from cache.
05-06 13:53:13 D/NativeDevice: Using property ro.build.version.codename=REL from cache.
05-06 13:53:13 D/NativeDevice: Using property ro.build.version.sdk=29 from cache.
05-06 13:53:13 D/NativeDevice: Using property ro.build.version.codename=REL from cache.
05-06 13:53:13 D/AndroidJUnitTest: Disabled test storage as it's not supported on that branch.
05-06 13:53:13 D/NativeDevice: Using property ro.build.version.sdk=29 from cache.
05-06 13:53:13 D/NativeDevice: Using property ro.build.version.codename=REL from cache.
05-06 13:53:13 D/NativeDevice: Using property ro.build.version.sdk=29 from cache.
05-06 13:53:13 D/RunUtil: Running command [adb, -s, SKBFXYWR0LWD, install, -r, -g, /home/dev2-google04/android-tvts/android-tvts-2.17r1-arm-15298624/android-tvts/tools/./../../android-tvts/testcases/TvtsDeviceInfo.apk] with timeout: 4m 0s
05-06 13:53:21 D/RunUtil: Running command [aapt, dump, badging, /home/dev2-google04/android-tvts/android-tvts-2.17r1-arm-15298624/android-tvts/tools/./../../android-tvts/testcases/TvtsDeviceInfo.apk] with timeout: 1m 0s
05-06 13:53:21 D/RunUtil: Running command [aapt, dump, xmltree, /home/dev2-google04/android-tvts/android-tvts-2.17r1-arm-15298624/android-tvts/tools/./../../android-tvts/testcases/TvtsDeviceInfo.apk, AndroidManifest.xml] with timeout: 1m 0s
05-06 13:53:22 D/RunUtil: Running command [adb, -s, SKBFXYWR0LWD, shell, appops, write-settings] with timeout: 2m 0s
05-06 13:53:22 D/ListInstrumentationParser: instrumentation:com.android.compatibility.common.deviceinfo/androidx.test.runner.AndroidJUnitRunner (target=com.android.compatibility.common.deviceinfo)
05-06 13:53:22 D/ListInstrumentationParser: instrumentation:com.android.tradefed.utils.wifi/.WifiUtil (target=com.android.tradefed.utils.wifi)
05-06 13:53:22 D/ListInstrumentationParser: instrumentation:com.google.android.leanbackjank/androidx.test.runner.AndroidJUnitRunner (target=com.google.android.jank.tvts)
05-06 13:53:22 D/ListInstrumentationParser: 
05-06 13:53:22 I/InstrumentationTest: No runner name specified. Using: androidx.test.runner.AndroidJUnitRunner.
05-06 13:53:22 D/NativeDevice: Using property ro.build.version.sdk=29 from cache.
05-06 13:53:22 D/NativeDevice: Using property ro.build.version.codename=REL from cache.
05-06 13:53:22 D/NativeDevice: Using property ro.build.version.sdk=29 from cache.
05-06 13:53:22 D/NativeDevice: Using property ro.build.version.codename=REL from cache.
05-06 13:53:22 D/InstrumentationTest: Initializing com.android.tradefed.device.metric.CountTestCasesCollector for instrumentation.
05-06 13:53:22 I/RemoteAndroidTestRunner: Running am instrument -w -r --no-isolated-storage  -e newRunListenerMode true -e timeout_msec 300000 com.android.compatibility.common.deviceinfo/androidx.test.runner.AndroidJUnitRunner on foxconn-bfx_ua300-SKBFXYWR0LWD
05-06 13:54:14 D/RunUtil: Running command [adb, -s, SKBFXYWR0LWD, uninstall, com.android.compatibility.common.deviceinfo] with timeout: 2m 0s
05-06 13:54:15 W/ApkInstrumentationPreparer: Target preparation step com.android.compatibility.common.deviceinfo.KeystoreAttestationDeviceInfo#testCollectDeviceInfo failed.
java.lang.NoSuchMethodError: No virtual method setDevicePropertiesAttestationIncluded(Z)Landroid/security/keystore/KeyGenParameterSpec$Builder; in class Landroid/security/keystore/KeyGenParameterSpec$Builder; or its super classes (declaration of 'android.security.keystore.KeyGenParameterSpec$Builder' appears in /system/framework/framework.jar!classes2.dex)
	at com.android.compatibility.common.deviceinfo.KeystoreAttestationDeviceInfo.collectAttestation(KeystoreAttestationDeviceInfo.java:90)
	at com.android.compatibility.common.deviceinfo.KeystoreAttestationDeviceInfo.collectDeviceInfo(KeystoreAttestationDeviceInfo.java:58)
	at com.android.compatibility.common.deviceinfo.DeviceInfo.testCollectDeviceInfo(DeviceInfo.java:96)
	at java.lang.reflect.Method.invoke(Native Method)
	at android.test.InstrumentationTestCase.runMethod(InstrumentationTestCase.java:220)
	at android.test.InstrumentationTestCase.runTest(InstrumentationTestCase.java:205)

05-06 13:54:15 D/NativeDevice: Using property ro.build.version.sdk=29 from cache.
05-06 13:54:15 D/NativeDevice: Using 'ls' to check doesFileExist(/storage/emulated/0/device-info-files/)
05-06 13:54:15 D/RunUtil: Running command [adb, -s, SKBFXYWR0LWD, shell, ls, '/storage/emulated/0/device-info-files/'] with timeout: 2m 0s
05-06 13:54:16 D/RunUtil: Running command [adb, -s, SKBFXYWR0LWD, shell, ls, -l, /\/sdcard\/device-info-files\//] with timeout: 2m 0s
05-06 13:54:16 D/RunUtil: Running command [adb, -s, SKBFXYWR0LWD, pull, //sdcard/device-info-files//device_manifest.xml, /tmp/device-info-files14628884986715459181/device_manifest.xml] with timeout: 2m 0s
05-06 13:54:16 D/RunUtil: Running command [adb, -s, SKBFXYWR0LWD, pull, //sdcard/device-info-files//ConnectivityDeviceInfo.deviceinfo.json, /tmp/device-info-files14628884986715459181/ConnectivityDeviceInfo.deviceinfo.json] with timeout: 2m 0s
05-06 13:54:16 D/RunUtil: Running command [adb, -s, SKBFXYWR0LWD, pull, //sdcard/device-info-files//framework_manifest.xml, /tmp/device-info-files14628884986715459181/framework_manifest.xml] with timeout: 2m 0s
05-06 13:54:16 D/RunUtil: Running command [adb, -s, SKBFXYWR0LWD, pull, //sdcard/device-info-files//AppStandbyDeviceInfo.deviceinfo.json, /tmp/device-info-files14628884986715459181/AppStandbyDeviceInfo.deviceinfo.json] with timeout: 2m 0s
05-06 13:54:16 D/RunUtil: Running command [adb, -s, SKBFXYWR0LWD, pull, //sdcard/device-info-files//MemoryDeviceInfo.deviceinfo.json, /tmp/device-info-files14628884986715459181/MemoryDeviceInfo.deviceinfo.json] with timeout: 2m 0s
05-06 13:54:16 D/RunUtil: Running command [adb, -s, SKBFXYWR0LWD, pull, //sdcard/device-info-files//CpuDeviceInfo.deviceinfo.json, /tmp/device-info-files14628884986715459181/CpuDeviceInfo.deviceinfo.json] with timeout: 2m 0s
05-06 13:54:16 D/RunUtil: Running command [adb, -s, SKBFXYWR0LWD, pull, //sdcard/device-info-files//MediaDeviceInfo.deviceinfo.json, /tmp/device-info-files14628884986715459181/MediaDeviceInfo.deviceinfo.json] with timeout: 2m 0s
05-06 13:54:16 D/RunUtil: Running command [adb, -s, SKBFXYWR0LWD, pull, //sdcard/device-info-files//device_compatibility_matrix.xml, /tmp/device-info-files14628884986715459181/device_compatibility_matrix.xml] with timeout: 2m 0s
05-06 13:54:16 D/RunUtil: Running command [adb, -s, SKBFXYWR0LWD, pull, //sdcard/device-info-files//GnssDeviceInfo.deviceinfo.json, /tmp/device-info-files14628884986715459181/GnssDeviceInfo.deviceinfo.json] with timeout: 2m 0s
05-06 13:54:16 D/RunUtil: Running command [adb, -s, SKBFXYWR0LWD, pull, //sdcard/device-info-files//StorageDeviceInfo.deviceinfo.json, /tmp/device-info-files14628884986715459181/StorageDeviceInfo.deviceinfo.json] with timeout: 2m 0s
05-06 13:54:16 D/RunUtil: Running command [adb, -s, SKBFXYWR0LWD, pull, //sdcard/device-info-files//GraphicsDeviceInfo.deviceinfo.json, /tmp/device-info-files14628884986715459181/GraphicsDeviceInfo.deviceinfo.json] with timeout: 2m 0s
05-06 13:54:16 D/RunUtil: Running command [adb, -s, SKBFXYWR0LWD, pull, //sdcard/device-info-files//ConfigurationDeviceInfo.deviceinfo.json, /tmp/device-info-files14628884986715459181/ConfigurationDeviceInfo.deviceinfo.json] with timeout: 2m 0s
05-06 13:54:16 D/RunUtil: Running command [adb, -s, SKBFXYWR0LWD, pull, //sdcard/device-info-files//DefaultAppDeviceInfo.deviceinfo.json, /tmp/device-info-files14628884986715459181/DefaultAppDeviceInfo.deviceinfo.json] with timeout: 2m 0s
05-06 13:54:16 D/RunUtil: Running command [adb, -s, SKBFXYWR0LWD, pull, //sdcard/device-info-files//framework_compatibility_matrix.xml, /tmp/device-info-files14628884986715459181/framework_compatibility_matrix.xml] with timeout: 2m 0s
05-06 13:54:16 D/RunUtil: Running command [adb, -s, SKBFXYWR0LWD, pull, //sdcard/device-info-files//BiometricsDeviceInfo.deviceinfo.json, /tmp/device-info-files14628884986715459181/BiometricsDeviceInfo.deviceinfo.json] with timeout: 2m 0s
05-06 13:54:16 D/RunUtil: Running command [adb, -s, SKBFXYWR0LWD, pull, //sdcard/device-info-files//GenericDeviceInfo.deviceinfo.json, /tmp/device-info-files14628884986715459181/GenericDeviceInfo.deviceinfo.json] with timeout: 2m 0s
05-06 13:54:16 D/RunUtil: Running command [adb, -s, SKBFXYWR0LWD, pull, //sdcard/device-info-files//PackageDeviceInfo.deviceinfo.json, /tmp/device-info-files14628884986715459181/PackageDeviceInfo.deviceinfo.json] with timeout: 2m 0s
05-06 13:54:17 D/RunUtil: Running command [adb, -s, SKBFXYWR0LWD, pull, //sdcard/device-info-files//FeatureDeviceInfo.deviceinfo.json, /tmp/device-info-files14628884986715459181/FeatureDeviceInfo.deviceinfo.json] with timeout: 2m 0s
05-06 13:54:17 D/RunUtil: Running command [adb, -s, SKBFXYWR0LWD, pull, //sdcard/device-info-files//VintfDeviceInfo.deviceinfo.json, /tmp/device-info-files14628884986715459181/VintfDeviceInfo.deviceinfo.json] with timeout: 2m 0s
05-06 13:54:17 D/RunUtil: Running command [adb, -s, SKBFXYWR0LWD, pull, //sdcard/device-info-files//HapticsDeviceInfo.deviceinfo.json, /tmp/device-info-files14628884986715459181/HapticsDeviceInfo.deviceinfo.json] with timeout: 2m 0s
05-06 13:54:17 D/RunUtil: Running command [adb, -s, SKBFXYWR0LWD, pull, //sdcard/device-info-files//LocaleDeviceInfo.deviceinfo.json, /tmp/device-info-files14628884986715459181/LocaleDeviceInfo.deviceinfo.json] with timeout: 2m 0s
05-06 13:54:17 D/RunUtil: Running command [adb, -s, SKBFXYWR0LWD, pull, //sdcard/device-info-files//DeviceIdleDeviceInfo.deviceinfo.json, /tmp/device-info-files14628884986715459181/DeviceIdleDeviceInfo.deviceinfo.json] with timeout: 2m 0s
05-06 13:54:17 D/RunUtil: Running command [adb, -s, SKBFXYWR0LWD, pull, //sdcard/device-info-files//InputDeviceInfo.deviceinfo.json, /tmp/device-info-files14628884986715459181/InputDeviceInfo.deviceinfo.json] with timeout: 2m 0s
05-06 13:54:17 D/RunUtil: Running command [adb, -s, SKBFXYWR0LWD, pull, //sdcard/device-info-files//UserDeviceInfo.deviceinfo.json, /tmp/device-info-files14628884986715459181/UserDeviceInfo.deviceinfo.json] with timeout: 2m 0s
05-06 13:54:17 D/RunUtil: Running command [adb, -s, SKBFXYWR0LWD, pull, //sdcard/device-info-files//KeystoreAttestationDeviceInfo.deviceinfo.json, /tmp/device-info-files14628884986715459181/KeystoreAttestationDeviceInfo.deviceinfo.json] with timeout: 2m 0s
05-06 13:54:17 D/RunUtil: Running command [adb, -s, SKBFXYWR0LWD, pull, //sdcard/device-info-files//ClientIdDeviceInfo.deviceinfo.json, /tmp/device-info-files14628884986715459181/ClientIdDeviceInfo.deviceinfo.json] with timeout: 2m 0s
05-06 13:54:17 D/RunUtil: Running command [adb, -s, SKBFXYWR0LWD, pull, //sdcard/device-info-files//MediaOutputDeviceInfo.deviceinfo.json, /tmp/device-info-files14628884986715459181/MediaOutputDeviceInfo.deviceinfo.json] with timeout: 2m 0s
05-06 13:54:17 D/FileUtil: Creating temp file at /tmp/15298624/tvts/inv_13594903554352170475/inv_8065306156279417283 with prefix "CpuDeviceInfo.deviceinfo.json_" suffix ".txt.gz"
05-06 13:54:17 I/LogFileSaver: Saved gzip log file /tmp/15298624/tvts/inv_13594903554352170475/inv_8065306156279417283/CpuDeviceInfo.deviceinfo.json_6562248040619600307.txt.gz. [size=10, elapsed=2ms]
05-06 13:54:17 D/FileUtil: Creating temp file at /tmp/15298624/tvts/inv_13594903554352170475/inv_8065306156279417283 with prefix "InputDeviceInfo.deviceinfo.json_" suffix ".txt.gz"
05-06 13:54:17 I/LogFileSaver: Saved gzip log file /tmp/15298624/tvts/inv_13594903554352170475/inv_8065306156279417283/InputDeviceInfo.deviceinfo.json_13156040086292532131.txt.gz. [size=10, elapsed=1ms]
05-06 13:54:17 D/FileUtil: Creating temp file at /tmp/15298624/tvts/inv_13594903554352170475/inv_8065306156279417283 with prefix "ClientIdDeviceInfo.deviceinfo.json_" suffix ".txt.gz"
05-06 13:54:17 I/LogFileSaver: Saved gzip log file /tmp/15298624/tvts/inv_13594903554352170475/inv_8065306156279417283/ClientIdDeviceInfo.deviceinfo.json_7852938629902860914.txt.gz. [size=10, elapsed=1ms]
05-06 13:54:17 D/FileUtil: Creating temp file at /tmp/15298624/tvts/inv_13594903554352170475/inv_8065306156279417283 with prefix "UserDeviceInfo.deviceinfo.json_" suffix ".txt.gz"
05-06 13:54:17 I/LogFileSaver: Saved gzip log file /tmp/15298624/tvts/inv_13594903554352170475/inv_8065306156279417283/UserDeviceInfo.deviceinfo.json_17376280651187301246.txt.gz. [size=10, elapsed=0ms]
05-06 13:54:17 D/FileUtil: Creating temp file at /tmp/15298624/tvts/inv_13594903554352170475/inv_8065306156279417283 with prefix "LocaleDeviceInfo.deviceinfo.json_" suffix ".txt.gz"
05-06 13:54:17 I/LogFileSaver: Saved gzip log file /tmp/15298624/tvts/inv_13594903554352170475/inv_8065306156279417283/LocaleDeviceInfo.deviceinfo.json_14933491381512863407.txt.gz. [size=10, elapsed=1ms]
05-06 13:54:17 D/FileUtil: Creating temp file at /tmp/15298624/tvts/inv_13594903554352170475/inv_8065306156279417283 with prefix "MediaDeviceInfo.deviceinfo.json_" suffix ".txt.gz"
05-06 13:54:17 I/LogFileSaver: Saved gzip log file /tmp/15298624/tvts/inv_13594903554352170475/inv_8065306156279417283/MediaDeviceInfo.deviceinfo.json_6939090742803095288.txt.gz. [size=10, elapsed=2ms]
05-06 13:54:17 D/FileUtil: Creating temp file at /tmp/15298624/tvts/inv_13594903554352170475/inv_8065306156279417283 with prefix "MemoryDeviceInfo.deviceinfo.json_" suffix ".txt.gz"
05-06 13:54:17 I/LogFileSaver: Saved gzip log file /tmp/15298624/tvts/inv_13594903554352170475/inv_8065306156279417283/MemoryDeviceInfo.deviceinfo.json_12417720690881011479.txt.gz. [size=10, elapsed=0ms]
05-06 13:54:17 D/FileUtil: Creating temp file at /tmp/15298624/tvts/inv_13594903554352170475/inv_8065306156279417283 with prefix "GnssDeviceInfo.deviceinfo.json_" suffix ".txt.gz"
05-06 13:54:17 I/LogFileSaver: Saved gzip log file /tmp/15298624/tvts/inv_13594903554352170475/inv_8065306156279417283/GnssDeviceInfo.deviceinfo.json_8834698472343532946.txt.gz. [size=10, elapsed=1ms]
05-06 13:54:17 D/FileUtil: Creating temp file at /tmp/15298624/tvts/inv_13594903554352170475/inv_8065306156279417283 with prefix "ConnectivityDeviceInfo.deviceinfo.json_" suffix ".txt.gz"
05-06 13:54:17 I/LogFileSaver: Saved gzip log file /tmp/15298624/tvts/inv_13594903554352170475/inv_8065306156279417283/ConnectivityDeviceInfo.deviceinfo.json_7226503033207682082.txt.gz. [size=10, elapsed=0ms]
05-06 13:54:17 D/FileUtil: Creating temp file at /tmp/15298624/tvts/inv_13594903554352170475/inv_8065306156279417283 with prefix "VintfDeviceInfo.deviceinfo.json_" suffix ".txt.gz"
05-06 13:54:17 I/LogFileSaver: Saved gzip log file /tmp/15298624/tvts/inv_13594903554352170475/inv_8065306156279417283/VintfDeviceInfo.deviceinfo.json_9043853147258542104.txt.gz. [size=10, elapsed=1ms]
05-06 13:54:17 D/FileUtil: Creating temp file at /tmp/15298624/tvts/inv_13594903554352170475/inv_8065306156279417283 with prefix "DefaultAppDeviceInfo.deviceinfo.json_" suffix ".txt.gz"
05-06 13:54:17 I/LogFileSaver: Saved gzip log file /tmp/15298624/tvts/inv_13594903554352170475/inv_8065306156279417283/DefaultAppDeviceInfo.deviceinfo.json_13962346804707506383.txt.gz. [size=10, elapsed=1ms]
05-06 13:54:17 D/FileUtil: Creating temp file at /tmp/15298624/tvts/inv_13594903554352170475/inv_8065306156279417283 with prefix "PackageDeviceInfo.deviceinfo.json_" suffix ".txt.gz"
05-06 13:54:17 I/LogFileSaver: Saved gzip log file /tmp/15298624/tvts/inv_13594903554352170475/inv_8065306156279417283/PackageDeviceInfo.deviceinfo.json_12657511551436476992.txt.gz. [size=22437, elapsed=12ms]
05-06 13:54:17 D/FileUtil: Creating temp file at /home/dev2-google04/android-tvts/android-tvts-2.17r1-arm-15298624/android-tvts/tools/./../../android-tvts/logs/2026.05.06_13.53.10/inv_6359429154753753061 with prefix "device_manifest.xml_" suffix ".txt.gz"
05-06 13:54:17 I/LogFileSaver: Saved gzip log file /home/dev2-google04/android-tvts/android-tvts-2.17r1-arm-15298624/android-tvts/tools/./../../android-tvts/logs/2026.05.06_13.53.10/inv_6359429154753753061/device_manifest.xml_13320697475395978651.txt.gz. [size=10, elapsed=0ms]
05-06 13:54:17 D/CertificationSuiteResultReporter: Saved logs for device_manifest.xml in /home/dev2-google04/android-tvts/android-tvts-2.17r1-arm-15298624/android-tvts/tools/./../../android-tvts/logs/2026.05.06_13.53.10/inv_6359429154753753061/device_manifest.xml_13320697475395978651.txt.gz
05-06 13:54:17 D/FileUtil: Creating temp file at /tmp/15298624/tvts/inv_13594903554352170475/inv_8065306156279417283 with prefix "device_manifest.xml_" suffix ".txt.gz"
05-06 13:54:17 I/LogFileSaver: Saved gzip log file /tmp/15298624/tvts/inv_13594903554352170475/inv_8065306156279417283/device_manifest.xml_1923403829598259658.txt.gz. [size=10, elapsed=1ms]
05-06 13:54:17 D/FileUtil: Creating temp file at /home/dev2-google04/android-tvts/android-tvts-2.17r1-arm-15298624/android-tvts/tools/./../../android-tvts/logs/2026.05.06_13.53.10/inv_6359429154753753061 with prefix "framework_compatibility_matrix.xml_" suffix ".txt.gz"
05-06 13:54:17 I/LogFileSaver: Saved gzip log file /home/dev2-google04/android-tvts/android-tvts-2.17r1-arm-15298624/android-tvts/tools/./../../android-tvts/logs/2026.05.06_13.53.10/inv_6359429154753753061/framework_compatibility_matrix.xml_13992926772269765193.txt.gz. [size=10, elapsed=2ms]
05-06 13:54:17 D/CertificationSuiteResultReporter: Saved logs for framework_compatibility_matrix.xml in /home/dev2-google04/android-tvts/android-tvts-2.17r1-arm-15298624/android-tvts/tools/./../../android-tvts/logs/2026.05.06_13.53.10/inv_6359429154753753061/framework_compatibility_matrix.xml_13992926772269765193.txt.gz
05-06 13:54:17 D/FileUtil: Creating temp file at /tmp/15298624/tvts/inv_13594903554352170475/inv_8065306156279417283 with prefix "framework_compatibility_matrix.xml_" suffix ".txt.gz"
05-06 13:54:17 I/LogFileSaver: Saved gzip log file /tmp/15298624/tvts/inv_13594903554352170475/inv_8065306156279417283/framework_compatibility_matrix.xml_10415665631166011205.txt.gz. [size=10, elapsed=1ms]
05-06 13:54:17 D/FileUtil: Creating temp file at /tmp/15298624/tvts/inv_13594903554352170475/inv_8065306156279417283 with prefix "GraphicsDeviceInfo.deviceinfo.json_" suffix ".txt.gz"
05-06 13:54:17 I/LogFileSaver: Saved gzip log file /tmp/15298624/tvts/inv_13594903554352170475/inv_8065306156279417283/GraphicsDeviceInfo.deviceinfo.json_17892104589246092530.txt.gz. [size=10, elapsed=0ms]
05-06 13:54:17 D/FileUtil: Creating temp file at /tmp/15298624/tvts/inv_13594903554352170475/inv_8065306156279417283 with prefix "BiometricsDeviceInfo.deviceinfo.json_" suffix ".txt.gz"
05-06 13:54:17 I/LogFileSaver: Saved gzip log file /tmp/15298624/tvts/inv_13594903554352170475/inv_8065306156279417283/BiometricsDeviceInfo.deviceinfo.json_13332536845320229033.txt.gz. [size=10, elapsed=1ms]
05-06 13:54:17 D/FileUtil: Creating temp file at /tmp/15298624/tvts/inv_13594903554352170475/inv_8065306156279417283 with prefix "KeystoreAttestationDeviceInfo.deviceinfo.json_" suffix ".txt.gz"
05-06 13:54:17 I/LogFileSaver: Saved gzip log file /tmp/15298624/tvts/inv_13594903554352170475/inv_8065306156279417283/KeystoreAttestationDeviceInfo.deviceinfo.json_13271979553808939510.txt.gz. [size=10, elapsed=0ms]
05-06 13:54:17 D/FileUtil: Creating temp file at /tmp/15298624/tvts/inv_13594903554352170475/inv_8065306156279417283 with prefix "MediaOutputDeviceInfo.deviceinfo.json_" suffix ".txt.gz"
05-06 13:54:17 I/LogFileSaver: Saved gzip log file /tmp/15298624/tvts/inv_13594903554352170475/inv_8065306156279417283/MediaOutputDeviceInfo.deviceinfo.json_13966103201065669400.txt.gz. [size=10, elapsed=0ms]
05-06 13:54:17 D/FileUtil: Creating temp file at /tmp/15298624/tvts/inv_13594903554352170475/inv_8065306156279417283 with prefix "StorageDeviceInfo.deviceinfo.json_" suffix ".txt.gz"
05-06 13:54:17 I/LogFileSaver: Saved gzip log file /tmp/15298624/tvts/inv_13594903554352170475/inv_8065306156279417283/StorageDeviceInfo.deviceinfo.json_11691358751254933990.txt.gz. [size=10, elapsed=1ms]
05-06 13:54:17 D/FileUtil: Creating temp file at /tmp/15298624/tvts/inv_13594903554352170475/inv_8065306156279417283 with prefix "GenericDeviceInfo.deviceinfo.json_" suffix ".txt.gz"
05-06 13:54:17 I/LogFileSaver: Saved gzip log file /tmp/15298624/tvts/inv_13594903554352170475/inv_8065306156279417283/GenericDeviceInfo.deviceinfo.json_5010108299177860170.txt.gz. [size=10, elapsed=0ms]
05-06 13:54:17 D/FileUtil: Creating temp file at /home/dev2-google04/android-tvts/android-tvts-2.17r1-arm-15298624/android-tvts/tools/./../../android-tvts/logs/2026.05.06_13.53.10/inv_6359429154753753061 with prefix "framework_manifest.xml_" suffix ".txt.gz"
05-06 13:54:17 I/LogFileSaver: Saved gzip log file /home/dev2-google04/android-tvts/android-tvts-2.17r1-arm-15298624/android-tvts/tools/./../../android-tvts/logs/2026.05.06_13.53.10/inv_6359429154753753061/framework_manifest.xml_4653143699721225714.txt.gz. [size=10, elapsed=0ms]
05-06 13:54:17 D/CertificationSuiteResultReporter: Saved logs for framework_manifest.xml in /home/dev2-google04/android-tvts/android-tvts-2.17r1-arm-15298624/android-tvts/tools/./../../android-tvts/logs/2026.05.06_13.53.10/inv_6359429154753753061/framework_manifest.xml_4653143699721225714.txt.gz
05-06 13:54:17 D/FileUtil: Creating temp file at /tmp/15298624/tvts/inv_13594903554352170475/inv_8065306156279417283 with prefix "framework_manifest.xml_" suffix ".txt.gz"
05-06 13:54:17 I/LogFileSaver: Saved gzip log file /tmp/15298624/tvts/inv_13594903554352170475/inv_8065306156279417283/framework_manifest.xml_4311506924629234912.txt.gz. [size=10, elapsed=0ms]
05-06 13:54:17 D/FileUtil: Creating temp file at /tmp/15298624/tvts/inv_13594903554352170475/inv_8065306156279417283 with prefix "HapticsDeviceInfo.deviceinfo.json_" suffix ".txt.gz"
05-06 13:54:17 I/LogFileSaver: Saved gzip log file /tmp/15298624/tvts/inv_13594903554352170475/inv_8065306156279417283/HapticsDeviceInfo.deviceinfo.json_7363176129119295890.txt.gz. [size=10, elapsed=1ms]
05-06 13:54:17 D/FileUtil: Creating temp file at /tmp/15298624/tvts/inv_13594903554352170475/inv_8065306156279417283 with prefix "AppStandbyDeviceInfo.deviceinfo.json_" suffix ".txt.gz"
05-06 13:54:17 I/LogFileSaver: Saved gzip log file /tmp/15298624/tvts/inv_13594903554352170475/inv_8065306156279417283/AppStandbyDeviceInfo.deviceinfo.json_8790228196449917064.txt.gz. [size=10, elapsed=1ms]
05-06 13:54:17 D/FileUtil: Creating temp file at /tmp/15298624/tvts/inv_13594903554352170475/inv_8065306156279417283 with prefix "DeviceIdleDeviceInfo.deviceinfo.json_" suffix ".txt.gz"
05-06 13:54:17 I/LogFileSaver: Saved gzip log file /tmp/15298624/tvts/inv_13594903554352170475/inv_8065306156279417283/DeviceIdleDeviceInfo.deviceinfo.json_12914302834244931378.txt.gz. [size=10, elapsed=1ms]
05-06 13:54:17 D/FileUtil: Creating temp file at /tmp/15298624/tvts/inv_13594903554352170475/inv_8065306156279417283 with prefix "FeatureDeviceInfo.deviceinfo.json_" suffix ".txt.gz"
05-06 13:54:17 I/LogFileSaver: Saved gzip log file /tmp/15298624/tvts/inv_13594903554352170475/inv_8065306156279417283/FeatureDeviceInfo.deviceinfo.json_2038424266587822732.txt.gz. [size=10, elapsed=0ms]
05-06 13:54:17 D/FileUtil: Creating temp file at /tmp/15298624/tvts/inv_13594903554352170475/inv_8065306156279417283 with prefix "ConfigurationDeviceInfo.deviceinfo.json_" suffix ".txt.gz"
05-06 13:54:17 I/LogFileSaver: Saved gzip log file /tmp/15298624/tvts/inv_13594903554352170475/inv_8065306156279417283/ConfigurationDeviceInfo.deviceinfo.json_4682744183372399080.txt.gz. [size=10, elapsed=0ms]
05-06 13:54:17 D/FileUtil: Creating temp file at /home/dev2-google04/android-tvts/android-tvts-2.17r1-arm-15298624/android-tvts/tools/./../../android-tvts/logs/2026.05.06_13.53.10/inv_6359429154753753061 with prefix "device_compatibility_matrix.xml_" suffix ".txt.gz"
05-06 13:54:17 I/LogFileSaver: Saved gzip log file /home/dev2-google04/android-tvts/android-tvts-2.17r1-arm-15298624/android-tvts/tools/./../../android-tvts/logs/2026.05.06_13.53.10/inv_6359429154753753061/device_compatibility_matrix.xml_7132849208440795380.txt.gz. [size=10, elapsed=0ms]
05-06 13:54:17 D/CertificationSuiteResultReporter: Saved logs for device_compatibility_matrix.xml in /home/dev2-google04/android-tvts/android-tvts-2.17r1-arm-15298624/android-tvts/tools/./../../android-tvts/logs/2026.05.06_13.53.10/inv_6359429154753753061/device_compatibility_matrix.xml_7132849208440795380.txt.gz
05-06 13:54:17 D/FileUtil: Creating temp file at /tmp/15298624/tvts/inv_13594903554352170475/inv_8065306156279417283 with prefix "device_compatibility_matrix.xml_" suffix ".txt.gz"
05-06 13:54:17 I/LogFileSaver: Saved gzip log file /tmp/15298624/tvts/inv_13594903554352170475/inv_8065306156279417283/device_compatibility_matrix.xml_13713617870035562913.txt.gz. [size=10, elapsed=1ms]
05-06 13:54:17 D/InvocationExecution: done with preparer 'com.android.compatibility.common.tradefed.targetprep.DeviceInfoCollector@461e83d4' on device: 'SKBFXYWR0LWD' in 1m 6s
05-06 13:54:17 D/InvocationExecution: starting preparer 'com.google.android.perfverify.tvts.prep.DeviceReliabilityVerifier@65de346c' on device: 'SKBFXYWR0LWD'
05-06 13:54:17 D/InvocationExecution: done with preparer 'com.google.android.perfverify.tvts.prep.DeviceReliabilityVerifier@65de346c' on device: 'SKBFXYWR0LWD' in 477 ms
05-06 13:54:17 D/InvocationExecution: starting preparer 'com.android.compatibility.common.tradefed.targetprep.ReportLogCollector@74f04553' on device: 'SKBFXYWR0LWD'
05-06 13:54:17 D/InvocationExecution: done with preparer 'com.android.compatibility.common.tradefed.targetprep.ReportLogCollector@74f04553' on device: 'SKBFXYWR0LWD' in 1 ms
05-06 13:54:17 D/InvocationExecution: starting preparer 'com.android.tradefed.targetprep.RunCommandTargetPreparer@3882472e' on device: 'SKBFXYWR0LWD'
05-06 13:54:17 D/RunUtil: Running command [adb, -s, SKBFXYWR0LWD, shell, pkill, memhog] with timeout: 2m 0s
05-06 13:54:18 W/NativeDevice: Adb Shell Command : adb -s SKBFXYWR0LWD shell pkill memhog
05-06 13:54:18 W/NativeDevice: Adb Shell Command exited with status: FAILED
05-06 13:54:18 W/NativeDevice: Adb Shell Command shell stdout:


05-06 13:54:18 W/NativeDevice: Adb Shell Command shell stderr:


05-06 13:54:18 D/RunCommandTargetPreparer: cmd: 'pkill memhog' failed, returned:
stdout:
stderr:
05-06 13:54:18 D/RunUtil: Running command [adb, -s, SKBFXYWR0LWD, shell, pkill, cpuhog] with timeout: 2m 0s
05-06 13:54:18 W/NativeDevice: Adb Shell Command : adb -s SKBFXYWR0LWD shell pkill cpuhog
05-06 13:54:18 W/NativeDevice: Adb Shell Command exited with status: FAILED
05-06 13:54:18 W/NativeDevice: Adb Shell Command shell stdout:


05-06 13:54:18 W/NativeDevice: Adb Shell Command shell stderr:


05-06 13:54:18 D/RunCommandTargetPreparer: cmd: 'pkill cpuhog' failed, returned:
stdout:
stderr:
05-06 13:54:18 D/RunUtil: Running command [adb, -s, SKBFXYWR0LWD, shell, pkill, adb_marker] with timeout: 2m 0s
05-06 13:54:18 W/NativeDevice: Adb Shell Command : adb -s SKBFXYWR0LWD shell pkill adb_marker
05-06 13:54:18 W/NativeDevice: Adb Shell Command exited with status: FAILED
05-06 13:54:18 W/NativeDevice: Adb Shell Command shell stdout:


05-06 13:54:18 W/NativeDevice: Adb Shell Command shell stderr:


05-06 13:54:18 D/RunCommandTargetPreparer: cmd: 'pkill adb_marker' failed, returned:
stdout:
stderr:
05-06 13:54:18 D/InvocationExecution: done with preparer 'com.android.tradefed.targetprep.RunCommandTargetPreparer@3882472e' on device: 'SKBFXYWR0LWD' in 439 ms
05-06 13:54:18 D/InvocationExecution: starting preparer 'com.android.compatibility.common.tradefed.targetprep.FilePusher@61ddc57d' on device: 'SKBFXYWR0LWD'
05-06 13:54:18 D/PushFilePreparer: Trying to push local 'tvts_memhog' to remote '/data/local/tmp/memhog'
05-06 13:54:18 D/SearchArtifactUtil: Searching for file tvts_memhog. Search directories: [./../../android-tvts/testcases, /tmp/tf-workfolder8409073234652177337]
05-06 13:54:18 D/SearchArtifactUtil: Found file /home/dev2-google04/android-tvts/android-tvts-2.17r1-arm-15298624/android-tvts/tools/./../../android-tvts/testcases/tvts_memhog in search directory /home/dev2-google04/android-tvts/android-tvts-2.17r1-arm-15298624/android-tvts/tools/./../../android-tvts/testcases.
05-06 13:54:18 D/NativeDevice: Push file /home/dev2-google04/android-tvts/android-tvts-2.17r1-arm-15298624/android-tvts/tools/./../../android-tvts/testcases/tvts_memhog with size of 11772 bytes to the device.
05-06 13:54:18 D/RunUtil: Running command [adb, -s, SKBFXYWR0LWD, push, /home/dev2-google04/android-tvts/android-tvts-2.17r1-arm-15298624/android-tvts/tools/./../../android-tvts/testcases/tvts_memhog, /data/local/tmp/memhog] with timeout: 2m 0s
05-06 13:54:18 D/PushFilePreparer: Trying to push local 'tvts_cpuhog' to remote '/data/local/tmp/cpuhog'
05-06 13:54:18 D/SearchArtifactUtil: Searching for file tvts_cpuhog. Search directories: [./../../android-tvts/testcases, /tmp/tf-workfolder8409073234652177337]
05-06 13:54:18 D/SearchArtifactUtil: Found file /home/dev2-google04/android-tvts/android-tvts-2.17r1-arm-15298624/android-tvts/tools/./../../android-tvts/testcases/tvts_cpuhog in search directory /home/dev2-google04/android-tvts/android-tvts-2.17r1-arm-15298624/android-tvts/tools/./../../android-tvts/testcases.
05-06 13:54:18 D/NativeDevice: Push file /home/dev2-google04/android-tvts/android-tvts-2.17r1-arm-15298624/android-tvts/tools/./../../android-tvts/testcases/tvts_cpuhog with size of 9640 bytes to the device.
05-06 13:54:18 D/RunUtil: Running command [adb, -s, SKBFXYWR0LWD, push, /home/dev2-google04/android-tvts/android-tvts-2.17r1-arm-15298624/android-tvts/tools/./../../android-tvts/testcases/tvts_cpuhog, /data/local/tmp/cpuhog] with timeout: 2m 0s
05-06 13:54:18 D/PushFilePreparer: Trying to push local 'adb_marker' to remote '/data/local/tmp/adb_marker'
05-06 13:54:18 D/SearchArtifactUtil: Searching for file adb_marker. Search directories: [./../../android-tvts/testcases, /tmp/tf-workfolder8409073234652177337]
05-06 13:54:18 D/SearchArtifactUtil: Found file /home/dev2-google04/android-tvts/android-tvts-2.17r1-arm-15298624/android-tvts/tools/./../../android-tvts/testcases/adb_marker in search directory /home/dev2-google04/android-tvts/android-tvts-2.17r1-arm-15298624/android-tvts/tools/./../../android-tvts/testcases.
05-06 13:54:18 D/NativeDevice: Push file /home/dev2-google04/android-tvts/android-tvts-2.17r1-arm-15298624/android-tvts/tools/./../../android-tvts/testcases/adb_marker with size of 3188 bytes to the device.
05-06 13:54:18 D/RunUtil: Running command [adb, -s, SKBFXYWR0LWD, push, /home/dev2-google04/android-tvts/android-tvts-2.17r1-arm-15298624/android-tvts/tools/./../../android-tvts/testcases/adb_marker, /data/local/tmp/adb_marker] with timeout: 2m 0s
05-06 13:54:18 D/InvocationExecution: done with preparer 'com.android.compatibility.common.tradefed.targetprep.FilePusher@61ddc57d' on device: 'SKBFXYWR0LWD' in 116 ms
05-06 13:54:18 D/InvocationExecution: starting preparer 'com.android.tradefed.targetprep.RunCommandTargetPreparer@56f7d076' on device: 'SKBFXYWR0LWD'
05-06 13:54:18 D/RunUtil: Running command [adb, -s, SKBFXYWR0LWD, shell, chmod, +x, /data/local/tmp/memhog] with timeout: 2m 0s
05-06 13:54:18 D/RunUtil: Running command [adb, -s, SKBFXYWR0LWD, shell, chmod, +x, /data/local/tmp/cpuhog] with timeout: 2m 0s
05-06 13:54:18 D/RunUtil: Running command [adb, -s, SKBFXYWR0LWD, shell, chmod, +x, /data/local/tmp/adb_marker] with timeout: 2m 0s
05-06 13:54:19 D/InvocationExecution: done with preparer 'com.android.tradefed.targetprep.RunCommandTargetPreparer@56f7d076' on device: 'SKBFXYWR0LWD' in 498 ms
05-06 13:54:19 D/InvocationExecution: starting preparer 'com.android.compatibility.common.tradefed.targetprep.PropertyCheck@5adc4df3' on device: 'SKBFXYWR0LWD'
05-06 13:54:19 D/RunUtil: Running command [adb, -s, SKBFXYWR0LWD, shell, getprop, persist.sys.locale] with timeout: 45s
05-06 13:54:19 D/InvocationExecution: done with preparer 'com.android.compatibility.common.tradefed.targetprep.PropertyCheck@5adc4df3' on device: 'SKBFXYWR0LWD' in 119 ms
05-06 13:54:19 D/InvocationExecution: starting preparer 'com.android.compatibility.common.tradefed.targetprep.PropertyCheck@791658ce' on device: 'SKBFXYWR0LWD'
05-06 13:54:19 D/NativeDevice: Using property ro.build.type=user from cache.
05-06 13:54:19 D/InvocationExecution: done with preparer 'com.android.compatibility.common.tradefed.targetprep.PropertyCheck@791658ce' on device: 'SKBFXYWR0LWD' in 1 ms
05-06 13:54:19 D/InvocationExecution: starting preparer 'com.android.tradefed.targetprep.suite.SuiteApkInstaller@7e320b79' on device: 'SKBFXYWR0LWD'
05-06 13:54:19 D/NativeDevice: Using property ro.build.version.sdk=29 from cache.
05-06 13:54:19 D/NativeDevice: Using property ro.build.version.codename=REL from cache.
05-06 13:54:19 D/NativeDevice: Using property ro.build.version.sdk=29 from cache.
05-06 13:54:19 D/NativeDevice: Using property ro.build.version.codename=REL from cache.
05-06 13:54:19 D/NativeDevice: Using property ro.build.version.sdk=29 from cache.
05-06 13:54:19 D/NativeDevice: Using property ro.build.version.codename=REL from cache.
05-06 13:54:19 D/SearchArtifactUtil: Searching for file TvtsDeviceInformationTests.apk. Search directories: [./../../android-tvts/testcases, /tmp/tf-workfolder8409073234652177337]
05-06 13:54:19 D/SearchArtifactUtil: Found file /home/dev2-google04/android-tvts/android-tvts-2.17r1-arm-15298624/android-tvts/tools/./../../android-tvts/testcases/TvtsDeviceInformationTests.apk in search directory /home/dev2-google04/android-tvts/android-tvts-2.17r1-arm-15298624/android-tvts/tools/./../../android-tvts/testcases.
05-06 13:54:19 D/RunUtil: Running command [aapt2, dump, badging, /home/dev2-google04/android-tvts/android-tvts-2.17r1-arm-15298624/android-tvts/tools/./../../android-tvts/testcases/TvtsDeviceInformationTests.apk] with timeout: 1m 0s
05-06 13:54:19 D/RunUtil: Running command [aapt2, dump, xmltree, /home/dev2-google04/android-tvts/android-tvts-2.17r1-arm-15298624/android-tvts/tools/./../../android-tvts/testcases/TvtsDeviceInformationTests.apk, --file, AndroidManifest.xml] with timeout: 1m 0s
05-06 13:54:19 D/TestAppInstallSetup: Installing apk com.google.android.resolution.tvts with [/home/dev2-google04/android-tvts/android-tvts-2.17r1-arm-15298624/android-tvts/tools/./../../android-tvts/testcases/TvtsDeviceInformationTests.apk] ...
05-06 13:54:19 D/NativeDevice: Using property ro.build.version.sdk=29 from cache.
05-06 13:54:19 D/RunUtil: Running command [adb, -s, SKBFXYWR0LWD, install, -r, -g, -g, /home/dev2-google04/android-tvts/android-tvts-2.17r1-arm-15298624/android-tvts/tools/./../../android-tvts/testcases/TvtsDeviceInformationTests.apk] with timeout: 4m 0s
05-06 13:54:21 D/RunUtil: Running command [aapt, dump, badging, /home/dev2-google04/android-tvts/android-tvts-2.17r1-arm-15298624/android-tvts/tools/./../../android-tvts/testcases/TvtsDeviceInformationTests.apk] with timeout: 1m 0s
05-06 13:54:21 D/RunUtil: Running command [aapt, dump, xmltree, /home/dev2-google04/android-tvts/android-tvts-2.17r1-arm-15298624/android-tvts/tools/./../../android-tvts/testcases/TvtsDeviceInformationTests.apk, AndroidManifest.xml] with timeout: 1m 0s
05-06 13:54:21 D/RunUtil: Running command [adb, -s, SKBFXYWR0LWD, shell, appops, write-settings] with timeout: 2m 0s
05-06 13:54:22 D/InvocationExecution: done with preparer 'com.android.tradefed.targetprep.suite.SuiteApkInstaller@7e320b79' on device: 'SKBFXYWR0LWD' in 2s
05-06 13:54:22 D/InvocationExecution: starting preparer 'com.google.android.perfverify.tvts.TvtsSetupAndTearDown@17448475' on device: 'SKBFXYWR0LWD'
05-06 13:54:22 D/InvocationExecution: done with preparer 'com.google.android.perfverify.tvts.TvtsSetupAndTearDown@17448475' on device: 'SKBFXYWR0LWD' in 5 ms
05-06 13:54:22 D/InvocationExecution: starting preparer 'com.google.android.perfverify.tvts.prep.ApkChecker@54d54fc9' on device: 'SKBFXYWR0LWD'
05-06 13:54:22 D/NativeDevice: Using property ro.build.version.sdk=29 from cache.
05-06 13:54:22 W/ApkChecker: Default min apk version: 112006300; Min apk version for Android API Level 29: 0; Min APK version for this device: 0
05-06 13:54:22 D/RunUtil: Running command [adb, -s, SKBFXYWR0LWD, shell, dumpsys, package, com.google.android.youtube.tv|, grep, versionCode] with timeout: 2m 0s
05-06 13:54:22 W/ApkChecker: The newest VersionCode found for the Package com.google.android.youtube.tv:  530320320
05-06 13:54:22 D/InvocationExecution: done with preparer 'com.google.android.perfverify.tvts.prep.ApkChecker@54d54fc9' on device: 'SKBFXYWR0LWD' in 327 ms
05-06 13:54:22 D/InvocationExecution: starting preparer 'com.google.android.perfverify.tvts.prep.ApkChecker@5197cdaa' on device: 'SKBFXYWR0LWD'
05-06 13:54:22 D/NativeDevice: Using property ro.build.version.sdk=29 from cache.
05-06 13:54:22 W/ApkChecker: Default min apk version: 15021105; Min apk version for Android API Level 29: 0; Min APK version for this device: 0
05-06 13:54:22 D/RunUtil: Running command [adb, -s, SKBFXYWR0LWD, shell, dumpsys, package, com.google.android.katniss|, grep, versionCode] with timeout: 2m 0s
05-06 13:54:22 W/ApkChecker: The newest VersionCode found for the Package com.google.android.katniss:  15032599
05-06 13:54:22 D/InvocationExecution: done with preparer 'com.google.android.perfverify.tvts.prep.ApkChecker@5197cdaa' on device: 'SKBFXYWR0LWD' in 273 ms
05-06 13:54:22 D/InvocationExecution: starting preparer 'com.google.android.perfverify.tvts.prep.ApkChecker@38b814e6' on device: 'SKBFXYWR0LWD'
05-06 13:54:22 D/NativeDevice: Using property ro.build.version.sdk=29 from cache.
05-06 13:54:22 W/ApkChecker: Default min apk version: 624525470; Min apk version for Android API Level 29: 0; Min APK version for this device: 0
05-06 13:54:22 D/RunUtil: Running command [adb, -s, SKBFXYWR0LWD, shell, dumpsys, package, com.google.android.play.games|, grep, versionCode] with timeout: 2m 0s
05-06 13:54:22 W/ApkChecker: The newest VersionCode found for the Package com.google.android.play.games:  624523470
05-06 13:54:22 D/InvocationExecution: done with preparer 'com.google.android.perfverify.tvts.prep.ApkChecker@38b814e6' on device: 'SKBFXYWR0LWD' in 246 ms
05-06 13:54:22 D/InvocationExecution: starting preparer 'com.google.android.perfverify.tvts.prep.ApkChecker@5795d909' on device: 'SKBFXYWR0LWD'
05-06 13:54:22 D/NativeDevice: Using property ro.build.version.sdk=29 from cache.
05-06 13:54:22 W/ApkChecker: Default min apk version: 1010936617; Min apk version for Android API Level 29: 0; Min APK version for this device: 0
05-06 13:54:22 D/RunUtil: Running command [adb, -s, SKBFXYWR0LWD, shell, dumpsys, package, com.google.android.tvlauncher|, grep, versionCode] with timeout: 2m 0s
05-06 13:54:23 W/NativeDevice: Adb Shell Command : adb -s SKBFXYWR0LWD shell dumpsys package com.google.android.tvlauncher| grep versionCode
05-06 13:54:23 W/NativeDevice: Adb Shell Command exited with status: FAILED
05-06 13:54:23 W/NativeDevice: Adb Shell Command shell stdout:


05-06 13:54:23 W/NativeDevice: Adb Shell Command shell stderr:


05-06 13:54:23 W/ApkChecker: Property "com.google.android.tvlauncher" not found on device, cannot verify value "0" 
05-06 13:54:23 D/InvocationExecution: done with preparer 'com.google.android.perfverify.tvts.prep.ApkChecker@5795d909' on device: 'SKBFXYWR0LWD' in 214 ms
05-06 13:54:23 D/InvocationExecution: starting preparer 'com.google.android.perfverify.tvts.prep.ApkChecker@29407f35' on device: 'SKBFXYWR0LWD'
05-06 13:54:23 D/NativeDevice: Using property ro.build.version.sdk=29 from cache.
05-06 13:54:23 W/ApkChecker: Default min apk version: 1010925681; Min apk version for Android API Level 29: 0; Min APK version for this device: 0
05-06 13:54:23 D/RunUtil: Running command [adb, -s, SKBFXYWR0LWD, shell, dumpsys, package, com.google.android.tvrecommendations|, grep, versionCode] with timeout: 2m 0s
05-06 13:54:23 W/ApkChecker: The newest VersionCode found for the Package com.google.android.tvrecommendations:  1010926449
05-06 13:54:23 D/InvocationExecution: done with preparer 'com.google.android.perfverify.tvts.prep.ApkChecker@29407f35' on device: 'SKBFXYWR0LWD' in 355 ms
05-06 13:54:23 D/InvocationExecution: starting preparer 'com.google.android.perfverify.tvts.prep.ApkChecker@46d51d2a' on device: 'SKBFXYWR0LWD'
05-06 13:54:23 D/NativeDevice: Using property ro.build.version.sdk=29 from cache.
05-06 13:54:23 W/ApkChecker: Default min apk version: 1008002; Min apk version for Android API Level 29: 0; Min APK version for this device: 0
05-06 13:54:23 D/RunUtil: Running command [adb, -s, SKBFXYWR0LWD, shell, dumpsys, package, com.google.android.backdrop|, grep, versionCode] with timeout: 2m 0s
05-06 13:54:23 W/ApkChecker: The newest VersionCode found for the Package com.google.android.backdrop:  1008002
05-06 13:54:23 D/InvocationExecution: done with preparer 'com.google.android.perfverify.tvts.prep.ApkChecker@46d51d2a' on device: 'SKBFXYWR0LWD' in 211 ms
05-06 13:54:23 D/InvocationExecution: starting preparer 'com.google.android.perfverify.tvts.prep.ApkChecker@3e322e32' on device: 'SKBFXYWR0LWD'
05-06 13:54:23 D/NativeDevice: Using property ro.build.version.sdk=29 from cache.
05-06 13:54:23 W/ApkChecker: Default min apk version: 175416037; Min apk version for Android API Level 29: 0; Min APK version for this device: 0
05-06 13:54:23 D/RunUtil: Running command [adb, -s, SKBFXYWR0LWD, shell, dumpsys, package, com.google.android.inputmethod.latin|, grep, versionCode] with timeout: 2m 0s
05-06 13:54:23 W/NativeDevice: Adb Shell Command : adb -s SKBFXYWR0LWD shell dumpsys package com.google.android.inputmethod.latin| grep versionCode
05-06 13:54:23 W/NativeDevice: Adb Shell Command exited with status: FAILED
05-06 13:54:23 W/NativeDevice: Adb Shell Command shell stdout:


05-06 13:54:23 W/NativeDevice: Adb Shell Command shell stderr:


05-06 13:54:23 W/ApkChecker: Property "com.google.android.inputmethod.latin" not found on device, cannot verify value "0" 
05-06 13:54:23 D/InvocationExecution: done with preparer 'com.google.android.perfverify.tvts.prep.ApkChecker@3e322e32' on device: 'SKBFXYWR0LWD' in 115 ms
05-06 13:54:23 D/InvocationExecution: starting preparer 'com.google.android.perfverify.tvts.prep.ApkChecker@4796f56c' on device: 'SKBFXYWR0LWD'
05-06 13:54:23 D/NativeDevice: Using property ro.build.version.sdk=29 from cache.
05-06 13:54:23 W/ApkChecker: Default min apk version: 733920730; Min apk version for Android API Level 29: 0; Min APK version for this device: 0
05-06 13:54:23 D/RunUtil: Running command [adb, -s, SKBFXYWR0LWD, shell, dumpsys, package, com.google.android.webview|, grep, versionCode] with timeout: 2m 0s
05-06 13:54:24 W/ApkChecker: The newest VersionCode found for the Package com.google.android.webview:  772711100
05-06 13:54:24 D/InvocationExecution: done with preparer 'com.google.android.perfverify.tvts.prep.ApkChecker@4796f56c' on device: 'SKBFXYWR0LWD' in 194 ms
05-06 13:54:24 D/InvocationExecution: starting preparer 'com.google.android.perfverify.tvts.prep.ApkChecker@6d05937c' on device: 'SKBFXYWR0LWD'
05-06 13:54:24 D/NativeDevice: Using property ro.build.version.sdk=29 from cache.
05-06 13:54:24 W/ApkChecker: Default min apk version: 252234118; Min apk version for Android API Level 29: 0; Min APK version for this device: 0
05-06 13:54:24 D/RunUtil: Running command [adb, -s, SKBFXYWR0LWD, shell, dumpsys, package, com.google.android.gms|, grep, versionCode] with timeout: 2m 0s
05-06 13:54:24 W/ApkChecker: The newest VersionCode found for the Package com.google.android.gms:  261631115
05-06 13:54:24 D/InvocationExecution: done with preparer 'com.google.android.perfverify.tvts.prep.ApkChecker@6d05937c' on device: 'SKBFXYWR0LWD' in 290 ms
05-06 13:54:24 D/InvocationExecution: starting preparer 'com.google.android.perfverify.tvts.prep.ApkChecker@3d7efbb' on device: 'SKBFXYWR0LWD'
05-06 13:54:24 D/NativeDevice: Using property ro.build.version.sdk=29 from cache.
05-06 13:54:24 W/ApkChecker: Default min apk version: 84721718; Min apk version for Android API Level 29: 0; Min APK version for this device: 0
05-06 13:54:24 D/RunUtil: Running command [adb, -s, SKBFXYWR0LWD, shell, dumpsys, package, com.android.vending|, grep, versionCode] with timeout: 2m 0s
05-06 13:54:24 W/ApkChecker: The newest VersionCode found for the Package com.android.vending:  85101708
05-06 13:54:24 D/InvocationExecution: done with preparer 'com.google.android.perfverify.tvts.prep.ApkChecker@3d7efbb' on device: 'SKBFXYWR0LWD' in 198 ms
05-06 13:54:24 D/InvocationExecution: starting preparer 'com.google.android.perfverify.tvts.prep.ApkChecker@2cbb024d' on device: 'SKBFXYWR0LWD'
05-06 13:54:24 D/NativeDevice: Using property ro.build.version.sdk=29 from cache.
05-06 13:54:24 W/ApkChecker: Default min apk version: 2018120016; Min apk version for Android API Level 29: 0; Min APK version for this device: 0
05-06 13:54:24 D/RunUtil: Running command [adb, -s, SKBFXYWR0LWD, shell, dumpsys, package, com.google.android.tungsten.setupwraith|, grep, versionCode] with timeout: 2m 0s
05-06 13:54:24 W/ApkChecker: The newest VersionCode found for the Package com.google.android.tungsten.setupwraith:  2018122044
05-06 13:54:24 D/InvocationExecution: done with preparer 'com.google.android.perfverify.tvts.prep.ApkChecker@2cbb024d' on device: 'SKBFXYWR0LWD' in 187 ms
05-06 13:54:24 D/InvocationExecution: starting preparer 'com.google.android.perfverify.tvts.prep.ApkChecker@5c76bf23' on device: 'SKBFXYWR0LWD'
05-06 13:54:24 D/NativeDevice: Using property ro.build.version.sdk=29 from cache.
05-06 13:54:24 W/ApkChecker: Default min apk version: 740693; Min apk version for Android API Level 29: null; Min APK version for this device: 740693
05-06 13:54:24 D/RunUtil: Running command [adb, -s, SKBFXYWR0LWD, shell, dumpsys, package, com.google.android.apps.tv.launcherx|, grep, versionCode] with timeout: 2m 0s
05-06 13:54:24 W/NativeDevice: Adb Shell Command : adb -s SKBFXYWR0LWD shell dumpsys package com.google.android.apps.tv.launcherx| grep versionCode
05-06 13:54:24 W/NativeDevice: Adb Shell Command exited with status: FAILED
05-06 13:54:24 W/NativeDevice: Adb Shell Command shell stdout:


05-06 13:54:24 W/NativeDevice: Adb Shell Command shell stderr:


05-06 13:54:24 W/ApkChecker: Property "com.google.android.apps.tv.launcherx" not found on device, cannot verify value "740693" 
05-06 13:54:24 D/InvocationExecution: done with preparer 'com.google.android.perfverify.tvts.prep.ApkChecker@5c76bf23' on device: 'SKBFXYWR0LWD' in 131 ms
05-06 13:54:24 D/InvocationExecution: starting preparer 'com.google.android.perfverify.tvts.prep.ApkChecker@1da959a2' on device: 'SKBFXYWR0LWD'
05-06 13:54:24 D/NativeDevice: Using property ro.build.version.sdk=29 from cache.
05-06 13:54:24 W/ApkChecker: Default min apk version: 95855518; Min apk version for Android API Level 29: 0; Min APK version for this device: 0
05-06 13:54:24 D/RunUtil: Running command [adb, -s, SKBFXYWR0LWD, shell, dumpsys, package, com.google.android.tv.remote.service|, grep, versionCode] with timeout: 2m 0s
05-06 13:54:25 W/ApkChecker: The newest VersionCode found for the Package com.google.android.tv.remote.service:  95855530
05-06 13:54:25 D/InvocationExecution: done with preparer 'com.google.android.perfverify.tvts.prep.ApkChecker@1da959a2' on device: 'SKBFXYWR0LWD' in 182 ms
05-06 13:54:25 D/InvocationExecution: Done with setup of device: 'SKBFXYWR0LWD'
05-06 13:54:25 D/RunUtil: Running command [adb, -s, SKBFXYWR0LWD, shell, uname, -a] with timeout: 2m 0s
05-06 13:54:25 I/InvocationExecution: Device SKBFXYWR0LWD kernel information: 'Linux localhost 4.9.178 #1 SMP PREEMPT Fri Apr 24 16:08:38 KST 2026 armv8l'
05-06 13:54:25 D/RunUtil: Running command [adb, -s, SKBFXYWR0LWD, shell, getprop, ro.system.build.fingerprint] with timeout: 45s
05-06 13:54:25 I/InvocationExecution: Device SKBFXYWR0LWD system image build information: 'SKB/BFX_UA300/BFX-UA300:10/QT/19.561.113-20260424:user/release-keys'
05-06 13:54:25 D/NativeDevice: Using property ro.vendor.build.fingerprint=SKB/BFX_UA300/BFX-UA300:10/QT/19.561.113-20260424:user/release-keys from cache.
05-06 13:54:25 I/InvocationExecution: Device SKBFXYWR0LWD vendor image build information: 'SKB/BFX_UA300/BFX-UA300:10/QT/19.561.113-20260424:user/release-keys'
05-06 13:54:25 D/InvocationExecution: Total setup duration: 1m 14s'
05-06 13:54:25 D/LogFileSaver: Log data for device_logcat_setup_SKBFXYWR0LWD is already compressed, skipping compression
05-06 13:54:25 D/FileUtil: Creating temp file at /home/dev2-google04/android-tvts/android-tvts-2.17r1-arm-15298624/android-tvts/tools/./../../android-tvts/logs/2026.05.06_13.53.10/inv_6359429154753753061 with prefix "device_logcat_setup_SKBFXYWR0LWD_" suffix ".txt"
05-06 13:54:25 I/LogFileSaver: Saved log file /home/dev2-google04/android-tvts/android-tvts-2.17r1-arm-15298624/android-tvts/tools/./../../android-tvts/logs/2026.05.06_13.53.10/inv_6359429154753753061/device_logcat_setup_SKBFXYWR0LWD_14010925245709920541.txt. [size=6779540, elapsed=23ms]
05-06 13:54:25 D/CertificationSuiteResultReporter: Saved logs for device_logcat_setup_SKBFXYWR0LWD in /home/dev2-google04/android-tvts/android-tvts-2.17r1-arm-15298624/android-tvts/tools/./../../android-tvts/logs/2026.05.06_13.53.10/inv_6359429154753753061/device_logcat_setup_SKBFXYWR0LWD_14010925245709920541.txt
05-06 13:54:25 D/LogFileSaver: Log data for device_logcat_setup_SKBFXYWR0LWD is already compressed, skipping compression
05-06 13:54:25 D/FileUtil: Creating temp file at /tmp/15298624/tvts/inv_13594903554352170475/inv_8065306156279417283 with prefix "device_logcat_setup_SKBFXYWR0LWD_" suffix ".txt"
05-06 13:54:25 I/LogFileSaver: Saved log file /tmp/15298624/tvts/inv_13594903554352170475/inv_8065306156279417283/device_logcat_setup_SKBFXYWR0LWD_13079856302240134372.txt. [size=6779540, elapsed=85ms]
05-06 13:54:25 D/PrettyPrintDelimiter: 
===============================
===== TEST PHASE STARTING =====
===============================
05-06 13:54:25 D/TestDevice: No snapuserd notification in progress for BLOCK_BEFORE_TEST
05-06 13:54:25 D/RunUtil: Running command [adb, -s, SKBFXYWR0LWD, shell, cmd, device_state, print-states] with timeout: 2m 0s
05-06 13:54:25 W/NativeDevice: Adb Shell Command : adb -s SKBFXYWR0LWD shell cmd device_state print-states
05-06 13:54:25 W/NativeDevice: Adb Shell Command exited with status: FAILED
05-06 13:54:25 W/NativeDevice: Adb Shell Command shell stdout:


05-06 13:54:25 W/NativeDevice: Adb Shell Command shell stderr:
cmd: Can't find service: device_state


05-06 13:54:25 D/NativeDevice: Using property ro.product.cpu.abi=armeabi-v7a from cache.
05-06 13:54:25 D/BaseTestSuite: Initializing ModuleRepo
ABIs:[{armeabi-v7a, bitness=32}]
Test Args:[com.android.tradefed.testtype.AndroidJUnitTest:exclude-annotation:com.android.compatibility.common.util.PreviewOnly, com.android.compatibility.common.tradefed.testtype.JarHostTest:exclude-annotation:com.android.compatibility.common.util.PreviewOnly, com.android.tradefed.testtype.HostTest:exclude-annotation:com.android.compatibility.common.util.PreviewOnly, com.android.tradefed.testtype.AndroidJUnitTest:rerun-from-file:true, com.android.compatibility.testtype.LibcoreTest:rerun-from-file:true]
Module Args:[TvtsBootToBootCompletedHostTestCases:set-option:measure-launcher-cold-start:true, TvConcurrentMediaPlaybackHostTestCases:set-option:codec_combination:AVC-VP9-AV1-HEVC]
Includes: {armeabi-v7a TvConcurrentMediaPlaybackHostTestCases=[TvConcurrentMediaPlaybackHostTestCases]}

05-06 13:54:25 D/BaseTestSuite: Loading tests from [/home/dev2-google04/android-tvts/android-tvts-2.17r1-arm-15298624/android-tvts/tools/./../../android-tvts/testcases]
05-06 13:54:26 D/ITestSuite: No remote build info, skipping stageTestArtifacts
05-06 13:54:26 D/ITestSuite: Resource not found for allowed preparers: /suite/google-allowed-preparers.txt
05-06 13:54:26 D/ITestSuite: [Total Unique Modules = 1]
05-06 13:54:26 I/ITestSuite: SKBFXYWR0LWD running 1 modules: [armeabi-v7a TvConcurrentMediaPlaybackHostTestCases]
05-06 13:54:26 D/TradefedFeatureClient: invoking feature 'skipFeature'
05-06 13:54:26 D/TradefedFeatureClient: Using reference id from metrics.
05-06 13:54:26 D/TradefedFeatureClient: name: "skipFeature"
reference_id: "58ba14db-663d-4329-907c-795fa15ca07e"

05-06 13:54:26 D/TradefedFeatureServer: Executing com.android.tradefed.result.skipped.SkipFeature@21cd5c6b with [name: "skipFeature"
reference_id: "58ba14db-663d-4329-907c-795fa15ca07e"
]
05-06 13:54:26 D/SkipManager: Final device digests are: {}
05-06 13:54:26 D/TradefedFeatureClient: Feature name: skipFeature. response: multi_part_response {
  response_part {
    key: "delimiter"
    value: "\\+,"
  }
  response_part {
    key: "presubmit"
    value: "false"
  }
  response_part {
    key: "skipModules"
  }
  response_part {
    key: "imageDigests"
  }
}

05-06 13:54:26 D/BaseTestSuite: Filters for 'armeabi-v7a TvConcurrentMediaPlaybackHostTestCases': []
05-06 13:54:26 D/ITestSuite: com.google.android.perfverify.tvts.collectors.DebugHostLogCollector@ebac99c isn't applicable at module level. Skipping.
05-06 13:54:26 D/FileUtil: Creating temp file at /tmp/tf-workfolder8409073234652177337 with prefix "TvConcurrentMediaPlaybackHostTestCases" suffix ".xml"
05-06 13:54:26 D/RunUtil: Running command [chmod, ug+rwx, /tmp/15298624/tvts/inv_13594903554352170475/inv_8065306156279417283/TvConcurrentMediaPlaybackHostTestCases] with timeout: 10s
05-06 13:54:26 D/FileUtil: Creating temp directory at /tmp/15298624/tvts/inv_13594903554352170475/inv_8065306156279417283/TvConcurrentMediaPlaybackHostTestCases with prefix "inv_"
05-06 13:54:26 D/RunUtil: Running command [chmod, ug+rwx, /tmp/15298624/tvts/inv_13594903554352170475/inv_8065306156279417283/TvConcurrentMediaPlaybackHostTestCases/inv_2212607387801389728] with timeout: 10s
05-06 13:54:26 D/FileSystemLogSaver: Using log file directory /tmp/15298624/tvts/inv_13594903554352170475/inv_8065306156279417283/TvConcurrentMediaPlaybackHostTestCases/inv_2212607387801389728
05-06 13:54:26 I/LogFileSaver: Using log file directory /tmp/15298624/tvts/inv_13594903554352170475/inv_8065306156279417283/TvConcurrentMediaPlaybackHostTestCases/inv_2212607387801389728
05-06 13:54:26 D/RunUtil: Running command [chmod, ug+rwx, /home/dev2-google04/android-tvts/android-tvts-2.17r1-arm-15298624/android-tvts/tools/./../../android-tvts/logs/2026.05.06_13.53.10/inv_6359429154753753061/TvConcurrentMediaPlaybackHostTestCases] with timeout: 10s
05-06 13:54:26 D/FileUtil: Creating temp directory at /home/dev2-google04/android-tvts/android-tvts-2.17r1-arm-15298624/android-tvts/tools/./../../android-tvts/logs/2026.05.06_13.53.10/inv_6359429154753753061/TvConcurrentMediaPlaybackHostTestCases with prefix "inv_"
05-06 13:54:26 I/LogFileSaver: Using log file directory /home/dev2-google04/android-tvts/android-tvts-2.17r1-arm-15298624/android-tvts/tools/./../../android-tvts/logs/2026.05.06_13.53.10/inv_6359429154753753061/TvConcurrentMediaPlaybackHostTestCases/inv_9805085177354033654
05-06 13:54:26 D/LogFileSaver: Log data for module-configuration is already compressed, skipping compression
05-06 13:54:26 D/FileUtil: Creating temp file at /home/dev2-google04/android-tvts/android-tvts-2.17r1-arm-15298624/android-tvts/tools/./../../android-tvts/logs/2026.05.06_13.53.10/inv_6359429154753753061/TvConcurrentMediaPlaybackHostTestCases/inv_9805085177354033654 with prefix "module-configuration_" suffix ".xml"
05-06 13:54:26 I/LogFileSaver: Saved log file /home/dev2-google04/android-tvts/android-tvts-2.17r1-arm-15298624/android-tvts/tools/./../../android-tvts/logs/2026.05.06_13.53.10/inv_6359429154753753061/TvConcurrentMediaPlaybackHostTestCases/inv_9805085177354033654/module-configuration_14393645435079933538.xml. [size=2156, elapsed=0ms]
05-06 13:54:26 D/CertificationSuiteResultReporter: Saved logs for module-configuration in /home/dev2-google04/android-tvts/android-tvts-2.17r1-arm-15298624/android-tvts/tools/./../../android-tvts/logs/2026.05.06_13.53.10/inv_6359429154753753061/TvConcurrentMediaPlaybackHostTestCases/inv_9805085177354033654/module-configuration_14393645435079933538.xml
05-06 13:54:26 D/LogFileSaver: Log data for module-configuration is already compressed, skipping compression
05-06 13:54:26 D/FileUtil: Creating temp file at /tmp/15298624/tvts/inv_13594903554352170475/inv_8065306156279417283/TvConcurrentMediaPlaybackHostTestCases/inv_2212607387801389728 with prefix "module-configuration_" suffix ".xml"
05-06 13:54:26 I/LogFileSaver: Saved log file /tmp/15298624/tvts/inv_13594903554352170475/inv_8065306156279417283/TvConcurrentMediaPlaybackHostTestCases/inv_2212607387801389728/module-configuration_3130962848593616654.xml (type:HARNESS_CONFIG). [size=2156, elapsed=1ms]
05-06 13:54:26 D/ModuleDefinition: Running module armeabi-v7a TvConcurrentMediaPlaybackHostTestCases
05-06 13:54:26 D/ModuleDefinition: Running setup preparer: DynamicConfigPusher
05-06 13:54:26 I/UrlReplacement: UrlReplacement file [/home/dev2-google04/android-tvts/android-tvts-2.17r1-arm-15298624/android-tvts/tools/UrlReplacement.xml] does not exist
05-06 13:54:26 D/SearchArtifactUtil: Searching for file CtsTVConcurrentPlaybackTestCases.dynamic. Search directories: [/home/dev2-google04/android-tvts/android-tvts-2.17r1-arm-15298624/android-tvts/tools/./../../android-tvts/testcases, ./../../android-tvts/testcases, /tmp/tf-workfolder8409073234652177337]
05-06 13:54:26 W/SearchArtifactUtil: we have a module name: TvConcurrentMediaPlaybackHostTestCases but no directory found in /home/dev2-google04/android-tvts/android-tvts-2.17r1-arm-15298624/android-tvts/tools/./../../android-tvts/testcases.
05-06 13:54:26 D/SearchArtifactUtil: Found file /home/dev2-google04/android-tvts/android-tvts-2.17r1-arm-15298624/android-tvts/tools/./../../android-tvts/testcases/CtsTVConcurrentPlaybackTestCases.dynamic in search directory /home/dev2-google04/android-tvts/android-tvts-2.17r1-arm-15298624/android-tvts/tools/./../../android-tvts/testcases.
05-06 13:54:26 I/DynamicConfigPusher: Replacing {suite-name} placeholder with CTS from test suite tags in dynamic config url.
05-06 13:54:26 D/ModuleDefinition: Running setup preparer: DynamicConfigPusher
05-06 13:54:26 D/SearchArtifactUtil: Searching for file CtsTVConcurrentPlaybackTestCases.dynamic. Search directories: [/home/dev2-google04/android-tvts/android-tvts-2.17r1-arm-15298624/android-tvts/tools/./../../android-tvts/testcases, ./../../android-tvts/testcases, /tmp/tf-workfolder8409073234652177337]
05-06 13:54:26 W/SearchArtifactUtil: we have a module name: TvConcurrentMediaPlaybackHostTestCases but no directory found in /home/dev2-google04/android-tvts/android-tvts-2.17r1-arm-15298624/android-tvts/tools/./../../android-tvts/testcases.
05-06 13:54:26 D/SearchArtifactUtil: Found file /home/dev2-google04/android-tvts/android-tvts-2.17r1-arm-15298624/android-tvts/tools/./../../android-tvts/testcases/CtsTVConcurrentPlaybackTestCases.dynamic in search directory /home/dev2-google04/android-tvts/android-tvts-2.17r1-arm-15298624/android-tvts/tools/./../../android-tvts/testcases.
05-06 13:54:26 I/DynamicConfigPusher: Replacing {suite-name} placeholder with CTS from test suite tags in dynamic config url.
05-06 13:54:27 D/NativeDevice: Using property ro.build.version.sdk=29 from cache.
05-06 13:54:27 D/NativeDevice: Push file /tmp/CtsTVConcurrentPlaybackTestCases18243399085269227695.dynamic with size of 516 bytes to the device.
05-06 13:54:27 D/RunUtil: Running command [adb, -s, SKBFXYWR0LWD, push, /tmp/CtsTVConcurrentPlaybackTestCases18243399085269227695.dynamic, /sdcard/dynamic-config-files/CtsTVConcurrentPlaybackTestCases.dynamic] with timeout: 2m 0s
05-06 13:54:27 D/ModuleDefinition: Running setup preparer: MediaPreparer
05-06 13:54:27 D/NativeDevice: Using property ro.build.version.sdk=29 from cache.
05-06 13:54:27 I/MediaPreparer: host downloads to: /tmp/CtsTVConcurrentPlaybackTestCases
05-06 13:54:27 I/MediaPreparer: new cache semantics: verify against a TOC
05-06 13:54:27 I/MediaPreparer: Host-cached copy is complete in /tmp/CtsTVConcurrentPlaybackTestCases
05-06 13:54:27 I/MediaPreparer: Media files located on host at: /tmp/CtsTVConcurrentPlaybackTestCases/CtsTVConcurrentPlaybackTestCases-1.7.1
05-06 13:54:27 D/ModuleDefinition: Running setup preparer: SuiteApkInstaller
05-06 13:54:27 D/TestAppInstallSetup: Using abi armeabi-v7a from abi option.
05-06 13:54:27 D/NativeDevice: Using property ro.build.version.sdk=29 from cache.
05-06 13:54:27 D/NativeDevice: Using property ro.build.version.sdk=29 from cache.
05-06 13:54:27 D/NativeDevice: Using property ro.build.version.codename=REL from cache.
05-06 13:54:27 D/NativeDevice: Using property ro.build.version.sdk=29 from cache.
05-06 13:54:27 D/NativeDevice: Using property ro.build.version.codename=REL from cache.
05-06 13:54:27 D/NativeDevice: Using property ro.build.version.sdk=29 from cache.
05-06 13:54:27 D/NativeDevice: Using property ro.build.version.codename=REL from cache.
05-06 13:54:27 D/SearchArtifactUtil: Searching for file CtsTVConcurrentPlaybackTestCases.apk. Search directories: [/home/dev2-google04/android-tvts/android-tvts-2.17r1-arm-15298624/android-tvts/tools/./../../android-tvts/testcases, ./../../android-tvts/testcases, /tmp/tf-workfolder8409073234652177337]
05-06 13:54:27 W/SearchArtifactUtil: we have a module name: TvConcurrentMediaPlaybackHostTestCases but no directory found in /home/dev2-google04/android-tvts/android-tvts-2.17r1-arm-15298624/android-tvts/tools/./../../android-tvts/testcases.
05-06 13:54:27 D/SearchArtifactUtil: Found file /home/dev2-google04/android-tvts/android-tvts-2.17r1-arm-15298624/android-tvts/tools/./../../android-tvts/testcases/CtsTVConcurrentPlaybackTestCases.apk in search directory /home/dev2-google04/android-tvts/android-tvts-2.17r1-arm-15298624/android-tvts/tools/./../../android-tvts/testcases.
05-06 13:54:27 D/RunUtil: Running command [aapt2, dump, badging, /home/dev2-google04/android-tvts/android-tvts-2.17r1-arm-15298624/android-tvts/tools/./../../android-tvts/testcases/CtsTVConcurrentPlaybackTestCases.apk] with timeout: 1m 0s
05-06 13:54:27 D/RunUtil: Running command [aapt2, dump, xmltree, /home/dev2-google04/android-tvts/android-tvts-2.17r1-arm-15298624/android-tvts/tools/./../../android-tvts/testcases/CtsTVConcurrentPlaybackTestCases.apk, --file, AndroidManifest.xml] with timeout: 1m 0s
05-06 13:54:27 D/TestAppInstallSetup: Installing apk android.tvconcurrent.tvts with [/home/dev2-google04/android-tvts/android-tvts-2.17r1-arm-15298624/android-tvts/tools/./../../android-tvts/testcases/CtsTVConcurrentPlaybackTestCases.apk] ...
05-06 13:54:27 D/NativeDevice: Using property ro.build.version.sdk=29 from cache.
05-06 13:54:27 D/RunUtil: Running command [adb, -s, SKBFXYWR0LWD, install, -r, -g, --abi, armeabi-v7a, -g, /home/dev2-google04/android-tvts/android-tvts-2.17r1-arm-15298624/android-tvts/tools/./../../android-tvts/testcases/CtsTVConcurrentPlaybackTestCases.apk] with timeout: 4m 0s
05-06 13:54:39 D/RunUtil: Running command [aapt, dump, badging, /home/dev2-google04/android-tvts/android-tvts-2.17r1-arm-15298624/android-tvts/tools/./../../android-tvts/testcases/CtsTVConcurrentPlaybackTestCases.apk] with timeout: 1m 0s
05-06 13:54:39 D/RunUtil: Running command [aapt, dump, xmltree, /home/dev2-google04/android-tvts/android-tvts-2.17r1-arm-15298624/android-tvts/tools/./../../android-tvts/testcases/CtsTVConcurrentPlaybackTestCases.apk, AndroidManifest.xml] with timeout: 1m 0s
05-06 13:54:39 D/NativeDevice: Using property ro.build.version.sdk=29 from cache.
05-06 13:54:39 D/RunUtil: Running command [adb, -s, SKBFXYWR0LWD, shell, appops, set, --user, 0, --uid, android.tvconcurrent.tvts, MANAGE_EXTERNAL_STORAGE, 0] with timeout: 2m 0s
05-06 13:54:40 W/NativeDevice: Adb Shell Command : adb -s SKBFXYWR0LWD shell appops set --user 0 --uid android.tvconcurrent.tvts MANAGE_EXTERNAL_STORAGE 0
05-06 13:54:40 W/NativeDevice: Adb Shell Command exited with status: FAILED
05-06 13:54:40 W/NativeDevice: Adb Shell Command shell stdout:


05-06 13:54:40 W/NativeDevice: Adb Shell Command shell stderr:
Error: Unknown operation string: MANAGE_EXTERNAL_STORAGE


05-06 13:54:40 E/TestDevice: Failed to set MANAGE_EXTERNAL_STORAGE App Op to allow legacy external storage for: android.tvconcurrent.tvts ; stderr: Error: Unknown operation string: MANAGE_EXTERNAL_STORAGE

05-06 13:54:40 D/RunUtil: Running command [adb, -s, SKBFXYWR0LWD, shell, appops, write-settings] with timeout: 2m 0s
05-06 13:54:40 D/PrettyTestEventLogger: 
==================== com.google.android.tv.concurrent.TvConcurrentPlaybackHostTest RUN STARTED: Wed May 06 13:54:40 KST 2026 ====================
05-06 13:54:40 D/ModuleListener: ModuleListener.testRunStarted(com.google.android.tv.concurrent.TvConcurrentPlaybackHostTest, 730, 0) on SKBFXYWR0LWD
05-06 13:54:40 D/RunUtil: Running command [adb, -s, SKBFXYWR0LWD, shell, pm, list, features] with timeout: 2m 0s
05-06 13:54:40 W/TestDevice: Feature: feature:com.google.android.tv.hardware.picture_in_picture is not available on SKBFXYWR0LWD
05-06 13:54:40 D/PrettyTestEventLogger: 
==================== com.google.android.tv.concurrent.TvConcurrentPlaybackHostTest#testConcurrentQuadTunnelPlaybackPip STARTED: Wed May 06 13:54:40 KST 2026 ====================
05-06 13:54:40 D/ModuleListener: ModuleListener.testStarted(com.google.android.tv.concurrent.TvConcurrentPlaybackHostTest#testConcurrentQuadTunnelPlaybackPip) on SKBFXYWR0LWD
05-06 13:54:40 D/PrettyTestEventLogger: 
==================== com.google.android.tv.concurrent.TvConcurrentPlaybackHostTest#testConcurrentQuadTunnelPlaybackPip ENDED: Wed May 06 13:54:40 KST 2026 ====================
05-06 13:54:40 I/ModuleListener: [1/730] SKBFXYWR0LWD com.google.android.tv.concurrent.TvConcurrentPlaybackHostTest#testConcurrentQuadTunnelPlaybackPip ASSUMPTION_FAILURE: org.junit.AssumptionViolatedException: Missing feature: com.google.android.tv.hardware.picture_in_picture
	at com.google.android.tv.concurrent.TvConcurrentRunner.runChild(TvConcurrentRunner.java:64)
	at com.google.android.tv.concurrent.TvConcurrentRunner.runChild(TvConcurrentRunner.java:46)
	at org.junit.runners.ParentRunner$4.run(ParentRunner.java:331)
	at org.junit.runners.ParentRunner$1.schedule(ParentRunner.java:79)
	at org.junit.runners.ParentRunner.runChildren(ParentRunner.java:329)
	at org.junit.runners.ParentRunner$2.evaluate(ParentRunner.java:293)
	at org.junit.runners.ParentRunner$3.evaluate(ParentRunner.java:306)
	at org.junit.runners.ParentRunner.run(ParentRunner.java:413)
	at com.android.tradefed.testtype.junit4.ExceptionThrowingRunnerWrapper.run(ExceptionThrowingRunnerWrapper.java:43)
	at org.junit.runner.JUnitCore.run(JUnitCore.java:137)
	at com.android.tradefed.testtype.HostTest.runJUnit4Tests(HostTest.java:780)
	at com.android.tradefed.testtype.HostTest.runTestClasses(HostTest.java:660)
	at com.android.tradefed.testtype.HostTest.run(HostTest.java:608)
	at com.android.tradefed.testtype.suite.GranularRetriableTestWrapper.intraModuleRun(GranularRetriableTestWrapper.java:464)
	at com.android.tradefed.testtype.suite.GranularRetriableTestWrapper.run(GranularRetriableTestWrapper.java:353)
	at com.android.tradefed.testtype.suite.ModuleDefinition.run(ModuleDefinition.java:701)
	at com.android.tradefed.testtype.suite.ITestSuite.runSingleModule(ITestSuite.java:1522)
	at com.android.tradefed.testtype.suite.ITestSuite.run(ITestSuite.java:1130)
	at com.android.tradefed.invoker.InvocationExecution.runTest(InvocationExecution.java:1561)
	at com.android.tradefed.invoker.InvocationExecution.runTests(InvocationExecution.java:1324)
	at com.android.tradefed.invoker.TestInvocation.prepareAndRun(TestInvocation.java:696)
	at com.android.tradefed.invoker.TestInvocation.performInvocation(TestInvocation.java:310)
	at com.android.tradefed.invoker.TestInvocation.invoke(TestInvocation.java:1558)
	at com.android.tradefed.command.CommandScheduler$InvocationThread.run(CommandScheduler.java:723)

05-06 13:54:40 D/RunUtil: Running command [adb, -s, SKBFXYWR0LWD, shell, pm, list, features] with timeout: 2m 0s
05-06 13:54:41 W/TestDevice: Feature: feature:com.google.android.tv.hardware.picture_in_picture is not available on SKBFXYWR0LWD
05-06 13:54:41 D/PrettyTestEventLogger: 
==================== com.google.android.tv.concurrent.TvConcurrentPlaybackHostTest#testConcurrentSecondaryTunnelPlaybackPip STARTED: Wed May 06 13:54:41 KST 2026 ====================
05-06 13:54:41 D/ModuleListener: ModuleListener.testStarted(com.google.android.tv.concurrent.TvConcurrentPlaybackHostTest#testConcurrentSecondaryTunnelPlaybackPip) on SKBFXYWR0LWD
05-06 13:54:41 D/PrettyTestEventLogger: 
==================== com.google.android.tv.concurrent.TvConcurrentPlaybackHostTest#testConcurrentSecondaryTunnelPlaybackPip ENDED: Wed May 06 13:54:41 KST 2026 ====================
05-06 13:54:41 I/ModuleListener: [2/730] SKBFXYWR0LWD com.google.android.tv.concurrent.TvConcurrentPlaybackHostTest#testConcurrentSecondaryTunnelPlaybackPip ASSUMPTION_FAILURE: org.junit.AssumptionViolatedException: Missing feature: com.google.android.tv.hardware.picture_in_picture
	at com.google.android.tv.concurrent.TvConcurrentRunner.runChild(TvConcurrentRunner.java:64)
	at com.google.android.tv.concurrent.TvConcurrentRunner.runChild(TvConcurrentRunner.java:46)
	at org.junit.runners.ParentRunner$4.run(ParentRunner.java:331)
	at org.junit.runners.ParentRunner$1.schedule(ParentRunner.java:79)
	at org.junit.runners.ParentRunner.runChildren(ParentRunner.java:329)
	at org.junit.runners.ParentRunner$2.evaluate(ParentRunner.java:293)
	at org.junit.runners.ParentRunner$3.evaluate(ParentRunner.java:306)
	at org.junit.runners.ParentRunner.run(ParentRunner.java:413)
	at com.android.tradefed.testtype.junit4.ExceptionThrowingRunnerWrapper.run(ExceptionThrowingRunnerWrapper.java:43)
	at org.junit.runner.JUnitCore.run(JUnitCore.java:137)
	at com.android.tradefed.testtype.HostTest.runJUnit4Tests(HostTest.java:780)
	at com.android.tradefed.testtype.HostTest.runTestClasses(HostTest.java:660)
	at com.android.tradefed.testtype.HostTest.run(HostTest.java:608)
	at com.android.tradefed.testtype.suite.GranularRetriableTestWrapper.intraModuleRun(GranularRetriableTestWrapper.java:464)
	at com.android.tradefed.testtype.suite.GranularRetriableTestWrapper.run(GranularRetriableTestWrapper.java:353)
	at com.android.tradefed.testtype.suite.ModuleDefinition.run(ModuleDefinition.java:701)
	at com.android.tradefed.testtype.suite.ITestSuite.runSingleModule(ITestSuite.java:1522)
	at com.android.tradefed.testtype.suite.ITestSuite.run(ITestSuite.java:1130)
	at com.android.tradefed.invoker.InvocationExecution.runTest(InvocationExecution.java:1561)
	at com.android.tradefed.invoker.InvocationExecution.runTests(InvocationExecution.java:1324)
	at com.android.tradefed.invoker.TestInvocation.prepareAndRun(TestInvocation.java:696)
	at com.android.tradefed.invoker.TestInvocation.performInvocation(TestInvocation.java:310)
	at com.android.tradefed.invoker.TestInvocation.invoke(TestInvocation.java:1558)
	at com.android.tradefed.command.CommandScheduler$InvocationThread.run(CommandScheduler.java:723)

05-06 13:54:41 D/RunUtil: Running command [adb, -s, SKBFXYWR0LWD, shell, pm, list, features] with timeout: 2m 0s
05-06 13:54:41 W/TestDevice: Feature: feature:com.google.android.tv.hardware.quad_playback_4k60 is not available on SKBFXYWR0LWD
05-06 13:54:41 D/RunUtil: Running command [adb, -s, SKBFXYWR0LWD, shell, pm, list, features] with timeout: 2m 0s
05-06 13:54:41 W/TestDevice: Feature: feature:com.google.android.tv.hardware.quad_playback_4k30 is not available on SKBFXYWR0LWD
05-06 13:54:41 D/RunUtil: Running command [adb, -s, SKBFXYWR0LWD, shell, pm, list, features] with timeout: 2m 0s
05-06 13:54:41 W/TestDevice: Feature: feature:com.google.android.tv.hardware.quad_playback_1080p60 is not available on SKBFXYWR0LWD
05-06 13:54:41 D/RunUtil: Running command [adb, -s, SKBFXYWR0LWD, shell, pm, list, features] with timeout: 2m 0s
05-06 13:54:41 W/TestDevice: Feature: feature:com.google.android.tv.hardware.quad_playback_1080p30 is not available on SKBFXYWR0LWD
05-06 13:54:41 D/RunUtil: Running command [adb, -s, SKBFXYWR0LWD, shell, pm, list, features] with timeout: 2m 0s
05-06 13:54:41 W/TestDevice: Feature: feature:com.google.android.tv.hardware.quad_playback_720p60 is not available on SKBFXYWR0LWD
05-06 13:54:41 D/RunUtil: Running command [adb, -s, SKBFXYWR0LWD, shell, pm, list, features] with timeout: 2m 0s
05-06 13:54:42 W/TestDevice: Feature: feature:com.google.android.tv.hardware.quad_playback_720p30 is not available on SKBFXYWR0LWD
05-06 13:54:42 D/RunUtil: Running command [adb, -s, SKBFXYWR0LWD, shell, pm, list, features] with timeout: 2m 0s
05-06 13:54:42 W/TestDevice: Feature: feature:com.google.android.tv.hardware.quad_playback_540p60 is not available on SKBFXYWR0LWD
05-06 13:54:42 D/RunUtil: Running command [adb, -s, SKBFXYWR0LWD, shell, pm, list, features] with timeout: 2m 0s
05-06 13:54:42 W/TestDevice: Feature: feature:com.google.android.tv.hardware.quad_playback_540p30 is not available on SKBFXYWR0LWD
05-06 13:54:42 D/RunUtil: Running command [adb, -s, SKBFXYWR0LWD, shell, pm, list, features] with timeout: 2m 0s
05-06 13:54:42 W/TestDevice: Feature: feature:com.google.android.tv.hardware.quad_playback_480p60 is not available on SKBFXYWR0LWD
05-06 13:54:42 D/RunUtil: Running command [adb, -s, SKBFXYWR0LWD, shell, pm, list, features] with timeout: 2m 0s
05-06 13:54:42 W/TestDevice: Feature: feature:com.google.android.tv.hardware.quad_playback_480p30 is not available on SKBFXYWR0LWD
05-06 13:54:42 D/com.google.android.tv.concurrent.TvConcurrentPlaybackHostTest: com.google.android.tv.hardware.quad_playback_ not declared on device
05-06 13:54:42 D/PrettyTestEventLogger: 
==================== com.google.android.tv.concurrent.TvConcurrentPlaybackHostTest#testConcurrentQuadPlayback STARTED: Wed May 06 13:54:42 KST 2026 ====================
05-06 13:54:42 D/ModuleListener: ModuleListener.testStarted(com.google.android.tv.concurrent.TvConcurrentPlaybackHostTest#testConcurrentQuadPlayback) on SKBFXYWR0LWD
05-06 13:54:42 D/PrettyTestEventLogger: 
==================== com.google.android.tv.concurrent.TvConcurrentPlaybackHostTest#testConcurrentQuadPlayback ENDED: Wed May 06 13:54:42 KST 2026 ====================
05-06 13:54:42 I/ModuleListener: [3/730] SKBFXYWR0LWD com.google.android.tv.concurrent.TvConcurrentPlaybackHostTest#testConcurrentQuadPlayback ASSUMPTION_FAILURE: org.junit.AssumptionViolatedException: Missing capability for: com.google.android.tv.hardware.quad_playback_
	at com.google.android.tv.concurrent.TvConcurrentRunner.runChild(TvConcurrentRunner.java:64)
	at com.google.android.tv.concurrent.TvConcurrentRunner.runChild(TvConcurrentRunner.java:46)
	at org.junit.runners.ParentRunner$4.run(ParentRunner.java:331)
	at org.junit.runners.ParentRunner$1.schedule(ParentRunner.java:79)
	at org.junit.runners.ParentRunner.runChildren(ParentRunner.java:329)
	at org.junit.runners.ParentRunner$2.evaluate(ParentRunner.java:293)
	at org.junit.runners.ParentRunner$3.evaluate(ParentRunner.java:306)
	at org.junit.runners.ParentRunner.run(ParentRunner.java:413)
	at com.android.tradefed.testtype.junit4.ExceptionThrowingRunnerWrapper.run(ExceptionThrowingRunnerWrapper.java:43)
	at org.junit.runner.JUnitCore.run(JUnitCore.java:137)
	at com.android.tradefed.testtype.HostTest.runJUnit4Tests(HostTest.java:780)
	at com.android.tradefed.testtype.HostTest.runTestClasses(HostTest.java:660)
	at com.android.tradefed.testtype.HostTest.run(HostTest.java:608)
	at com.android.tradefed.testtype.suite.GranularRetriableTestWrapper.intraModuleRun(GranularRetriableTestWrapper.java:464)
	at com.android.tradefed.testtype.suite.GranularRetriableTestWrapper.run(GranularRetriableTestWrapper.java:353)
	at com.android.tradefed.testtype.suite.ModuleDefinition.run(ModuleDefinition.java:701)
	at com.android.tradefed.testtype.suite.ITestSuite.runSingleModule(ITestSuite.java:1522)
	at com.android.tradefed.testtype.suite.ITestSuite.run(ITestSuite.java:1130)
	at com.android.tradefed.invoker.InvocationExecution.runTest(InvocationExecution.java:1561)
	at com.android.tradefed.invoker.InvocationExecution.runTests(InvocationExecution.java:1324)
	at com.android.tradefed.invoker.TestInvocation.prepareAndRun(TestInvocation.java:696)
	at com.android.tradefed.invoker.TestInvocation.performInvocation(TestInvocation.java:310)
	at com.android.tradefed.invoker.TestInvocation.invoke(TestInvocation.java:1558)
	at com.android.tradefed.command.CommandScheduler$InvocationThread.run(CommandScheduler.java:723)

05-06 13:54:42 D/RunUtil: Running command [adb, -s, SKBFXYWR0LWD, shell, pm, list, features] with timeout: 2m 0s
05-06 13:54:42 W/TestDevice: Feature: feature:com.google.android.tv.hardware.secondary_playback_4k60 is not available on SKBFXYWR0LWD
05-06 13:54:42 D/RunUtil: Running command [adb, -s, SKBFXYWR0LWD, shell, pm, list, features] with timeout: 2m 0s
05-06 13:54:42 W/TestDevice: Feature: feature:com.google.android.tv.hardware.secondary_playback_4k30 is not available on SKBFXYWR0LWD
05-06 13:54:42 D/RunUtil: Running command [adb, -s, SKBFXYWR0LWD, shell, pm, list, features] with timeout: 2m 0s
05-06 13:54:42 W/TestDevice: Feature: feature:com.google.android.tv.hardware.secondary_playback_1080p60 is not available on SKBFXYWR0LWD
05-06 13:54:42 D/RunUtil: Running command [adb, -s, SKBFXYWR0LWD, shell, pm, list, features] with timeout: 2m 0s
05-06 13:54:43 W/TestDevice: Feature: feature:com.google.android.tv.hardware.secondary_playback_1080p30 is not available on SKBFXYWR0LWD
05-06 13:54:43 D/RunUtil: Running command [adb, -s, SKBFXYWR0LWD, shell, pm, list, features] with timeout: 2m 0s
05-06 13:54:43 W/TestDevice: Feature: feature:com.google.android.tv.hardware.secondary_playback_720p60 is not available on SKBFXYWR0LWD
05-06 13:54:43 D/RunUtil: Running command [adb, -s, SKBFXYWR0LWD, shell, pm, list, features] with timeout: 2m 0s
05-06 13:54:43 W/TestDevice: Feature: feature:com.google.android.tv.hardware.secondary_playback_720p30 is not available on SKBFXYWR0LWD
05-06 13:54:43 D/RunUtil: Running command [adb, -s, SKBFXYWR0LWD, shell, pm, list, features] with timeout: 2m 0s
05-06 13:54:43 W/TestDevice: Feature: feature:com.google.android.tv.hardware.secondary_playback_540p60 is not available on SKBFXYWR0LWD
05-06 13:54:43 D/RunUtil: Running command [adb, -s, SKBFXYWR0LWD, shell, pm, list, features] with timeout: 2m 0s
05-06 13:54:43 W/TestDevice: Feature: feature:com.google.android.tv.hardware.secondary_playback_540p30 is not available on SKBFXYWR0LWD
05-06 13:54:43 D/RunUtil: Running command [adb, -s, SKBFXYWR0LWD, shell, pm, list, features] with timeout: 2m 0s
05-06 13:54:43 W/TestDevice: Feature: feature:com.google.android.tv.hardware.secondary_playback_480p60 is not available on SKBFXYWR0LWD
05-06 13:54:43 D/RunUtil: Running command [adb, -s, SKBFXYWR0LWD, shell, pm, list, features] with timeout: 2m 0s
05-06 13:54:43 W/TestDevice: Feature: feature:com.google.android.tv.hardware.secondary_playback_480p30 is not available on SKBFXYWR0LWD
05-06 13:54:43 D/com.google.android.tv.concurrent.TvConcurrentPlaybackHostTest: com.google.android.tv.hardware.secondary_playback_ not declared on device
05-06 13:54:43 D/PrettyTestEventLogger: 
==================== com.google.android.tv.concurrent.TvConcurrentPlaybackHostTest#testConcurrentSecondaryPlayback STARTED: Wed May 06 13:54:43 KST 2026 ====================
05-06 13:54:43 D/ModuleListener: ModuleListener.testStarted(com.google.android.tv.concurrent.TvConcurrentPlaybackHostTest#testConcurrentSecondaryPlayback) on SKBFXYWR0LWD
05-06 13:54:43 D/PrettyTestEventLogger: 
==================== com.google.android.tv.concurrent.TvConcurrentPlaybackHostTest#testConcurrentSecondaryPlayback ENDED: Wed May 06 13:54:43 KST 2026 ====================
05-06 13:54:43 I/ModuleListener: [4/730] SKBFXYWR0LWD com.google.android.tv.concurrent.TvConcurrentPlaybackHostTest#testConcurrentSecondaryPlayback ASSUMPTION_FAILURE: org.junit.AssumptionViolatedException: Missing capability for: com.google.android.tv.hardware.secondary_playback_
	at com.google.android.tv.concurrent.TvConcurrentRunner.runChild(TvConcurrentRunner.java:64)
	at com.google.android.tv.concurrent.TvConcurrentRunner.runChild(TvConcurrentRunner.java:46)
	at org.junit.runners.ParentRunner$4.run(ParentRunner.java:331)
	at org.junit.runners.ParentRunner$1.schedule(ParentRunner.java:79)
	at org.junit.runners.ParentRunner.runChildren(ParentRunner.java:329)
	at org.junit.runners.ParentRunner$2.evaluate(ParentRunner.java:293)
	at org.junit.runners.ParentRunner$3.evaluate(ParentRunner.java:306)
	at org.junit.runners.ParentRunner.run(ParentRunner.java:413)
	at com.android.tradefed.testtype.junit4.ExceptionThrowingRunnerWrapper.run(ExceptionThrowingRunnerWrapper.java:43)
	at org.junit.runner.JUnitCore.run(JUnitCore.java:137)
	at com.android.tradefed.testtype.HostTest.runJUnit4Tests(HostTest.java:780)
	at com.android.tradefed.testtype.HostTest.runTestClasses(HostTest.java:660)
	at com.android.tradefed.testtype.HostTest.run(HostTest.java:608)
	at com.android.tradefed.testtype.suite.GranularRetriableTestWrapper.intraModuleRun(GranularRetriableTestWrapper.java:464)
	at com.android.tradefed.testtype.suite.GranularRetriableTestWrapper.run(GranularRetriableTestWrapper.java:353)
	at com.android.tradefed.testtype.suite.ModuleDefinition.run(ModuleDefinition.java:701)
	at com.android.tradefed.testtype.suite.ITestSuite.runSingleModule(ITestSuite.java:1522)
	at com.android.tradefed.testtype.suite.ITestSuite.run(ITestSuite.java:1130)
	at com.android.tradefed.invoker.InvocationExecution.runTest(InvocationExecution.java:1561)
	at com.android.tradefed.invoker.InvocationExecution.runTests(InvocationExecution.java:1324)
	at com.android.tradefed.invoker.TestInvocation.prepareAndRun(TestInvocation.java:696)
	at com.android.tradefed.invoker.TestInvocation.performInvocation(TestInvocation.java:310)
	at com.android.tradefed.invoker.TestInvocation.invoke(TestInvocation.java:1558)
	at com.android.tradefed.command.CommandScheduler$InvocationThread.run(CommandScheduler.java:723)

05-06 13:54:43 D/RunUtil: Running command [adb, -s, SKBFXYWR0LWD, shell, pm, list, features] with timeout: 2m 0s
05-06 13:54:43 W/TestDevice: Feature: feature:com.google.android.tv.hardware.tunnel_secondary_playback_4k60 is not available on SKBFXYWR0LWD
05-06 13:54:43 D/RunUtil: Running command [adb, -s, SKBFXYWR0LWD, shell, pm, list, features] with timeout: 2m 0s
05-06 13:54:44 W/TestDevice: Feature: feature:com.google.android.tv.hardware.tunnel_secondary_playback_4k30 is not available on SKBFXYWR0LWD
05-06 13:54:44 D/RunUtil: Running command [adb, -s, SKBFXYWR0LWD, shell, pm, list, features] with timeout: 2m 0s
05-06 13:54:44 W/TestDevice: Feature: feature:com.google.android.tv.hardware.tunnel_secondary_playback_1080p60 is not available on SKBFXYWR0LWD
05-06 13:54:44 D/RunUtil: Running command [adb, -s, SKBFXYWR0LWD, shell, pm, list, features] with timeout: 2m 0s
05-06 13:54:44 W/TestDevice: Feature: feature:com.google.android.tv.hardware.tunnel_secondary_playback_1080p30 is not available on SKBFXYWR0LWD
05-06 13:54:44 D/RunUtil: Running command [adb, -s, SKBFXYWR0LWD, shell, pm, list, features] with timeout: 2m 0s
05-06 13:54:44 W/TestDevice: Feature: feature:com.google.android.tv.hardware.tunnel_secondary_playback_720p60 is not available on SKBFXYWR0LWD
05-06 13:54:44 D/RunUtil: Running command [adb, -s, SKBFXYWR0LWD, shell, pm, list, features] with timeout: 2m 0s
05-06 13:54:44 W/TestDevice: Feature: feature:com.google.android.tv.hardware.tunnel_secondary_playback_720p30 is not available on SKBFXYWR0LWD
05-06 13:54:44 D/RunUtil: Running command [adb, -s, SKBFXYWR0LWD, shell, pm, list, features] with timeout: 2m 0s
05-06 13:54:44 W/TestDevice: Feature: feature:com.google.android.tv.hardware.tunnel_secondary_playback_540p60 is not available on SKBFXYWR0LWD
05-06 13:54:44 D/RunUtil: Running command [adb, -s, SKBFXYWR0LWD, shell, pm, list, features] with timeout: 2m 0s
05-06 13:54:44 W/TestDevice: Feature: feature:com.google.android.tv.hardware.tunnel_secondary_playback_540p30 is not available on SKBFXYWR0LWD
05-06 13:54:44 D/RunUtil: Running command [adb, -s, SKBFXYWR0LWD, shell, pm, list, features] with timeout: 2m 0s
05-06 13:54:45 W/TestDevice: Feature: feature:com.google.android.tv.hardware.tunnel_secondary_playback_480p60 is not available on SKBFXYWR0LWD
05-06 13:54:45 D/RunUtil: Running command [adb, -s, SKBFXYWR0LWD, shell, pm, list, features] with timeout: 2m 0s
05-06 13:54:45 W/TestDevice: Feature: feature:com.google.android.tv.hardware.tunnel_secondary_playback_480p30 is not available on SKBFXYWR0LWD
05-06 13:54:45 D/com.google.android.tv.concurrent.TvConcurrentPlaybackHostTest: com.google.android.tv.hardware.tunnel_secondary_playback_ not declared on device
05-06 13:54:45 D/PrettyTestEventLogger: 
==================== com.google.android.tv.concurrent.TvConcurrentPlaybackHostTest#testConcurrentBasicSecondaryTunnelPlayback STARTED: Wed May 06 13:54:45 KST 2026 ====================
05-06 13:54:45 D/ModuleListener: ModuleListener.testStarted(com.google.android.tv.concurrent.TvConcurrentPlaybackHostTest#testConcurrentBasicSecondaryTunnelPlayback) on SKBFXYWR0LWD
05-06 13:54:45 D/PrettyTestEventLogger: 
==================== com.google.android.tv.concurrent.TvConcurrentPlaybackHostTest#testConcurrentBasicSecondaryTunnelPlayback ENDED: Wed May 06 13:54:45 KST 2026 ====================
05-06 13:54:45 I/ModuleListener: [5/730] SKBFXYWR0LWD com.google.android.tv.concurrent.TvConcurrentPlaybackHostTest#testConcurrentBasicSecondaryTunnelPlayback ASSUMPTION_FAILURE: org.junit.AssumptionViolatedException: Missing capability for: com.google.android.tv.hardware.tunnel_secondary_playback_
	at com.google.android.tv.concurrent.TvConcurrentRunner.runChild(TvConcurrentRunner.java:64)
	at com.google.android.tv.concurrent.TvConcurrentRunner.runChild(TvConcurrentRunner.java:46)
	at org.junit.runners.ParentRunner$4.run(ParentRunner.java:331)
	at org.junit.runners.ParentRunner$1.schedule(ParentRunner.java:79)
	at org.junit.runners.ParentRunner.runChildren(ParentRunner.java:329)
	at org.junit.runners.ParentRunner$2.evaluate(ParentRunner.java:293)
	at org.junit.runners.ParentRunner$3.evaluate(ParentRunner.java:306)
	at org.junit.runners.ParentRunner.run(ParentRunner.java:413)
	at com.android.tradefed.testtype.junit4.ExceptionThrowingRunnerWrapper.run(ExceptionThrowingRunnerWrapper.java:43)
	at org.junit.runner.JUnitCore.run(JUnitCore.java:137)
	at com.android.tradefed.testtype.HostTest.runJUnit4Tests(HostTest.java:780)
	at com.android.tradefed.testtype.HostTest.runTestClasses(HostTest.java:660)
	at com.android.tradefed.testtype.HostTest.run(HostTest.java:608)
	at com.android.tradefed.testtype.suite.GranularRetriableTestWrapper.intraModuleRun(GranularRetriableTestWrapper.java:464)
	at com.android.tradefed.testtype.suite.GranularRetriableTestWrapper.run(GranularRetriableTestWrapper.java:353)
	at com.android.tradefed.testtype.suite.ModuleDefinition.run(ModuleDefinition.java:701)
	at com.android.tradefed.testtype.suite.ITestSuite.runSingleModule(ITestSuite.java:1522)
	at com.android.tradefed.testtype.suite.ITestSuite.run(ITestSuite.java:1130)
	at com.android.tradefed.invoker.InvocationExecution.runTest(InvocationExecution.java:1561)
	at com.android.tradefed.invoker.InvocationExecution.runTests(InvocationExecution.java:1324)
	at com.android.tradefed.invoker.TestInvocation.prepareAndRun(TestInvocation.java:696)
	at com.android.tradefed.invoker.TestInvocation.performInvocation(TestInvocation.java:310)
	at com.android.tradefed.invoker.TestInvocation.invoke(TestInvocation.java:1558)
	at com.android.tradefed.command.CommandScheduler$InvocationThread.run(CommandScheduler.java:723)

05-06 13:54:45 D/RunUtil: Running command [adb, -s, SKBFXYWR0LWD, shell, pm, list, features] with timeout: 2m 0s
05-06 13:54:45 W/TestDevice: Feature: feature:com.google.android.tv.hardware.picture_in_picture is not available on SKBFXYWR0LWD
05-06 13:54:45 D/PrettyTestEventLogger: 
==================== com.google.android.tv.concurrent.TvConcurrentPlaybackHostTest#testConcurrentQuadPlaybackPip STARTED: Wed May 06 13:54:45 KST 2026 ====================
05-06 13:54:45 D/ModuleListener: ModuleListener.testStarted(com.google.android.tv.concurrent.TvConcurrentPlaybackHostTest#testConcurrentQuadPlaybackPip) on SKBFXYWR0LWD
05-06 13:54:45 D/PrettyTestEventLogger: 
==================== com.google.android.tv.concurrent.TvConcurrentPlaybackHostTest#testConcurrentQuadPlaybackPip ENDED: Wed May 06 13:54:45 KST 2026 ====================
05-06 13:54:45 I/ModuleListener: [6/730] SKBFXYWR0LWD com.google.android.tv.concurrent.TvConcurrentPlaybackHostTest#testConcurrentQuadPlaybackPip ASSUMPTION_FAILURE: org.junit.AssumptionViolatedException: Missing feature: com.google.android.tv.hardware.picture_in_picture
	at com.google.android.tv.concurrent.TvConcurrentRunner.runChild(TvConcurrentRunner.java:64)
	at com.google.android.tv.concurrent.TvConcurrentRunner.runChild(TvConcurrentRunner.java:46)
	at org.junit.runners.ParentRunner$4.run(ParentRunner.java:331)
	at org.junit.runners.ParentRunner$1.schedule(ParentRunner.java:79)
	at org.junit.runners.ParentRunner.runChildren(ParentRunner.java:329)
	at org.junit.runners.ParentRunner$2.evaluate(ParentRunner.java:293)
	at org.junit.runners.ParentRunner$3.evaluate(ParentRunner.java:306)
	at org.junit.runners.ParentRunner.run(ParentRunner.java:413)
	at com.android.tradefed.testtype.junit4.ExceptionThrowingRunnerWrapper.run(ExceptionThrowingRunnerWrapper.java:43)
	at org.junit.runner.JUnitCore.run(JUnitCore.java:137)
	at com.android.tradefed.testtype.HostTest.runJUnit4Tests(HostTest.java:780)
	at com.android.tradefed.testtype.HostTest.runTestClasses(HostTest.java:660)
	at com.android.tradefed.testtype.HostTest.run(HostTest.java:608)
	at com.android.tradefed.testtype.suite.GranularRetriableTestWrapper.intraModuleRun(GranularRetriableTestWrapper.java:464)
	at com.android.tradefed.testtype.suite.GranularRetriableTestWrapper.run(GranularRetriableTestWrapper.java:353)
	at com.android.tradefed.testtype.suite.ModuleDefinition.run(ModuleDefinition.java:701)
	at com.android.tradefed.testtype.suite.ITestSuite.runSingleModule(ITestSuite.java:1522)
	at com.android.tradefed.testtype.suite.ITestSuite.run(ITestSuite.java:1130)
	at com.android.tradefed.invoker.InvocationExecution.runTest(InvocationExecution.java:1561)
	at com.android.tradefed.invoker.InvocationExecution.runTests(InvocationExecution.java:1324)
	at com.android.tradefed.invoker.TestInvocation.prepareAndRun(TestInvocation.java:696)
	at com.android.tradefed.invoker.TestInvocation.performInvocation(TestInvocation.java:310)
	at com.android.tradefed.invoker.TestInvocation.invoke(TestInvocation.java:1558)
	at com.android.tradefed.command.CommandScheduler$InvocationThread.run(CommandScheduler.java:723)

05-06 13:54:45 D/RunUtil: Running command [adb, -s, SKBFXYWR0LWD, shell, pm, list, features] with timeout: 2m 0s
05-06 13:54:45 W/TestDevice: Feature: feature:com.google.android.tv.hardware.tunnel_dual_playback_4k60 is not available on SKBFXYWR0LWD
05-06 13:54:45 D/RunUtil: Running command [adb, -s, SKBFXYWR0LWD, shell, pm, list, features] with timeout: 2m 0s
05-06 13:54:45 W/TestDevice: Feature: feature:com.google.android.tv.hardware.tunnel_dual_playback_4k30 is not available on SKBFXYWR0LWD
05-06 13:54:45 D/RunUtil: Running command [adb, -s, SKBFXYWR0LWD, shell, pm, list, features] with timeout: 2m 0s
05-06 13:54:45 W/TestDevice: Feature: feature:com.google.android.tv.hardware.tunnel_dual_playback_1080p60 is not available on SKBFXYWR0LWD
05-06 13:54:45 D/RunUtil: Running command [adb, -s, SKBFXYWR0LWD, shell, pm, list, features] with timeout: 2m 0s
05-06 13:54:45 W/TestDevice: Feature: feature:com.google.android.tv.hardware.tunnel_dual_playback_1080p30 is not available on SKBFXYWR0LWD
05-06 13:54:45 D/RunUtil: Running command [adb, -s, SKBFXYWR0LWD, shell, pm, list, features] with timeout: 2m 0s
05-06 13:54:46 W/TestDevice: Feature: feature:com.google.android.tv.hardware.tunnel_dual_playback_720p60 is not available on SKBFXYWR0LWD
05-06 13:54:46 D/RunUtil: Running command [adb, -s, SKBFXYWR0LWD, shell, pm, list, features] with timeout: 2m 0s
05-06 13:54:46 W/TestDevice: Feature: feature:com.google.android.tv.hardware.tunnel_dual_playback_720p30 is not available on SKBFXYWR0LWD
05-06 13:54:46 D/RunUtil: Running command [adb, -s, SKBFXYWR0LWD, shell, pm, list, features] with timeout: 2m 0s
05-06 13:54:46 W/TestDevice: Feature: feature:com.google.android.tv.hardware.tunnel_dual_playback_540p60 is not available on SKBFXYWR0LWD
05-06 13:54:46 D/RunUtil: Running command [adb, -s, SKBFXYWR0LWD, shell, pm, list, features] with timeout: 2m 0s
05-06 13:54:46 W/TestDevice: Feature: feature:com.google.android.tv.hardware.tunnel_dual_playback_540p30 is not available on SKBFXYWR0LWD
05-06 13:54:46 D/RunUtil: Running command [adb, -s, SKBFXYWR0LWD, shell, pm, list, features] with timeout: 2m 0s
05-06 13:54:46 W/TestDevice: Feature: feature:com.google.android.tv.hardware.tunnel_dual_playback_480p60 is not available on SKBFXYWR0LWD
05-06 13:54:46 D/RunUtil: Running command [adb, -s, SKBFXYWR0LWD, shell, pm, list, features] with timeout: 2m 0s
05-06 13:54:46 W/TestDevice: Feature: feature:com.google.android.tv.hardware.tunnel_dual_playback_480p30 is not available on SKBFXYWR0LWD
05-06 13:54:46 D/com.google.android.tv.concurrent.TvConcurrentPlaybackHostTest: com.google.android.tv.hardware.tunnel_dual_playback_ not declared on device
05-06 13:54:46 D/PrettyTestEventLogger: 
==================== com.google.android.tv.concurrent.TvConcurrentPlaybackHostTest#testConcurrentDualTunnelPlayback STARTED: Wed May 06 13:54:46 KST 2026 ====================
05-06 13:54:46 D/ModuleListener: ModuleListener.testStarted(com.google.android.tv.concurrent.TvConcurrentPlaybackHostTest#testConcurrentDualTunnelPlayback) on SKBFXYWR0LWD
05-06 13:54:46 D/PrettyTestEventLogger: 
==================== com.google.android.tv.concurrent.TvConcurrentPlaybackHostTest#testConcurrentDualTunnelPlayback ENDED: Wed May 06 13:54:46 KST 2026 ====================
05-06 13:54:46 I/ModuleListener: [7/730] SKBFXYWR0LWD com.google.android.tv.concurrent.TvConcurrentPlaybackHostTest#testConcurrentDualTunnelPlayback ASSUMPTION_FAILURE: org.junit.AssumptionViolatedException: Missing capability for: com.google.android.tv.hardware.tunnel_dual_playback_
	at com.google.android.tv.concurrent.TvConcurrentRunner.runChild(TvConcurrentRunner.java:64)
	at com.google.android.tv.concurrent.TvConcurrentRunner.runChild(TvConcurrentRunner.java:46)
	at org.junit.runners.ParentRunner$4.run(ParentRunner.java:331)
	at org.junit.runners.ParentRunner$1.schedule(ParentRunner.java:79)
	at org.junit.runners.ParentRunner.runChildren(ParentRunner.java:329)
	at org.junit.runners.ParentRunner$2.evaluate(ParentRunner.java:293)
	at org.junit.runners.ParentRunner$3.evaluate(ParentRunner.java:306)
	at org.junit.runners.ParentRunner.run(ParentRunner.java:413)
	at com.android.tradefed.testtype.junit4.ExceptionThrowingRunnerWrapper.run(ExceptionThrowingRunnerWrapper.java:43)
	at org.junit.runner.JUnitCore.run(JUnitCore.java:137)
	at com.android.tradefed.testtype.HostTest.runJUnit4Tests(HostTest.java:780)
	at com.android.tradefed.testtype.HostTest.runTestClasses(HostTest.java:660)
	at com.android.tradefed.testtype.HostTest.run(HostTest.java:608)
	at com.android.tradefed.testtype.suite.GranularRetriableTestWrapper.intraModuleRun(GranularRetriableTestWrapper.java:464)
	at com.android.tradefed.testtype.suite.GranularRetriableTestWrapper.run(GranularRetriableTestWrapper.java:353)
	at com.android.tradefed.testtype.suite.ModuleDefinition.run(ModuleDefinition.java:701)
	at com.android.tradefed.testtype.suite.ITestSuite.runSingleModule(ITestSuite.java:1522)
	at com.android.tradefed.testtype.suite.ITestSuite.run(ITestSuite.java:1130)
	at com.android.tradefed.invoker.InvocationExecution.runTest(InvocationExecution.java:1561)
	at com.android.tradefed.invoker.InvocationExecution.runTests(InvocationExecution.java:1324)
	at com.android.tradefed.invoker.TestInvocation.prepareAndRun(TestInvocation.java:696)
	at com.android.tradefed.invoker.TestInvocation.performInvocation(TestInvocation.java:310)
	at com.android.tradefed.invoker.TestInvocation.invoke(TestInvocation.java:1558)
	at com.android.tradefed.command.CommandScheduler$InvocationThread.run(CommandScheduler.java:723)

05-06 13:54:46 D/RunUtil: Running command [adb, -s, SKBFXYWR0LWD, shell, pm, list, features] with timeout: 2m 0s
05-06 13:54:46 W/TestDevice: Feature: feature:com.google.android.tv.hardware.picture_in_picture is not available on SKBFXYWR0LWD
05-06 13:54:46 D/PrettyTestEventLogger: 
==================== com.google.android.tv.concurrent.TvConcurrentPlaybackHostTest#testConcurrentSecondaryPlaybackPip STARTED: Wed May 06 13:54:46 KST 2026 ====================
05-06 13:54:46 D/ModuleListener: ModuleListener.testStarted(com.google.android.tv.concurrent.TvConcurrentPlaybackHostTest#testConcurrentSecondaryPlaybackPip) on SKBFXYWR0LWD
05-06 13:54:46 D/PrettyTestEventLogger: 
==================== com.google.android.tv.concurrent.TvConcurrentPlaybackHostTest#testConcurrentSecondaryPlaybackPip ENDED: Wed May 06 13:54:46 KST 2026 ====================
05-06 13:54:46 I/ModuleListener: [8/730] SKBFXYWR0LWD com.google.android.tv.concurrent.TvConcurrentPlaybackHostTest#testConcurrentSecondaryPlaybackPip ASSUMPTION_FAILURE: org.junit.AssumptionViolatedException: Missing feature: com.google.android.tv.hardware.picture_in_picture
	at com.google.android.tv.concurrent.TvConcurrentRunner.runChild(TvConcurrentRunner.java:64)
	at com.google.android.tv.concurrent.TvConcurrentRunner.runChild(TvConcurrentRunner.java:46)
	at org.junit.runners.ParentRunner$4.run(ParentRunner.java:331)
	at org.junit.runners.ParentRunner$1.schedule(ParentRunner.java:79)
	at org.junit.runners.ParentRunner.runChildren(ParentRunner.java:329)
	at org.junit.runners.ParentRunner$2.evaluate(ParentRunner.java:293)
	at org.junit.runners.ParentRunner$3.evaluate(ParentRunner.java:306)
	at org.junit.runners.ParentRunner.run(ParentRunner.java:413)
	at com.android.tradefed.testtype.junit4.ExceptionThrowingRunnerWrapper.run(ExceptionThrowingRunnerWrapper.java:43)
	at org.junit.runner.JUnitCore.run(JUnitCore.java:137)
	at com.android.tradefed.testtype.HostTest.runJUnit4Tests(HostTest.java:780)
	at com.android.tradefed.testtype.HostTest.runTestClasses(HostTest.java:660)
	at com.android.tradefed.testtype.HostTest.run(HostTest.java:608)
	at com.android.tradefed.testtype.suite.GranularRetriableTestWrapper.intraModuleRun(GranularRetriableTestWrapper.java:464)
	at com.android.tradefed.testtype.suite.GranularRetriableTestWrapper.run(GranularRetriableTestWrapper.java:353)
	at com.android.tradefed.testtype.suite.ModuleDefinition.run(ModuleDefinition.java:701)
	at com.android.tradefed.testtype.suite.ITestSuite.runSingleModule(ITestSuite.java:1522)
	at com.android.tradefed.testtype.suite.ITestSuite.run(ITestSuite.java:1130)
	at com.android.tradefed.invoker.InvocationExecution.runTest(InvocationExecution.java:1561)
	at com.android.tradefed.invoker.InvocationExecution.runTests(InvocationExecution.java:1324)
	at com.android.tradefed.invoker.TestInvocation.prepareAndRun(TestInvocation.java:696)
	at com.android.tradefed.invoker.TestInvocation.performInvocation(TestInvocation.java:310)
	at com.android.tradefed.invoker.TestInvocation.invoke(TestInvocation.java:1558)
	at com.android.tradefed.command.CommandScheduler$InvocationThread.run(CommandScheduler.java:723)

05-06 13:54:46 D/RunUtil: Running command [adb, -s, SKBFXYWR0LWD, shell, pm, list, features] with timeout: 2m 0s
05-06 13:54:46 W/TestDevice: Feature: feature:com.google.android.tv.hardware.dual_playback_4k60 is not available on SKBFXYWR0LWD
05-06 13:54:46 D/RunUtil: Running command [adb, -s, SKBFXYWR0LWD, shell, pm, list, features] with timeout: 2m 0s
05-06 13:54:47 W/TestDevice: Feature: feature:com.google.android.tv.hardware.dual_playback_4k30 is not available on SKBFXYWR0LWD
05-06 13:54:47 D/RunUtil: Running command [adb, -s, SKBFXYWR0LWD, shell, pm, list, features] with timeout: 2m 0s
05-06 13:54:47 W/TestDevice: Feature: feature:com.google.android.tv.hardware.dual_playback_1080p60 is not available on SKBFXYWR0LWD
05-06 13:54:47 D/RunUtil: Running command [adb, -s, SKBFXYWR0LWD, shell, pm, list, features] with timeout: 2m 0s
05-06 13:54:47 W/TestDevice: Feature: feature:com.google.android.tv.hardware.dual_playback_1080p30 is not available on SKBFXYWR0LWD
05-06 13:54:47 D/RunUtil: Running command [adb, -s, SKBFXYWR0LWD, shell, pm, list, features] with timeout: 2m 0s
05-06 13:54:47 W/TestDevice: Feature: feature:com.google.android.tv.hardware.dual_playback_720p60 is not available on SKBFXYWR0LWD
05-06 13:54:47 D/RunUtil: Running command [adb, -s, SKBFXYWR0LWD, shell, pm, list, features] with timeout: 2m 0s
05-06 13:54:47 W/TestDevice: Feature: feature:com.google.android.tv.hardware.dual_playback_720p30 is not available on SKBFXYWR0LWD
05-06 13:54:47 D/RunUtil: Running command [adb, -s, SKBFXYWR0LWD, shell, pm, list, features] with timeout: 2m 0s
05-06 13:54:47 W/TestDevice: Feature: feature:com.google.android.tv.hardware.dual_playback_540p60 is not available on SKBFXYWR0LWD
05-06 13:54:47 D/RunUtil: Running command [adb, -s, SKBFXYWR0LWD, shell, pm, list, features] with timeout: 2m 0s
05-06 13:54:48 W/TestDevice: Feature: feature:com.google.android.tv.hardware.dual_playback_540p30 is not available on SKBFXYWR0LWD
05-06 13:54:48 D/RunUtil: Running command [adb, -s, SKBFXYWR0LWD, shell, pm, list, features] with timeout: 2m 0s
05-06 13:54:48 W/TestDevice: Feature: feature:com.google.android.tv.hardware.dual_playback_480p60 is not available on SKBFXYWR0LWD
05-06 13:54:48 D/RunUtil: Running command [adb, -s, SKBFXYWR0LWD, shell, pm, list, features] with timeout: 2m 0s
05-06 13:54:48 W/TestDevice: Feature: feature:com.google.android.tv.hardware.dual_playback_480p30 is not available on SKBFXYWR0LWD
05-06 13:54:48 D/com.google.android.tv.concurrent.TvConcurrentPlaybackHostTest: com.google.android.tv.hardware.dual_playback_ not declared on device
05-06 13:54:48 D/PrettyTestEventLogger: 
==================== com.google.android.tv.concurrent.TvConcurrentPlaybackHostTest#testConcurrentDualPlayback STARTED: Wed May 06 13:54:48 KST 2026 ====================
05-06 13:54:48 D/ModuleListener: ModuleListener.testStarted(com.google.android.tv.concurrent.TvConcurrentPlaybackHostTest#testConcurrentDualPlayback) on SKBFXYWR0LWD
05-06 13:54:48 D/PrettyTestEventLogger: 
==================== com.google.android.tv.concurrent.TvConcurrentPlaybackHostTest#testConcurrentDualPlayback ENDED: Wed May 06 13:54:48 KST 2026 ====================
05-06 13:54:48 I/ModuleListener: [9/730] SKBFXYWR0LWD com.google.android.tv.concurrent.TvConcurrentPlaybackHostTest#testConcurrentDualPlayback ASSUMPTION_FAILURE: org.junit.AssumptionViolatedException: Missing capability for: com.google.android.tv.hardware.dual_playback_
	at com.google.android.tv.concurrent.TvConcurrentRunner.runChild(TvConcurrentRunner.java:64)
	at com.google.android.tv.concurrent.TvConcurrentRunner.runChild(TvConcurrentRunner.java:46)
	at org.junit.runners.ParentRunner$4.run(ParentRunner.java:331)
	at org.junit.runners.ParentRunner$1.schedule(ParentRunner.java:79)
	at org.junit.runners.ParentRunner.runChildren(ParentRunner.java:329)
	at org.junit.runners.ParentRunner$2.evaluate(ParentRunner.java:293)
	at org.junit.runners.ParentRunner$3.evaluate(ParentRunner.java:306)
	at org.junit.runners.ParentRunner.run(ParentRunner.java:413)
	at com.android.tradefed.testtype.junit4.ExceptionThrowingRunnerWrapper.run(ExceptionThrowingRunnerWrapper.java:43)
	at org.junit.runner.JUnitCore.run(JUnitCore.java:137)
	at com.android.tradefed.testtype.HostTest.runJUnit4Tests(HostTest.java:780)
	at com.android.tradefed.testtype.HostTest.runTestClasses(HostTest.java:660)
	at com.android.tradefed.testtype.HostTest.run(HostTest.java:608)
	at com.android.tradefed.testtype.suite.GranularRetriableTestWrapper.intraModuleRun(GranularRetriableTestWrapper.java:464)
	at com.android.tradefed.testtype.suite.GranularRetriableTestWrapper.run(GranularRetriableTestWrapper.java:353)
	at com.android.tradefed.testtype.suite.ModuleDefinition.run(ModuleDefinition.java:701)
	at com.android.tradefed.testtype.suite.ITestSuite.runSingleModule(ITestSuite.java:1522)
	at com.android.tradefed.testtype.suite.ITestSuite.run(ITestSuite.java:1130)
	at com.android.tradefed.invoker.InvocationExecution.runTest(InvocationExecution.java:1561)
	at com.android.tradefed.invoker.InvocationExecution.runTests(InvocationExecution.java:1324)
	at com.android.tradefed.invoker.TestInvocation.prepareAndRun(TestInvocation.java:696)
	at com.android.tradefed.invoker.TestInvocation.performInvocation(TestInvocation.java:310)
	at com.android.tradefed.invoker.TestInvocation.invoke(TestInvocation.java:1558)
	at com.android.tradefed.command.CommandScheduler$InvocationThread.run(CommandScheduler.java:723)

05-06 13:54:48 D/RunUtil: Running command [adb, -s, SKBFXYWR0LWD, shell, pm, list, features] with timeout: 2m 0s
05-06 13:54:48 W/TestDevice: Feature: feature:com.google.android.tv.hardware.tunnel_quad_playback_4k60 is not available on SKBFXYWR0LWD
05-06 13:54:48 D/RunUtil: Running command [adb, -s, SKBFXYWR0LWD, shell, pm, list, features] with timeout: 2m 0s
05-06 13:54:48 W/TestDevice: Feature: feature:com.google.android.tv.hardware.tunnel_quad_playback_4k30 is not available on SKBFXYWR0LWD
05-06 13:54:48 D/RunUtil: Running command [adb, -s, SKBFXYWR0LWD, shell, pm, list, features] with timeout: 2m 0s
05-06 13:54:48 W/TestDevice: Feature: feature:com.google.android.tv.hardware.tunnel_quad_playback_1080p60 is not available on SKBFXYWR0LWD
05-06 13:54:48 D/RunUtil: Running command [adb, -s, SKBFXYWR0LWD, shell, pm, list, features] with timeout: 2m 0s
05-06 13:54:48 W/TestDevice: Feature: feature:com.google.android.tv.hardware.tunnel_quad_playback_1080p30 is not available on SKBFXYWR0LWD
05-06 13:54:48 D/RunUtil: Running command [adb, -s, SKBFXYWR0LWD, shell, pm, list, features] with timeout: 2m 0s
05-06 13:54:48 W/TestDevice: Feature: feature:com.google.android.tv.hardware.tunnel_quad_playback_720p60 is not available on SKBFXYWR0LWD
05-06 13:54:48 D/RunUtil: Running command [adb, -s, SKBFXYWR0LWD, shell, pm, list, features] with timeout: 2m 0s
05-06 13:54:49 W/TestDevice: Feature: feature:com.google.android.tv.hardware.tunnel_quad_playback_720p30 is not available on SKBFXYWR0LWD
05-06 13:54:49 D/RunUtil: Running command [adb, -s, SKBFXYWR0LWD, shell, pm, list, features] with timeout: 2m 0s
05-06 13:54:49 W/TestDevice: Feature: feature:com.google.android.tv.hardware.tunnel_quad_playback_540p60 is not available on SKBFXYWR0LWD
05-06 13:54:49 D/RunUtil: Running command [adb, -s, SKBFXYWR0LWD, shell, pm, list, features] with timeout: 2m 0s
05-06 13:54:49 W/TestDevice: Feature: feature:com.google.android.tv.hardware.tunnel_quad_playback_540p30 is not available on SKBFXYWR0LWD
05-06 13:54:49 D/RunUtil: Running command [adb, -s, SKBFXYWR0LWD, shell, pm, list, features] with timeout: 2m 0s
05-06 13:54:49 W/TestDevice: Feature: feature:com.google.android.tv.hardware.tunnel_quad_playback_480p60 is not available on SKBFXYWR0LWD
05-06 13:54:49 D/RunUtil: Running command [adb, -s, SKBFXYWR0LWD, shell, pm, list, features] with timeout: 2m 0s
05-06 13:54:49 W/TestDevice: Feature: feature:com.google.android.tv.hardware.tunnel_quad_playback_480p30 is not available on SKBFXYWR0LWD
05-06 13:54:49 D/com.google.android.tv.concurrent.TvConcurrentPlaybackHostTest: com.google.android.tv.hardware.tunnel_quad_playback_ not declared on device
05-06 13:54:49 D/PrettyTestEventLogger: 
==================== com.google.android.tv.concurrent.TvConcurrentPlaybackHostTest#testConcurrentQuadTunnelPlayback STARTED: Wed May 06 13:54:49 KST 2026 ====================
05-06 13:54:49 D/ModuleListener: ModuleListener.testStarted(com.google.android.tv.concurrent.TvConcurrentPlaybackHostTest#testConcurrentQuadTunnelPlayback) on SKBFXYWR0LWD
05-06 13:54:49 D/PrettyTestEventLogger: 
==================== com.google.android.tv.concurrent.TvConcurrentPlaybackHostTest#testConcurrentQuadTunnelPlayback ENDED: Wed May 06 13:54:49 KST 2026 ====================
05-06 13:54:49 I/ModuleListener: [10/730] SKBFXYWR0LWD com.google.android.tv.concurrent.TvConcurrentPlaybackHostTest#testConcurrentQuadTunnelPlayback ASSUMPTION_FAILURE: org.junit.AssumptionViolatedException: Missing capability for: com.google.android.tv.hardware.tunnel_quad_playback_
	at com.google.android.tv.concurrent.TvConcurrentRunner.runChild(TvConcurrentRunner.java:64)
	at com.google.android.tv.concurrent.TvConcurrentRunner.runChild(TvConcurrentRunner.java:46)
	at org.junit.runners.ParentRunner$4.run(ParentRunner.java:331)
	at org.junit.runners.ParentRunner$1.schedule(ParentRunner.java:79)
	at org.junit.runners.ParentRunner.runChildren(ParentRunner.java:329)
	at org.junit.runners.ParentRunner$2.evaluate(ParentRunner.java:293)
	at org.junit.runners.ParentRunner$3.evaluate(ParentRunner.java:306)
	at org.junit.runners.ParentRunner.run(ParentRunner.java:413)
	at com.android.tradefed.testtype.junit4.ExceptionThrowingRunnerWrapper.run(ExceptionThrowingRunnerWrapper.java:43)
	at org.junit.runner.JUnitCore.run(JUnitCore.java:137)
	at com.android.tradefed.testtype.HostTest.runJUnit4Tests(HostTest.java:780)
	at com.android.tradefed.testtype.HostTest.runTestClasses(HostTest.java:660)
	at com.android.tradefed.testtype.HostTest.run(HostTest.java:608)
	at com.android.tradefed.testtype.suite.GranularRetriableTestWrapper.intraModuleRun(GranularRetriableTestWrapper.java:464)
	at com.android.tradefed.testtype.suite.GranularRetriableTestWrapper.run(GranularRetriableTestWrapper.java:353)
	at com.android.tradefed.testtype.suite.ModuleDefinition.run(ModuleDefinition.java:701)
	at com.android.tradefed.testtype.suite.ITestSuite.runSingleModule(ITestSuite.java:1522)
	at com.android.tradefed.testtype.suite.ITestSuite.run(ITestSuite.java:1130)
	at com.android.tradefed.invoker.InvocationExecution.runTest(InvocationExecution.java:1561)
	at com.android.tradefed.invoker.InvocationExecution.runTests(InvocationExecution.java:1324)
	at com.android.tradefed.invoker.TestInvocation.prepareAndRun(TestInvocation.java:696)
	at com.android.tradefed.invoker.TestInvocation.performInvocation(TestInvocation.java:310)
	at com.android.tradefed.invoker.TestInvocation.invoke(TestInvocation.java:1558)
	at com.android.tradefed.command.CommandScheduler$InvocationThread.run(CommandScheduler.java:723)

05-06 13:54:49 E/HostTest: Could not find option with name 'codec_combination'
com.android.tradefed.config.ConfigurationException[OPTION_CONFIGURATION_ERROR|500008|CUSTOMER_ISSUE]: Could not find option with name 'codec_combination'
	at com.android.tradefed.config.OptionSetter.fieldsForArg(OptionSetter.java:335)
	at com.android.tradefed.config.OptionSetter.setOptionValue(OptionSetter.java:388)
	at com.android.tradefed.config.OptionSetter.setOptionValue(OptionSetter.java:370)
	at com.android.tradefed.testtype.HostTest.injectOption(HostTest.java:1213)
	at com.android.tradefed.testtype.HostTest.setOptionToLoadedObject(HostTest.java:1189)
	at com.android.tradefed.testtype.junit4.DeviceParameterizedRunner.methodInvoker(DeviceParameterizedRunner.java:97)
	at org.junit.runners.BlockJUnit4ClassRunner.methodBlock(BlockJUnit4ClassRunner.java:316)
	at junitparams.JUnitParamsRunner.access$000(JUnitParamsRunner.java:387)
	at junitparams.JUnitParamsRunner$1.getMethodBlock(JUnitParamsRunner.java:396)
	at junitparams.internal.InstanceFrameworkMethod.run(InstanceFrameworkMethod.java:55)
	at junitparams.JUnitParamsRunner.runChild(JUnitParamsRunner.java:420)
	at com.google.android.tv.concurrent.TvConcurrentRunner.runChild(TvConcurrentRunner.java:74)
	at com.google.android.tv.concurrent.TvConcurrentRunner.runChild(TvConcurrentRunner.java:46)
	at org.junit.runners.ParentRunner$4.run(ParentRunner.java:331)
	at org.junit.runners.ParentRunner$1.schedule(ParentRunner.java:79)
	at org.junit.runners.ParentRunner.runChildren(ParentRunner.java:329)
	at org.junit.runners.ParentRunner$2.evaluate(ParentRunner.java:293)
	at org.junit.runners.ParentRunner$3.evaluate(ParentRunner.java:306)
	at org.junit.runners.ParentRunner.run(ParentRunner.java:413)
	at com.android.tradefed.testtype.junit4.ExceptionThrowingRunnerWrapper.run(ExceptionThrowingRunnerWrapper.java:43)
	at org.junit.runner.JUnitCore.run(JUnitCore.java:137)
	at com.android.tradefed.testtype.HostTest.runJUnit4Tests(HostTest.java:780)
	at com.android.tradefed.testtype.HostTest.runTestClasses(HostTest.java:660)
	at com.android.tradefed.testtype.HostTest.run(HostTest.java:608)
	at com.android.tradefed.testtype.suite.GranularRetriableTestWrapper.intraModuleRun(GranularRetriableTestWrapper.java:464)
	at com.android.tradefed.testtype.suite.GranularRetriableTestWrapper.run(GranularRetriableTestWrapper.java:353)
	at com.android.tradefed.testtype.suite.ModuleDefinition.run(ModuleDefinition.java:701)
	at com.android.tradefed.testtype.suite.ITestSuite.runSingleModule(ITestSuite.java:1522)
	at com.android.tradefed.testtype.suite.ITestSuite.run(ITestSuite.java:1130)
	at com.android.tradefed.invoker.InvocationExecution.runTest(InvocationExecution.java:1561)
	at com.android.tradefed.invoker.InvocationExecution.runTests(InvocationExecution.java:1324)
	at com.android.tradefed.invoker.TestInvocation.prepareAndRun(TestInvocation.java:696)
	at com.android.tradefed.invoker.TestInvocation.performInvocation(TestInvocation.java:310)
	at com.android.tradefed.invoker.TestInvocation.invoke(TestInvocation.java:1558)
	at com.android.tradefed.command.CommandScheduler$InvocationThread.run(CommandScheduler.java:723)

05-06 13:54:49 D/ModuleListener: ModuleListener.testRunFailed(TEST_FAILURE|null|error passing option 'codec_combination:AVC-VP9-AV1-HEVC' down to test class as key=codec_combination value=AVC-VP9-AV1-HEVC) on SKBFXYWR0LWD
05-06 13:54:49 D/PrettyTestEventLogger: 
==================== RUN ENDED: Wed May 06 13:54:49 KST 2026 ====================
05-06 13:54:49 D/ModuleListener: ModuleListener.testRunEnded(8861) on SKBFXYWR0LWD
05-06 13:54:49 D/RunUtil: Running command [adb, -s, SKBFXYWR0LWD, uninstall, android.tvconcurrent.tvts] with timeout: 2m 0s
05-06 13:54:50 D/NativeDevice: Using property ro.build.version.sdk=29 from cache.
05-06 13:54:50 I/NativeDeviceStateMonitor: Device SKBFXYWR0LWD is already ONLINE
05-06 13:54:50 I/NativeDeviceStateMonitor: Waiting 360000 ms for device SKBFXYWR0LWD boot complete
05-06 13:54:50 D/RunUtil: Running command [adb, -s, SKBFXYWR0LWD, shell, getprop dev.bootcomplete] without timeout.
05-06 13:54:50 I/DeviceStateMonitor: Waiting 359919 ms for device SKBFXYWR0LWD package manager
05-06 13:54:50 D/RunUtil: Running command [adb, -s, SKBFXYWR0LWD, shell, pm path android] without timeout.
05-06 13:54:51 I/NativeDeviceStateMonitor: Waiting 359534 ms for device SKBFXYWR0LWD external store
05-06 13:54:51 D/RunUtil: Running command [adb, -s, SKBFXYWR0LWD, shell, stat -f -c "%t" /sdcard] without timeout.
05-06 13:54:51 D/RunUtil: Running command [adb, -s, SKBFXYWR0LWD, shell, echo 'number 1778043291259 one' > '/sdcard/1778043291259'] without timeout.
05-06 13:54:51 D/RunUtil: Running command [adb, -s, SKBFXYWR0LWD, shell, cat '/sdcard/1778043291259'] without timeout.
05-06 13:54:51 D/RunUtil: Running command [adb, -s, SKBFXYWR0LWD, shell, rm '/sdcard/1778043291259'] without timeout.
05-06 13:54:51 I/ConsoleReporter: [SKBFXYWR0LWD] Starting armeabi-v7a TvConcurrentMediaPlaybackHostTestCases with 730 tests
05-06 13:54:51 I/ConsoleReporter: [1/730 armeabi-v7a TvConcurrentMediaPlaybackHostTestCases SKBFXYWR0LWD] com.google.android.tv.concurrent.TvConcurrentPlaybackHostTest#testConcurrentQuadTunnelPlaybackPip assumption failure
05-06 13:54:51 I/ConsoleReporter: [2/730 armeabi-v7a TvConcurrentMediaPlaybackHostTestCases SKBFXYWR0LWD] com.google.android.tv.concurrent.TvConcurrentPlaybackHostTest#testConcurrentSecondaryTunnelPlaybackPip assumption failure
05-06 13:54:51 I/ConsoleReporter: [3/730 armeabi-v7a TvConcurrentMediaPlaybackHostTestCases SKBFXYWR0LWD] com.google.android.tv.concurrent.TvConcurrentPlaybackHostTest#testConcurrentQuadPlayback assumption failure
05-06 13:54:51 I/ConsoleReporter: [4/730 armeabi-v7a TvConcurrentMediaPlaybackHostTestCases SKBFXYWR0LWD] com.google.android.tv.concurrent.TvConcurrentPlaybackHostTest#testConcurrentSecondaryPlayback assumption failure
05-06 13:54:51 I/ConsoleReporter: [5/730 armeabi-v7a TvConcurrentMediaPlaybackHostTestCases SKBFXYWR0LWD] com.google.android.tv.concurrent.TvConcurrentPlaybackHostTest#testConcurrentBasicSecondaryTunnelPlayback assumption failure
05-06 13:54:51 I/ConsoleReporter: [6/730 armeabi-v7a TvConcurrentMediaPlaybackHostTestCases SKBFXYWR0LWD] com.google.android.tv.concurrent.TvConcurrentPlaybackHostTest#testConcurrentQuadPlaybackPip assumption failure
05-06 13:54:51 I/ConsoleReporter: [7/730 armeabi-v7a TvConcurrentMediaPlaybackHostTestCases SKBFXYWR0LWD] com.google.android.tv.concurrent.TvConcurrentPlaybackHostTest#testConcurrentDualTunnelPlayback assumption failure
05-06 13:54:51 I/ConsoleReporter: [8/730 armeabi-v7a TvConcurrentMediaPlaybackHostTestCases SKBFXYWR0LWD] com.google.android.tv.concurrent.TvConcurrentPlaybackHostTest#testConcurrentSecondaryPlaybackPip assumption failure
05-06 13:54:51 I/ConsoleReporter: [9/730 armeabi-v7a TvConcurrentMediaPlaybackHostTestCases SKBFXYWR0LWD] com.google.android.tv.concurrent.TvConcurrentPlaybackHostTest#testConcurrentDualPlayback assumption failure
05-06 13:54:51 I/ConsoleReporter: [10/730 armeabi-v7a TvConcurrentMediaPlaybackHostTestCases SKBFXYWR0LWD] com.google.android.tv.concurrent.TvConcurrentPlaybackHostTest#testConcurrentQuadTunnelPlayback assumption failure
05-06 13:54:51 I/ConsoleReporter: [SKBFXYWR0LWD] error passing option 'codec_combination:AVC-VP9-AV1-HEVC' down to test class as key=codec_combination value=AVC-VP9-AV1-HEVC
05-06 13:54:51 I/ConsoleReporter: [SKBFXYWR0LWD] armeabi-v7a TvConcurrentMediaPlaybackHostTestCases failed in 11s. 0 passed, 0 failed, 720 not executed
05-06 13:54:51 D/FileUtil: Creating temp file at /home/dev2-google04/android-tvts/android-tvts-2.17r1-arm-15298624/android-tvts/tools/./../../android-tvts/results/2026.05.06_13.53.10/proto with prefix "tmp-proto" suffix ""
05-06 13:54:51 D/PrettyPrintDelimiter: 
=============================
===== TEST PHASE ENDING =====
=============================
05-06 13:54:51 D/LogFileSaver: Log data for device_logcat_test_SKBFXYWR0LWD is already compressed, skipping compression
05-06 13:54:51 D/FileUtil: Creating temp file at /home/dev2-google04/android-tvts/android-tvts-2.17r1-arm-15298624/android-tvts/tools/./../../android-tvts/logs/2026.05.06_13.53.10/inv_6359429154753753061 with prefix "device_logcat_test_SKBFXYWR0LWD_" suffix ".txt"
05-06 13:54:51 I/LogFileSaver: Saved log file /home/dev2-google04/android-tvts/android-tvts-2.17r1-arm-15298624/android-tvts/tools/./../../android-tvts/logs/2026.05.06_13.53.10/inv_6359429154753753061/device_logcat_test_SKBFXYWR0LWD_15221386363112558417.txt. [size=2298657, elapsed=8ms]
05-06 13:54:51 D/CertificationSuiteResultReporter: Saved logs for device_logcat_test_SKBFXYWR0LWD in /home/dev2-google04/android-tvts/android-tvts-2.17r1-arm-15298624/android-tvts/tools/./../../android-tvts/logs/2026.05.06_13.53.10/inv_6359429154753753061/device_logcat_test_SKBFXYWR0LWD_15221386363112558417.txt
05-06 13:54:51 D/LogFileSaver: Log data for device_logcat_test_SKBFXYWR0LWD is already compressed, skipping compression
05-06 13:54:51 D/FileUtil: Creating temp file at /tmp/15298624/tvts/inv_13594903554352170475/inv_8065306156279417283 with prefix "device_logcat_test_SKBFXYWR0LWD_" suffix ".txt"
05-06 13:54:51 I/LogFileSaver: Saved log file /tmp/15298624/tvts/inv_13594903554352170475/inv_8065306156279417283/device_logcat_test_SKBFXYWR0LWD_12824552932583410231.txt. [size=2298657, elapsed=8ms]
05-06 13:54:51 I/CommandInterrupter: Interrupt blocked
05-06 13:54:51 D/TestInvocation: Testing minimum responsiveness.
05-06 13:54:51 I/NativeDeviceStateMonitor: Device SKBFXYWR0LWD is already ONLINE
05-06 13:54:51 D/RunUtil: Running command [adb, -s, SKBFXYWR0LWD, shell, getprop, ro.build.version.sdk] with timeout: 45s
05-06 13:54:51 D/FileUtil: Creating temp file at /home/dev2-google04/android-tvts/android-tvts-2.17r1-arm-15298624/android-tvts/tools/./../../android-tvts/logs/2026.05.06_13.53.10/inv_6359429154753753061 with prefix "executeShellCommandLog_SKBFXYWR0LWD_" suffix ".txt.gz"
05-06 13:54:51 I/LogFileSaver: Saved gzip log file /home/dev2-google04/android-tvts/android-tvts-2.17r1-arm-15298624/android-tvts/tools/./../../android-tvts/logs/2026.05.06_13.53.10/inv_6359429154753753061/executeShellCommandLog_SKBFXYWR0LWD_12229232992603742588.txt.gz. [size=10, elapsed=1ms]
05-06 13:54:51 D/CertificationSuiteResultReporter: Saved logs for executeShellCommandLog_SKBFXYWR0LWD in /home/dev2-google04/android-tvts/android-tvts-2.17r1-arm-15298624/android-tvts/tools/./../../android-tvts/logs/2026.05.06_13.53.10/inv_6359429154753753061/executeShellCommandLog_SKBFXYWR0LWD_12229232992603742588.txt.gz
05-06 13:54:51 D/FileUtil: Creating temp file at /tmp/15298624/tvts/inv_13594903554352170475/inv_8065306156279417283 with prefix "executeShellCommandLog_SKBFXYWR0LWD_" suffix ".txt.gz"
05-06 13:54:51 I/LogFileSaver: Saved gzip log file /tmp/15298624/tvts/inv_13594903554352170475/inv_8065306156279417283/executeShellCommandLog_SKBFXYWR0LWD_14547160377920773882.txt.gz. [size=10, elapsed=0ms]
05-06 13:54:51 D/TestInvocation: Checking that devices are online.
05-06 13:54:51 I/NativeDeviceStateMonitor: Device SKBFXYWR0LWD is already ONLINE
05-06 13:54:51 I/NativeDeviceStateMonitor: Waiting 179999 ms for device SKBFXYWR0LWD boot complete
05-06 13:54:51 D/RunUtil: Running command [adb, -s, SKBFXYWR0LWD, shell, getprop dev.bootcomplete] without timeout.
05-06 13:54:51 I/DeviceStateMonitor: Waiting 179953 ms for device SKBFXYWR0LWD package manager
05-06 13:54:51 D/RunUtil: Running command [adb, -s, SKBFXYWR0LWD, shell, pm path android] without timeout.
05-06 13:54:52 I/NativeDeviceStateMonitor: Waiting 179870 ms for device SKBFXYWR0LWD external store
05-06 13:54:52 D/RunUtil: Running command [adb, -s, SKBFXYWR0LWD, shell, echo, $EXTERNAL_STORAGE] with timeout: 2m 0s
05-06 13:54:52 D/RunUtil: Running command [adb, -s, SKBFXYWR0LWD, shell, stat -f -c "%t" /sdcard] without timeout.
05-06 13:54:52 D/RunUtil: Running command [adb, -s, SKBFXYWR0LWD, shell, echo 'number 1778043292059 one' > '/sdcard/1778043292059'] without timeout.
05-06 13:54:52 D/RunUtil: Running command [adb, -s, SKBFXYWR0LWD, shell, cat '/sdcard/1778043292059'] without timeout.
05-06 13:54:52 D/RunUtil: Running command [adb, -s, SKBFXYWR0LWD, shell, rm '/sdcard/1778043292059'] without timeout.
05-06 13:54:52 D/InvocationExecution: starting tearDown 'com.google.android.perfverify.tvts.prep.ApkChecker@1da959a2' on device: 'SKBFXYWR0LWD'
05-06 13:54:52 D/InvocationExecution: done with tearDown 'com.google.android.perfverify.tvts.prep.ApkChecker@1da959a2' on device: 'SKBFXYWR0LWD' in 0 ms
05-06 13:54:52 D/InvocationExecution: starting tearDown 'com.google.android.perfverify.tvts.prep.ApkChecker@5c76bf23' on device: 'SKBFXYWR0LWD'
05-06 13:54:52 D/InvocationExecution: done with tearDown 'com.google.android.perfverify.tvts.prep.ApkChecker@5c76bf23' on device: 'SKBFXYWR0LWD' in 1 ms
05-06 13:54:52 D/InvocationExecution: starting tearDown 'com.google.android.perfverify.tvts.prep.ApkChecker@2cbb024d' on device: 'SKBFXYWR0LWD'
05-06 13:54:52 D/InvocationExecution: done with tearDown 'com.google.android.perfverify.tvts.prep.ApkChecker@2cbb024d' on device: 'SKBFXYWR0LWD' in 0 ms
05-06 13:54:52 D/InvocationExecution: starting tearDown 'com.google.android.perfverify.tvts.prep.ApkChecker@3d7efbb' on device: 'SKBFXYWR0LWD'
05-06 13:54:52 D/InvocationExecution: done with tearDown 'com.google.android.perfverify.tvts.prep.ApkChecker@3d7efbb' on device: 'SKBFXYWR0LWD' in 0 ms
05-06 13:54:52 D/InvocationExecution: starting tearDown 'com.google.android.perfverify.tvts.prep.ApkChecker@6d05937c' on device: 'SKBFXYWR0LWD'
05-06 13:54:52 D/InvocationExecution: done with tearDown 'com.google.android.perfverify.tvts.prep.ApkChecker@6d05937c' on device: 'SKBFXYWR0LWD' in 1 ms
05-06 13:54:52 D/InvocationExecution: starting tearDown 'com.google.android.perfverify.tvts.prep.ApkChecker@4796f56c' on device: 'SKBFXYWR0LWD'
05-06 13:54:52 D/InvocationExecution: done with tearDown 'com.google.android.perfverify.tvts.prep.ApkChecker@4796f56c' on device: 'SKBFXYWR0LWD' in 0 ms
05-06 13:54:52 D/InvocationExecution: starting tearDown 'com.google.android.perfverify.tvts.prep.ApkChecker@3e322e32' on device: 'SKBFXYWR0LWD'
05-06 13:54:52 D/InvocationExecution: done with tearDown 'com.google.android.perfverify.tvts.prep.ApkChecker@3e322e32' on device: 'SKBFXYWR0LWD' in 0 ms
05-06 13:54:52 D/InvocationExecution: starting tearDown 'com.google.android.perfverify.tvts.prep.ApkChecker@46d51d2a' on device: 'SKBFXYWR0LWD'
05-06 13:54:52 D/InvocationExecution: done with tearDown 'com.google.android.perfverify.tvts.prep.ApkChecker@46d51d2a' on device: 'SKBFXYWR0LWD' in 0 ms
05-06 13:54:52 D/InvocationExecution: starting tearDown 'com.google.android.perfverify.tvts.prep.ApkChecker@29407f35' on device: 'SKBFXYWR0LWD'
05-06 13:54:52 D/InvocationExecution: done with tearDown 'com.google.android.perfverify.tvts.prep.ApkChecker@29407f35' on device: 'SKBFXYWR0LWD' in 0 ms
05-06 13:54:52 D/InvocationExecution: starting tearDown 'com.google.android.perfverify.tvts.prep.ApkChecker@5795d909' on device: 'SKBFXYWR0LWD'
05-06 13:54:52 D/InvocationExecution: done with tearDown 'com.google.android.perfverify.tvts.prep.ApkChecker@5795d909' on device: 'SKBFXYWR0LWD' in 1 ms
05-06 13:54:52 D/InvocationExecution: starting tearDown 'com.google.android.perfverify.tvts.prep.ApkChecker@38b814e6' on device: 'SKBFXYWR0LWD'
05-06 13:54:52 D/InvocationExecution: done with tearDown 'com.google.android.perfverify.tvts.prep.ApkChecker@38b814e6' on device: 'SKBFXYWR0LWD' in 0 ms
05-06 13:54:52 D/InvocationExecution: starting tearDown 'com.google.android.perfverify.tvts.prep.ApkChecker@5197cdaa' on device: 'SKBFXYWR0LWD'
05-06 13:54:52 D/InvocationExecution: done with tearDown 'com.google.android.perfverify.tvts.prep.ApkChecker@5197cdaa' on device: 'SKBFXYWR0LWD' in 0 ms
05-06 13:54:52 D/InvocationExecution: starting tearDown 'com.google.android.perfverify.tvts.prep.ApkChecker@54d54fc9' on device: 'SKBFXYWR0LWD'
05-06 13:54:52 D/InvocationExecution: done with tearDown 'com.google.android.perfverify.tvts.prep.ApkChecker@54d54fc9' on device: 'SKBFXYWR0LWD' in 0 ms
05-06 13:54:52 D/InvocationExecution: starting tearDown 'com.google.android.perfverify.tvts.TvtsSetupAndTearDown@17448475' on device: 'SKBFXYWR0LWD'
05-06 13:54:52 D/NativeDevice: Using property ro.build.version.sdk=29 from cache.
05-06 13:54:52 D/NativeDevice: Using 'ls' to check doesFileExist(/storage/emulated/0/Download/failure-screenshots)
05-06 13:54:52 D/RunUtil: Running command [adb, -s, SKBFXYWR0LWD, shell, ls, '/storage/emulated/0/Download/failure-screenshots'] with timeout: 2m 0s
05-06 13:54:52 W/NativeDevice: Adb Shell Command : adb -s SKBFXYWR0LWD shell ls '/storage/emulated/0/Download/failure-screenshots'
05-06 13:54:52 W/NativeDevice: Adb Shell Command exited with status: FAILED
05-06 13:54:52 W/NativeDevice: Adb Shell Command shell stdout:


05-06 13:54:52 W/NativeDevice: Adb Shell Command shell stderr:
ls: /storage/emulated/0/Download/failure-screenshots: No such file or directory


05-06 13:54:52 D/NativeDevice: File /storage/emulated/0/Download/failure-screenshots does not exist.
stdout: 
stderr: ls: /storage/emulated/0/Download/failure-screenshots: No such file or directory

05-06 13:54:52 E/NativeDevice: Device path /storage/emulated/0/Download/failure-screenshots does not exist to be pulled.
05-06 13:54:52 D/NativeDevice: Using 'ls' to check doesFileExist(/data/local/tmp/files)
05-06 13:54:52 D/RunUtil: Running command [adb, -s, SKBFXYWR0LWD, shell, ls, '/data/local/tmp/files'] with timeout: 2m 0s
05-06 13:54:52 D/RunUtil: Running command [adb, -s, SKBFXYWR0LWD, shell, ls, -l, /\/data\/local\/tmp\/files/] with timeout: 2m 0s
05-06 13:54:52 I/NativeDevice: Device path is empty, nothing to do.
05-06 13:54:52 D/NativeDevice: Using property ro.build.version.sdk=29 from cache.
05-06 13:54:52 D/InvocationExecution: done with tearDown 'com.google.android.perfverify.tvts.TvtsSetupAndTearDown@17448475' on device: 'SKBFXYWR0LWD' in 527 ms
05-06 13:54:52 D/InvocationExecution: starting tearDown 'com.android.tradefed.targetprep.suite.SuiteApkInstaller@7e320b79' on device: 'SKBFXYWR0LWD'
05-06 13:54:52 D/RunUtil: Running command [adb, -s, SKBFXYWR0LWD, uninstall, com.google.android.resolution.tvts] with timeout: 2m 0s
05-06 13:54:53 D/InvocationExecution: done with tearDown 'com.android.tradefed.targetprep.suite.SuiteApkInstaller@7e320b79' on device: 'SKBFXYWR0LWD' in 602 ms
05-06 13:54:53 D/InvocationExecution: starting tearDown 'com.android.compatibility.common.tradefed.targetprep.PropertyCheck@791658ce' on device: 'SKBFXYWR0LWD'
05-06 13:54:53 D/InvocationExecution: done with tearDown 'com.android.compatibility.common.tradefed.targetprep.PropertyCheck@791658ce' on device: 'SKBFXYWR0LWD' in 1 ms
05-06 13:54:53 D/InvocationExecution: starting tearDown 'com.android.compatibility.common.tradefed.targetprep.PropertyCheck@5adc4df3' on device: 'SKBFXYWR0LWD'
05-06 13:54:53 D/InvocationExecution: done with tearDown 'com.android.compatibility.common.tradefed.targetprep.PropertyCheck@5adc4df3' on device: 'SKBFXYWR0LWD' in 0 ms
05-06 13:54:53 D/InvocationExecution: starting tearDown 'com.android.tradefed.targetprep.RunCommandTargetPreparer@56f7d076' on device: 'SKBFXYWR0LWD'
05-06 13:54:53 D/InvocationExecution: done with tearDown 'com.android.tradefed.targetprep.RunCommandTargetPreparer@56f7d076' on device: 'SKBFXYWR0LWD' in 0 ms
05-06 13:54:53 D/InvocationExecution: starting tearDown 'com.android.compatibility.common.tradefed.targetprep.FilePusher@61ddc57d' on device: 'SKBFXYWR0LWD'
05-06 13:54:54 D/InvocationExecution: done with tearDown 'com.android.compatibility.common.tradefed.targetprep.FilePusher@61ddc57d' on device: 'SKBFXYWR0LWD' in 891 ms
05-06 13:54:54 D/InvocationExecution: starting tearDown 'com.android.tradefed.targetprep.RunCommandTargetPreparer@3882472e' on device: 'SKBFXYWR0LWD'
05-06 13:54:54 D/InvocationExecution: done with tearDown 'com.android.tradefed.targetprep.RunCommandTargetPreparer@3882472e' on device: 'SKBFXYWR0LWD' in 0 ms
05-06 13:54:54 D/InvocationExecution: starting tearDown 'com.android.compatibility.common.tradefed.targetprep.ReportLogCollector@74f04553' on device: 'SKBFXYWR0LWD'
05-06 13:54:54 D/NativeDevice: Using property ro.build.version.sdk=29 from cache.
05-06 13:54:54 D/NativeDevice: Using 'ls' to check doesFileExist(/storage/emulated/0/report-log-files/)
05-06 13:54:54 D/RunUtil: Running command [adb, -s, SKBFXYWR0LWD, shell, ls, '/storage/emulated/0/report-log-files/'] with timeout: 2m 0s
05-06 13:54:54 W/NativeDevice: Adb Shell Command : adb -s SKBFXYWR0LWD shell ls '/storage/emulated/0/report-log-files/'
05-06 13:54:54 W/NativeDevice: Adb Shell Command exited with status: FAILED
05-06 13:54:54 W/NativeDevice: Adb Shell Command shell stdout:


05-06 13:54:54 W/NativeDevice: Adb Shell Command shell stderr:
ls: /storage/emulated/0/report-log-files/: No such file or directory


05-06 13:54:54 D/NativeDevice: File /storage/emulated/0/report-log-files/ does not exist.
stdout: 
stderr: ls: /storage/emulated/0/report-log-files/: No such file or directory

05-06 13:54:54 E/NativeDevice: Device path /sdcard/report-log-files/ does not exist to be pulled.
05-06 13:54:54 D/InvocationExecution: done with tearDown 'com.android.compatibility.common.tradefed.targetprep.ReportLogCollector@74f04553' on device: 'SKBFXYWR0LWD' in 382 ms
05-06 13:54:54 D/InvocationExecution: starting tearDown 'com.google.android.perfverify.tvts.prep.DeviceReliabilityVerifier@65de346c' on device: 'SKBFXYWR0LWD'
05-06 13:54:54 D/InvocationExecution: done with tearDown 'com.google.android.perfverify.tvts.prep.DeviceReliabilityVerifier@65de346c' on device: 'SKBFXYWR0LWD' in 1 ms
05-06 13:54:54 D/InvocationExecution: starting tearDown 'com.android.compatibility.common.tradefed.targetprep.DeviceInfoCollector@461e83d4' on device: 'SKBFXYWR0LWD'
05-06 13:54:54 D/InvocationExecution: done with tearDown 'com.android.compatibility.common.tradefed.targetprep.DeviceInfoCollector@461e83d4' on device: 'SKBFXYWR0LWD' in 3 ms
05-06 13:54:54 D/InvocationExecution: starting tearDown 'com.android.tradefed.targetprep.RunCommandTargetPreparer@1c8832dd' on device: 'SKBFXYWR0LWD'
05-06 13:54:54 D/InvocationExecution: done with tearDown 'com.android.tradefed.targetprep.RunCommandTargetPreparer@1c8832dd' on device: 'SKBFXYWR0LWD' in 0 ms
05-06 13:54:54 D/RunUtil: Running command [id, -u, dev2-google04] with timeout: 1m 0s
05-06 13:54:54 D/RunUtil: Running command [tail, -c, 10MB, /tmp/adb.1000.log] with timeout: 1m 0s
05-06 13:54:54 D/LogFileSaver: Log data for host_adb_log is already compressed, skipping compression
05-06 13:54:54 D/FileUtil: Creating temp file at /home/dev2-google04/android-tvts/android-tvts-2.17r1-arm-15298624/android-tvts/tools/./../../android-tvts/logs/2026.05.06_13.53.10/inv_6359429154753753061 with prefix "host_adb_log_" suffix ".txt"
05-06 13:54:54 I/LogFileSaver: Saved log file /home/dev2-google04/android-tvts/android-tvts-2.17r1-arm-15298624/android-tvts/tools/./../../android-tvts/logs/2026.05.06_13.53.10/inv_6359429154753753061/host_adb_log_12084618487094934305.txt. [size=82747, elapsed=1ms]
05-06 13:54:54 D/CertificationSuiteResultReporter: Saved logs for host_adb_log in /home/dev2-google04/android-tvts/android-tvts-2.17r1-arm-15298624/android-tvts/tools/./../../android-tvts/logs/2026.05.06_13.53.10/inv_6359429154753753061/host_adb_log_12084618487094934305.txt
05-06 13:54:54 D/LogFileSaver: Log data for host_adb_log is already compressed, skipping compression
05-06 13:54:54 D/FileUtil: Creating temp file at /tmp/15298624/tvts/inv_13594903554352170475/inv_8065306156279417283 with prefix "host_adb_log_" suffix ".txt"
05-06 13:54:54 I/LogFileSaver: Saved log file /tmp/15298624/tvts/inv_13594903554352170475/inv_8065306156279417283/host_adb_log_789361276492291094.txt. [size=82747, elapsed=1ms]
05-06 13:54:54 D/LogFileSaver: Log data for device_logcat_teardown_SKBFXYWR0LWD is already compressed, skipping compression
05-06 13:54:54 D/FileUtil: Creating temp file at /home/dev2-google04/android-tvts/android-tvts-2.17r1-arm-15298624/android-tvts/tools/./../../android-tvts/logs/2026.05.06_13.53.10/inv_6359429154753753061 with prefix "device_logcat_teardown_SKBFXYWR0LWD_" suffix ".txt"
05-06 13:54:54 I/LogFileSaver: Saved log file /home/dev2-google04/android-tvts/android-tvts-2.17r1-arm-15298624/android-tvts/tools/./../../android-tvts/logs/2026.05.06_13.53.10/inv_6359429154753753061/device_logcat_teardown_SKBFXYWR0LWD_18165423383011098391.txt. [size=286467, elapsed=2ms]
05-06 13:54:54 D/CertificationSuiteResultReporter: Saved logs for device_logcat_teardown_SKBFXYWR0LWD in /home/dev2-google04/android-tvts/android-tvts-2.17r1-arm-15298624/android-tvts/tools/./../../android-tvts/logs/2026.05.06_13.53.10/inv_6359429154753753061/device_logcat_teardown_SKBFXYWR0LWD_18165423383011098391.txt
05-06 13:54:54 D/LogFileSaver: Log data for device_logcat_teardown_SKBFXYWR0LWD is already compressed, skipping compression
05-06 13:54:54 D/FileUtil: Creating temp file at /tmp/15298624/tvts/inv_13594903554352170475/inv_8065306156279417283 with prefix "device_logcat_teardown_SKBFXYWR0LWD_" suffix ".txt"
05-06 13:54:54 I/LogFileSaver: Saved log file /tmp/15298624/tvts/inv_13594903554352170475/inv_8065306156279417283/device_logcat_teardown_SKBFXYWR0LWD_7901740504666406138.txt. [size=286467, elapsed=1ms]
05-06 13:54:54 I/TestInvocation: Done stopping logcat for SKBFXYWR0LWD
05-06 13:54:54 D/BackgroundDeviceAction: com.android.ddmlib.TimeoutException while running logcat on SKBFXYWR0LWD. May see duplicated content in log.
05-06 13:54:54 D/BackgroundDeviceAction: Waiting for device SKBFXYWR0LWD online before starting.
05-06 13:54:54 D/CommandScheduler: TestDeviceState for releasing 'SKBFXYWR0LWD(class com.android.tradefed.device.TestDevice)' is 'ONLINE'
05-06 13:54:54 I/NativeDeviceStateMonitor: Waiting 30000 ms for device SKBFXYWR0LWD shell to be responsive
05-06 13:54:54 D/RunUtil: Running command [adb, -s, SKBFXYWR0LWD, features] with timeout: 2m 0s
05-06 13:54:54 D/RunUtil: Running command [adb, -s, SKBFXYWR0LWD, shell, id] without timeout.
05-06 13:54:54 I/NativeDeviceStateMonitor: shell ready. id output: uid=2000(shell) gid=2000(shell) groups=2000(shell),1004(input),1007(log),1011(adb),1015(sdcard_rw),1028(sdcard_r),3001(net_bt_admin),3002(net_bt),3003(inet),3006(net_bw_stats),3009(readproc),3011(uhid) context=u:r:shell:s0

05-06 13:54:54 D/CommandScheduler: Release map of the devices: {com.android.tradefed.device.TestDevice@24517601=AVAILABLE}
05-06 13:54:54 W/NativeDevice: Attempting to stop logcat when not capturing for SKBFXYWR0LWD
05-06 13:54:54 D/TestDevice: No snapuserd notification in progress for BLOCK_BEFORE_RELEASING
