05-06 10:40:21 D/SkipManager: The granularity strategies for device image and build key are FULL_IMAGE and FULL_IMAGE
05-06 10:40:21 D/Configuration: Resolve and download remote files from @Option
05-06 10:40:21 I/TestInvocation: Invocation was started with cmd: tvts-maint-cert -m TvConcurrentMediaPlaybackHostTestCases
05-06 10:40:21 I/TestInvocation: Global Config Env Vars: TF_GLOBAL_CONFIG=null, TF_GLOBAL_CONFIG_SERVER_CONFIG=null
05-06 10:40:21 I/TestInvocation: Effective Global Configuration Source: empty
05-06 10:40:22 D/InvocationExecution: Skip linking external directory as FileProperty was set.
05-06 10:40:22 D/RunUtil: Running command [adb, version] with timeout: 2m 0s
05-06 10:40:22 D/TestInvocation: Fetch build duration: 13 ms
05-06 10:40:22 D/ArtifactsAnalyzer: Build analysis report: BuildAnalysis [mDeviceImageChanged=true, mHasTestsArtifacts=true, mHasChangesInTests=false, mUnchangedModules=[], imageDigests={}, artifactDigests={}]
05-06 10:40:22 D/ArtifactsAnalyzer: Analysis report after test analysis: BuildAnalysis [mDeviceImageChanged=true, mHasTestsArtifacts=true, mHasChangesInTests=true, mUnchangedModules=[], imageDigests={}, artifactDigests={testsdir=null}]
05-06 10:40:22 D/NativeDevice: Using property ro.build.version.sdk=29 from cache.
05-06 10:40:22 D/GlobalTestFilter: Setting up global filters
05-06 10:40:22 D/InvocationExecution: IShardHelper selected: com.android.tradefed.invoker.shard.StrictShardHelper@1b95478e
05-06 10:40:22 D/BackgroundDeviceAction: Waiting for device SKBFXYWR0LWD online before starting.
05-06 10:40:22 D/BackgroundDeviceAction: Device SKBFXYWR0LWD now online.
05-06 10:40:22 D/BackgroundDeviceAction: Starting logcat for SKBFXYWR0LWD.
05-06 10:40:22 I/TestInvocation: Starting invocation for 'tvts' with '[ DeviceBuildInfo{bid=15298624, serial=SKBFXYWR0LWD} on device 'SKBFXYWR0LWD'] 
05-06 10:40:22 D/RunUtil: Running command [chmod, ug+rwx, /tmp/15298624] with timeout: 10s
05-06 10:40:22 D/RunUtil: Running command [chmod, ug+rwx, /tmp/15298624/tvts] with timeout: 10s
05-06 10:40:22 D/FileUtil: Creating temp directory at /tmp/15298624/tvts with prefix "inv_"
05-06 10:40:22 D/RunUtil: Running command [chmod, ug+rwx, /tmp/15298624/tvts/inv_4989505209976318543] with timeout: 10s
05-06 10:40:22 D/FileSystemLogSaver: Using log file directory /tmp/15298624/tvts/inv_4989505209976318543
05-06 10:40:22 D/FileUtil: Creating temp directory at /tmp/15298624/tvts/inv_4989505209976318543 with prefix "inv_"
05-06 10:40:22 I/LogFileSaver: Using log file directory /tmp/15298624/tvts/inv_4989505209976318543/inv_2312744551929213141
05-06 10:40:22 D/CertificationSuiteResultReporter: Initializing result directory
05-06 10:40:22 D/CertificationSuiteResultReporter: Results Directory: /home/dev2-google04/android-tvts/android-tvts-2.17r1-arm-15298624/android-tvts/tools/./../../android-tvts/results/2026.05.06_10.40.21
05-06 10:40:22 D/CertificationSuiteResultReporter: Created log dir /home/dev2-google04/android-tvts/android-tvts-2.17r1-arm-15298624/android-tvts/tools/./../../android-tvts/logs/2026.05.06_10.40.21
05-06 10:40:22 D/FileUtil: Creating temp directory at /home/dev2-google04/android-tvts/android-tvts-2.17r1-arm-15298624/android-tvts/tools/./../../android-tvts/logs/2026.05.06_10.40.21 with prefix "inv_"
05-06 10:40:22 I/LogFileSaver: Using log file directory /home/dev2-google04/android-tvts/android-tvts-2.17r1-arm-15298624/android-tvts/tools/./../../android-tvts/logs/2026.05.06_10.40.21/inv_12800172045122819424
05-06 10:40:22 D/CompatibilityProtoResultReporter: Proto Results Directory: /home/dev2-google04/android-tvts/android-tvts-2.17r1-arm-15298624/android-tvts/tools/./../../android-tvts/results/2026.05.06_10.40.21/proto
05-06 10:40:22 D/FileUtil: Creating temp file at /home/dev2-google04/android-tvts/android-tvts-2.17r1-arm-15298624/android-tvts/tools/./../../android-tvts/results/2026.05.06_10.40.21/proto with prefix "tmp-proto" suffix ""
05-06 10:40:22 D/CompatibilityProtoResultReporter: Proto Results Directory: /home/dev2-google04/android-tvts/android-tvts-2.17r1-arm-15298624/android-tvts/tools/./../../android-tvts/results/2026.05.06_10.40.21/proto
05-06 10:40:22 D/TvtsReporterBase: build id: 15298624
05-06 10:40:22 D/TvtsReporterBase: Initializing result directory
05-06 10:40:22 D/RunUtil: Running command [adb, -s, SKBFXYWR0LWD, shell, getprop, ro.build.fingerprint] with timeout: 45s
05-06 10:40:22 D/TvtsReporterBase: build id: 15298624
05-06 10:40:22 D/TvtsReporterBase: Initializing result directory
05-06 10:40:22 D/NativeDevice: Using property ro.build.fingerprint=SKB/BFX_UA300/BFX-UA300:10/QT/19.561.113-20260424:user/release-keys from cache.
05-06 10:40:22 D/TvtsReporterBase: build id: 15298624
05-06 10:40:22 D/TvtsReporterBase: Initializing result directory
05-06 10:40:22 D/NativeDevice: Using property ro.build.fingerprint=SKB/BFX_UA300/BFX-UA300:10/QT/19.561.113-20260424:user/release-keys from cache.
05-06 10:40:22 D/LogFileSaver: Log data for tradefed-expanded-config is already compressed, skipping compression
05-06 10:40:22 D/FileUtil: Creating temp file at /home/dev2-google04/android-tvts/android-tvts-2.17r1-arm-15298624/android-tvts/tools/./../../android-tvts/logs/2026.05.06_10.40.21/inv_12800172045122819424 with prefix "tradefed-expanded-config_" suffix ".xml"
05-06 10:40:22 I/LogFileSaver: Saved log file /home/dev2-google04/android-tvts/android-tvts-2.17r1-arm-15298624/android-tvts/tools/./../../android-tvts/logs/2026.05.06_10.40.21/inv_12800172045122819424/tradefed-expanded-config_1738094531903358141.xml. [size=14255, elapsed=1ms]
05-06 10:40:22 D/CertificationSuiteResultReporter: Saved logs for tradefed-expanded-config in /home/dev2-google04/android-tvts/android-tvts-2.17r1-arm-15298624/android-tvts/tools/./../../android-tvts/logs/2026.05.06_10.40.21/inv_12800172045122819424/tradefed-expanded-config_1738094531903358141.xml
05-06 10:40:22 D/LogFileSaver: Log data for tradefed-expanded-config is already compressed, skipping compression
05-06 10:40:22 D/FileUtil: Creating temp file at /tmp/15298624/tvts/inv_4989505209976318543/inv_2312744551929213141 with prefix "tradefed-expanded-config_" suffix ".xml"
05-06 10:40:22 I/LogFileSaver: Saved log file /tmp/15298624/tvts/inv_4989505209976318543/inv_2312744551929213141/tradefed-expanded-config_2800287478338229259.xml. [size=14255, elapsed=0ms]
05-06 10:40:22 D/RunUtil: Running command [adb, -s, SKBFXYWR0LWD, shell, dumpsys, battery] with timeout: 2m 0s
05-06 10:40:22 D/InvocationExecution: Starting device pre invocation setup for : 'SKBFXYWR0LWD'
05-06 10:40:22 D/DefaultConnection: Instance type for connection: GCE
05-06 10:40:22 D/DefaultConnection: Instance type for connection: GCE. Evaluating for connection type.
05-06 10:40:22 D/NativeDevice: Using connection: com.android.tradefed.device.connection.DefaultConnection@6e0914e1 (SKBFXYWR0LWD)
05-06 10:40:22 I/CommandInterrupter: Interrupt allowed
05-06 10:40:22 D/InvocationExecution: Starting setup for device: 'SKBFXYWR0LWD'
05-06 10:40:22 D/InvocationExecution: starting preparer 'com.android.tradefed.targetprep.RunCommandTargetPreparer@691f9ac7' on device: 'SKBFXYWR0LWD'
05-06 10:40:22 D/RunUtil: Running command [adb, -s, SKBFXYWR0LWD, shell, rm, -rf, /sdcard/device-info-files] with timeout: 2m 0s
05-06 10:40:22 D/RunUtil: Running command [adb, -s, SKBFXYWR0LWD, shell, rm, -rf, /sdcard/report-log-files] with timeout: 2m 0s
05-06 10:40:22 D/RunUtil: Running command [adb, -s, SKBFXYWR0LWD, shell, rm, -rf, /storage/emulated/0/Download/failure-screenshots] with timeout: 2m 0s
05-06 10:40:22 D/RunUtil: Running command [adb, -s, SKBFXYWR0LWD, shell, rm, -rf, /sdcard/perfetto-traces] with timeout: 2m 0s
05-06 10:40:22 D/RunUtil: Running command [adb, -s, SKBFXYWR0LWD, shell, rm, -rf, /data/local/tmp/files/audio] with timeout: 2m 0s
05-06 10:40:22 D/InvocationExecution: done with preparer 'com.android.tradefed.targetprep.RunCommandTargetPreparer@691f9ac7' on device: 'SKBFXYWR0LWD' in 244 ms
05-06 10:40:22 D/InvocationExecution: starting preparer 'com.android.compatibility.common.tradefed.targetprep.DeviceInfoCollector@258d0fdc' on device: 'SKBFXYWR0LWD'
05-06 10:40:22 D/NativeDevice: Using property ro.build.version.sdk=29 from cache.
05-06 10:40:22 D/RunUtil: Running command [adb, -s, SKBFXYWR0LWD, shell, getprop, ro.product.manufacturer] with timeout: 45s
05-06 10:40:22 D/RunUtil: Running command [adb, -s, SKBFXYWR0LWD, shell, getprop, ro.product.cpu.abilist32] with timeout: 45s
05-06 10:40:22 D/RunUtil: Running command [adb, -s, SKBFXYWR0LWD, shell, getprop, ro.build.reference.fingerprint] with timeout: 45s
05-06 10:40:22 D/RunUtil: Running command [adb, -s, SKBFXYWR0LWD, shell, getprop, ro.product.name] with timeout: 45s
05-06 10:40:22 D/RunUtil: Running command [adb, -s, SKBFXYWR0LWD, shell, getprop, ro.build.tags] with timeout: 45s
05-06 10:40:22 D/RunUtil: Running command [adb, -s, SKBFXYWR0LWD, shell, getprop, ro.build.version.incremental] with timeout: 45s
05-06 10:40:22 D/RunUtil: Running command [adb, -s, SKBFXYWR0LWD, shell, getprop, ro.product.brand] with timeout: 45s
05-06 10:40:22 D/NativeDevice: Using property ro.build.fingerprint=SKB/BFX_UA300/BFX-UA300:10/QT/19.561.113-20260424:user/release-keys from cache.
05-06 10:40:22 D/RunUtil: Running command [adb, -s, SKBFXYWR0LWD, shell, getprop, ro.product.model] with timeout: 45s
05-06 10:40:22 D/RunUtil: Running command [adb, -s, SKBFXYWR0LWD, shell, getprop, ro.product.device] with timeout: 45s
05-06 10:40:22 D/RunUtil: Running command [adb, -s, SKBFXYWR0LWD, shell, getprop, ro.build.id] with timeout: 45s
05-06 10:40:22 D/RunUtil: Running command [adb, -s, SKBFXYWR0LWD, shell, getprop, ro.bootimage.build.fingerprint] with timeout: 45s
05-06 10:40:22 D/NativeDevice: Using property ro.build.version.sdk=29 from cache.
05-06 10:40:22 D/RunUtil: Running command [adb, -s, SKBFXYWR0LWD, shell, getprop, ro.serialno] with timeout: 45s
05-06 10:40:22 D/RunUtil: Running command [adb, -s, SKBFXYWR0LWD, shell, getprop, ro.build.version.security_patch] with timeout: 45s
05-06 10:40:22 D/RunUtil: Running command [adb, -s, SKBFXYWR0LWD, shell, getprop, ro.product.cpu.abi] with timeout: 45s
05-06 10:40:22 D/RunUtil: Running command [adb, -s, SKBFXYWR0LWD, shell, getprop, ro.product.cpu.abilist64] with timeout: 45s
05-06 10:40:22 D/RunUtil: Running command [adb, -s, SKBFXYWR0LWD, shell, getprop, ro.vendor.build.fingerprint] with timeout: 45s
05-06 10:40:23 D/RunUtil: Running command [adb, -s, SKBFXYWR0LWD, shell, getprop, ro.build.version.base_os] with timeout: 45s
05-06 10:40:23 D/NativeDevice: Using property ro.build.version.sdk=29 from cache.
05-06 10:40:23 D/RunUtil: Running command [adb, -s, SKBFXYWR0LWD, shell, getprop, ro.product.cpu.abilist] with timeout: 45s
05-06 10:40:23 D/RunUtil: Running command [adb, -s, SKBFXYWR0LWD, shell, getprop, ro.product.board] with timeout: 45s
05-06 10:40:23 D/RunUtil: Running command [adb, -s, SKBFXYWR0LWD, shell, getprop, ro.build.type] with timeout: 45s
05-06 10:40:23 D/RunUtil: Running command [adb, -s, SKBFXYWR0LWD, shell, getprop, ro.build.version.release] with timeout: 45s
05-06 10:40:23 D/RunUtil: Running command [adb, -s, SKBFXYWR0LWD, shell, getprop, ro.product.cpu.abi2] with timeout: 45s
05-06 10:40:23 D/SearchArtifactUtil: Searching for file TvtsDeviceInfo.apk. Search directories: [./../../android-tvts/testcases, /tmp/tf-workfolder10198943661423249041]
05-06 10:40:23 D/SearchArtifactUtil: Found file /home/dev2-google04/android-tvts/android-tvts-2.17r1-arm-15298624/android-tvts/tools/./../../android-tvts/testcases/TvtsDeviceInfo.apk in search directory /home/dev2-google04/android-tvts/android-tvts-2.17r1-arm-15298624/android-tvts/tools/./../../android-tvts/testcases.
05-06 10:40:23 D/RunUtil: Running command [adb, -s, SKBFXYWR0LWD, shell, dumpsys, package, p] with timeout: 2m 0s
05-06 10:40:23 I/NativeDeviceStateMonitor: Device SKBFXYWR0LWD is already ONLINE
05-06 10:40:23 I/NativeDeviceStateMonitor: Waiting 359999 ms for device SKBFXYWR0LWD boot complete
05-06 10:40:23 D/RunUtil: Running command [adb, -s, SKBFXYWR0LWD, shell, getprop dev.bootcomplete] without timeout.
05-06 10:40:23 I/DeviceStateMonitor: Waiting 359969 ms for device SKBFXYWR0LWD package manager
05-06 10:40:23 D/RunUtil: Running command [adb, -s, SKBFXYWR0LWD, shell, pm path android] without timeout.
05-06 10:40:23 I/NativeDeviceStateMonitor: Waiting 359909 ms for device SKBFXYWR0LWD external store
05-06 10:40:23 D/RunUtil: Running command [adb, -s, SKBFXYWR0LWD, shell, echo, $EXTERNAL_STORAGE] with timeout: 2m 0s
05-06 10:40:23 D/RunUtil: Running command [adb, -s, SKBFXYWR0LWD, shell, stat -f -c "%t" /sdcard] without timeout.
05-06 10:40:23 D/RunUtil: Running command [adb, -s, SKBFXYWR0LWD, shell, echo 'number 1778031623447 one' > '/sdcard/1778031623447'] without timeout.
05-06 10:40:23 D/RunUtil: Running command [adb, -s, SKBFXYWR0LWD, shell, cat '/sdcard/1778031623447'] without timeout.
05-06 10:40:23 D/RunUtil: Running command [adb, -s, SKBFXYWR0LWD, shell, rm '/sdcard/1778031623447'] without timeout.
05-06 10:40:23 I/ApkInstrumentationPreparer: Instrumenting package: com.android.compatibility.common.deviceinfo
05-06 10:40:23 D/NativeDevice: Using property ro.build.version.sdk=29 from cache.
05-06 10:40:23 D/NativeDevice: Using property ro.build.version.codename=REL from cache.
05-06 10:40:23 D/NativeDevice: Using property ro.build.version.sdk=29 from cache.
05-06 10:40:23 D/NativeDevice: Using property ro.build.version.codename=REL from cache.
05-06 10:40:23 D/AndroidJUnitTest: Disabled test storage as it's not supported on that branch.
05-06 10:40:23 D/NativeDevice: Using property ro.build.version.sdk=29 from cache.
05-06 10:40:23 D/NativeDevice: Using property ro.build.version.codename=REL from cache.
05-06 10:40:23 D/NativeDevice: Using property ro.build.version.sdk=29 from cache.
05-06 10:40:23 D/RunUtil: Running command [adb, -s, SKBFXYWR0LWD, install, -r, -g, /home/dev2-google04/android-tvts/android-tvts-2.17r1-arm-15298624/android-tvts/tools/./../../android-tvts/testcases/TvtsDeviceInfo.apk] with timeout: 4m 0s
05-06 10:40:28 D/RunUtil: Running command [aapt, dump, badging, /home/dev2-google04/android-tvts/android-tvts-2.17r1-arm-15298624/android-tvts/tools/./../../android-tvts/testcases/TvtsDeviceInfo.apk] with timeout: 1m 0s
05-06 10:40:28 D/RunUtil: Running command [aapt, dump, xmltree, /home/dev2-google04/android-tvts/android-tvts-2.17r1-arm-15298624/android-tvts/tools/./../../android-tvts/testcases/TvtsDeviceInfo.apk, AndroidManifest.xml] with timeout: 1m 0s
05-06 10:40:28 D/RunUtil: Running command [adb, -s, SKBFXYWR0LWD, shell, appops, write-settings] with timeout: 2m 0s
05-06 10:40:28 D/ListInstrumentationParser: instrumentation:com.android.compatibility.common.deviceinfo/androidx.test.runner.AndroidJUnitRunner (target=com.android.compatibility.common.deviceinfo)
05-06 10:40:28 D/ListInstrumentationParser: 
05-06 10:40:28 I/InstrumentationTest: No runner name specified. Using: androidx.test.runner.AndroidJUnitRunner.
05-06 10:40:28 D/NativeDevice: Using property ro.build.version.sdk=29 from cache.
05-06 10:40:28 D/NativeDevice: Using property ro.build.version.codename=REL from cache.
05-06 10:40:28 D/NativeDevice: Using property ro.build.version.sdk=29 from cache.
05-06 10:40:28 D/NativeDevice: Using property ro.build.version.codename=REL from cache.
05-06 10:40:28 D/InstrumentationTest: Initializing com.android.tradefed.device.metric.CountTestCasesCollector for instrumentation.
05-06 10:40:28 I/RemoteAndroidTestRunner: Running am instrument -w -r --no-isolated-storage  -e newRunListenerMode true -e timeout_msec 300000 com.android.compatibility.common.deviceinfo/androidx.test.runner.AndroidJUnitRunner on foxconn-bfx_ua300-SKBFXYWR0LWD
05-06 10:40:57 D/RunUtil: Running command [adb, -s, SKBFXYWR0LWD, uninstall, com.android.compatibility.common.deviceinfo] with timeout: 2m 0s
05-06 10:40:57 W/ApkInstrumentationPreparer: Target preparation step com.android.compatibility.common.deviceinfo.KeystoreAttestationDeviceInfo#testCollectDeviceInfo failed.
java.lang.NoSuchMethodError: No virtual method setDevicePropertiesAttestationIncluded(Z)Landroid/security/keystore/KeyGenParameterSpec$Builder; in class Landroid/security/keystore/KeyGenParameterSpec$Builder; or its super classes (declaration of 'android.security.keystore.KeyGenParameterSpec$Builder' appears in /system/framework/framework.jar!classes2.dex)
	at com.android.compatibility.common.deviceinfo.KeystoreAttestationDeviceInfo.collectAttestation(KeystoreAttestationDeviceInfo.java:90)
	at com.android.compatibility.common.deviceinfo.KeystoreAttestationDeviceInfo.collectDeviceInfo(KeystoreAttestationDeviceInfo.java:58)
	at com.android.compatibility.common.deviceinfo.DeviceInfo.testCollectDeviceInfo(DeviceInfo.java:96)
	at java.lang.reflect.Method.invoke(Native Method)
	at android.test.InstrumentationTestCase.runMethod(InstrumentationTestCase.java:220)
	at android.test.InstrumentationTestCase.runTest(InstrumentationTestCase.java:205)

05-06 10:40:57 D/NativeDevice: Using property ro.build.version.sdk=29 from cache.
05-06 10:40:57 D/NativeDevice: Using 'ls' to check doesFileExist(/storage/emulated/0/device-info-files/)
05-06 10:40:57 D/RunUtil: Running command [adb, -s, SKBFXYWR0LWD, shell, ls, '/storage/emulated/0/device-info-files/'] with timeout: 2m 0s
05-06 10:40:57 D/RunUtil: Running command [adb, -s, SKBFXYWR0LWD, shell, ls, -l, /\/sdcard\/device-info-files\//] with timeout: 2m 0s
05-06 10:40:57 D/RunUtil: Running command [adb, -s, SKBFXYWR0LWD, pull, //sdcard/device-info-files//device_manifest.xml, /tmp/device-info-files16700841957152257173/device_manifest.xml] with timeout: 2m 0s
05-06 10:40:57 D/RunUtil: Running command [adb, -s, SKBFXYWR0LWD, pull, //sdcard/device-info-files//ConnectivityDeviceInfo.deviceinfo.json, /tmp/device-info-files16700841957152257173/ConnectivityDeviceInfo.deviceinfo.json] with timeout: 2m 0s
05-06 10:40:57 D/RunUtil: Running command [adb, -s, SKBFXYWR0LWD, pull, //sdcard/device-info-files//framework_manifest.xml, /tmp/device-info-files16700841957152257173/framework_manifest.xml] with timeout: 2m 0s
05-06 10:40:57 D/RunUtil: Running command [adb, -s, SKBFXYWR0LWD, pull, //sdcard/device-info-files//AppStandbyDeviceInfo.deviceinfo.json, /tmp/device-info-files16700841957152257173/AppStandbyDeviceInfo.deviceinfo.json] with timeout: 2m 0s
05-06 10:40:58 D/RunUtil: Running command [adb, -s, SKBFXYWR0LWD, pull, //sdcard/device-info-files//MemoryDeviceInfo.deviceinfo.json, /tmp/device-info-files16700841957152257173/MemoryDeviceInfo.deviceinfo.json] with timeout: 2m 0s
05-06 10:40:58 D/RunUtil: Running command [adb, -s, SKBFXYWR0LWD, pull, //sdcard/device-info-files//CpuDeviceInfo.deviceinfo.json, /tmp/device-info-files16700841957152257173/CpuDeviceInfo.deviceinfo.json] with timeout: 2m 0s
05-06 10:40:58 D/RunUtil: Running command [adb, -s, SKBFXYWR0LWD, pull, //sdcard/device-info-files//MediaDeviceInfo.deviceinfo.json, /tmp/device-info-files16700841957152257173/MediaDeviceInfo.deviceinfo.json] with timeout: 2m 0s
05-06 10:40:58 D/RunUtil: Running command [adb, -s, SKBFXYWR0LWD, pull, //sdcard/device-info-files//device_compatibility_matrix.xml, /tmp/device-info-files16700841957152257173/device_compatibility_matrix.xml] with timeout: 2m 0s
05-06 10:40:58 D/RunUtil: Running command [adb, -s, SKBFXYWR0LWD, pull, //sdcard/device-info-files//GnssDeviceInfo.deviceinfo.json, /tmp/device-info-files16700841957152257173/GnssDeviceInfo.deviceinfo.json] with timeout: 2m 0s
05-06 10:40:58 D/RunUtil: Running command [adb, -s, SKBFXYWR0LWD, pull, //sdcard/device-info-files//StorageDeviceInfo.deviceinfo.json, /tmp/device-info-files16700841957152257173/StorageDeviceInfo.deviceinfo.json] with timeout: 2m 0s
05-06 10:40:58 D/RunUtil: Running command [adb, -s, SKBFXYWR0LWD, pull, //sdcard/device-info-files//GraphicsDeviceInfo.deviceinfo.json, /tmp/device-info-files16700841957152257173/GraphicsDeviceInfo.deviceinfo.json] with timeout: 2m 0s
05-06 10:40:58 D/RunUtil: Running command [adb, -s, SKBFXYWR0LWD, pull, //sdcard/device-info-files//ConfigurationDeviceInfo.deviceinfo.json, /tmp/device-info-files16700841957152257173/ConfigurationDeviceInfo.deviceinfo.json] with timeout: 2m 0s
05-06 10:40:58 D/RunUtil: Running command [adb, -s, SKBFXYWR0LWD, pull, //sdcard/device-info-files//DefaultAppDeviceInfo.deviceinfo.json, /tmp/device-info-files16700841957152257173/DefaultAppDeviceInfo.deviceinfo.json] with timeout: 2m 0s
05-06 10:40:58 D/RunUtil: Running command [adb, -s, SKBFXYWR0LWD, pull, //sdcard/device-info-files//framework_compatibility_matrix.xml, /tmp/device-info-files16700841957152257173/framework_compatibility_matrix.xml] with timeout: 2m 0s
05-06 10:40:58 D/RunUtil: Running command [adb, -s, SKBFXYWR0LWD, pull, //sdcard/device-info-files//BiometricsDeviceInfo.deviceinfo.json, /tmp/device-info-files16700841957152257173/BiometricsDeviceInfo.deviceinfo.json] with timeout: 2m 0s
05-06 10:40:58 D/RunUtil: Running command [adb, -s, SKBFXYWR0LWD, pull, //sdcard/device-info-files//GenericDeviceInfo.deviceinfo.json, /tmp/device-info-files16700841957152257173/GenericDeviceInfo.deviceinfo.json] with timeout: 2m 0s
05-06 10:40:58 D/RunUtil: Running command [adb, -s, SKBFXYWR0LWD, pull, //sdcard/device-info-files//PackageDeviceInfo.deviceinfo.json, /tmp/device-info-files16700841957152257173/PackageDeviceInfo.deviceinfo.json] with timeout: 2m 0s
05-06 10:40:58 D/RunUtil: Running command [adb, -s, SKBFXYWR0LWD, pull, //sdcard/device-info-files//FeatureDeviceInfo.deviceinfo.json, /tmp/device-info-files16700841957152257173/FeatureDeviceInfo.deviceinfo.json] with timeout: 2m 0s
05-06 10:40:58 D/RunUtil: Running command [adb, -s, SKBFXYWR0LWD, pull, //sdcard/device-info-files//VintfDeviceInfo.deviceinfo.json, /tmp/device-info-files16700841957152257173/VintfDeviceInfo.deviceinfo.json] with timeout: 2m 0s
05-06 10:40:58 D/RunUtil: Running command [adb, -s, SKBFXYWR0LWD, pull, //sdcard/device-info-files//HapticsDeviceInfo.deviceinfo.json, /tmp/device-info-files16700841957152257173/HapticsDeviceInfo.deviceinfo.json] with timeout: 2m 0s
05-06 10:40:58 D/RunUtil: Running command [adb, -s, SKBFXYWR0LWD, pull, //sdcard/device-info-files//LocaleDeviceInfo.deviceinfo.json, /tmp/device-info-files16700841957152257173/LocaleDeviceInfo.deviceinfo.json] with timeout: 2m 0s
05-06 10:40:58 D/RunUtil: Running command [adb, -s, SKBFXYWR0LWD, pull, //sdcard/device-info-files//DeviceIdleDeviceInfo.deviceinfo.json, /tmp/device-info-files16700841957152257173/DeviceIdleDeviceInfo.deviceinfo.json] with timeout: 2m 0s
05-06 10:40:58 D/RunUtil: Running command [adb, -s, SKBFXYWR0LWD, pull, //sdcard/device-info-files//InputDeviceInfo.deviceinfo.json, /tmp/device-info-files16700841957152257173/InputDeviceInfo.deviceinfo.json] with timeout: 2m 0s
05-06 10:40:58 D/RunUtil: Running command [adb, -s, SKBFXYWR0LWD, pull, //sdcard/device-info-files//UserDeviceInfo.deviceinfo.json, /tmp/device-info-files16700841957152257173/UserDeviceInfo.deviceinfo.json] with timeout: 2m 0s
05-06 10:40:58 D/RunUtil: Running command [adb, -s, SKBFXYWR0LWD, pull, //sdcard/device-info-files//KeystoreAttestationDeviceInfo.deviceinfo.json, /tmp/device-info-files16700841957152257173/KeystoreAttestationDeviceInfo.deviceinfo.json] with timeout: 2m 0s
05-06 10:40:58 D/RunUtil: Running command [adb, -s, SKBFXYWR0LWD, pull, //sdcard/device-info-files//ClientIdDeviceInfo.deviceinfo.json, /tmp/device-info-files16700841957152257173/ClientIdDeviceInfo.deviceinfo.json] with timeout: 2m 0s
05-06 10:40:58 D/RunUtil: Running command [adb, -s, SKBFXYWR0LWD, pull, //sdcard/device-info-files//MediaOutputDeviceInfo.deviceinfo.json, /tmp/device-info-files16700841957152257173/MediaOutputDeviceInfo.deviceinfo.json] with timeout: 2m 0s
05-06 10:40:58 D/FileUtil: Creating temp file at /tmp/15298624/tvts/inv_4989505209976318543/inv_2312744551929213141 with prefix "CpuDeviceInfo.deviceinfo.json_" suffix ".txt.gz"
05-06 10:40:58 I/LogFileSaver: Saved gzip log file /tmp/15298624/tvts/inv_4989505209976318543/inv_2312744551929213141/CpuDeviceInfo.deviceinfo.json_9922176535546398887.txt.gz. [size=10, elapsed=2ms]
05-06 10:40:58 D/FileUtil: Creating temp file at /tmp/15298624/tvts/inv_4989505209976318543/inv_2312744551929213141 with prefix "InputDeviceInfo.deviceinfo.json_" suffix ".txt.gz"
05-06 10:40:58 I/LogFileSaver: Saved gzip log file /tmp/15298624/tvts/inv_4989505209976318543/inv_2312744551929213141/InputDeviceInfo.deviceinfo.json_18261101584252925111.txt.gz. [size=10, elapsed=1ms]
05-06 10:40:58 D/FileUtil: Creating temp file at /tmp/15298624/tvts/inv_4989505209976318543/inv_2312744551929213141 with prefix "ClientIdDeviceInfo.deviceinfo.json_" suffix ".txt.gz"
05-06 10:40:58 I/LogFileSaver: Saved gzip log file /tmp/15298624/tvts/inv_4989505209976318543/inv_2312744551929213141/ClientIdDeviceInfo.deviceinfo.json_10309212439661784431.txt.gz. [size=10, elapsed=0ms]
05-06 10:40:58 D/FileUtil: Creating temp file at /tmp/15298624/tvts/inv_4989505209976318543/inv_2312744551929213141 with prefix "UserDeviceInfo.deviceinfo.json_" suffix ".txt.gz"
05-06 10:40:58 I/LogFileSaver: Saved gzip log file /tmp/15298624/tvts/inv_4989505209976318543/inv_2312744551929213141/UserDeviceInfo.deviceinfo.json_3988486590353443636.txt.gz. [size=10, elapsed=1ms]
05-06 10:40:58 D/FileUtil: Creating temp file at /tmp/15298624/tvts/inv_4989505209976318543/inv_2312744551929213141 with prefix "LocaleDeviceInfo.deviceinfo.json_" suffix ".txt.gz"
05-06 10:40:58 I/LogFileSaver: Saved gzip log file /tmp/15298624/tvts/inv_4989505209976318543/inv_2312744551929213141/LocaleDeviceInfo.deviceinfo.json_3054301559875735398.txt.gz. [size=10, elapsed=0ms]
05-06 10:40:58 D/FileUtil: Creating temp file at /tmp/15298624/tvts/inv_4989505209976318543/inv_2312744551929213141 with prefix "MediaDeviceInfo.deviceinfo.json_" suffix ".txt.gz"
05-06 10:40:58 I/LogFileSaver: Saved gzip log file /tmp/15298624/tvts/inv_4989505209976318543/inv_2312744551929213141/MediaDeviceInfo.deviceinfo.json_13448915258120981763.txt.gz. [size=10, elapsed=2ms]
05-06 10:40:58 D/FileUtil: Creating temp file at /tmp/15298624/tvts/inv_4989505209976318543/inv_2312744551929213141 with prefix "MemoryDeviceInfo.deviceinfo.json_" suffix ".txt.gz"
05-06 10:40:58 I/LogFileSaver: Saved gzip log file /tmp/15298624/tvts/inv_4989505209976318543/inv_2312744551929213141/MemoryDeviceInfo.deviceinfo.json_16611502922068027904.txt.gz. [size=10, elapsed=1ms]
05-06 10:40:58 D/FileUtil: Creating temp file at /tmp/15298624/tvts/inv_4989505209976318543/inv_2312744551929213141 with prefix "GnssDeviceInfo.deviceinfo.json_" suffix ".txt.gz"
05-06 10:40:58 I/LogFileSaver: Saved gzip log file /tmp/15298624/tvts/inv_4989505209976318543/inv_2312744551929213141/GnssDeviceInfo.deviceinfo.json_16580213053669546492.txt.gz. [size=10, elapsed=1ms]
05-06 10:40:58 D/FileUtil: Creating temp file at /tmp/15298624/tvts/inv_4989505209976318543/inv_2312744551929213141 with prefix "ConnectivityDeviceInfo.deviceinfo.json_" suffix ".txt.gz"
05-06 10:40:58 I/LogFileSaver: Saved gzip log file /tmp/15298624/tvts/inv_4989505209976318543/inv_2312744551929213141/ConnectivityDeviceInfo.deviceinfo.json_370301634307787787.txt.gz. [size=10, elapsed=0ms]
05-06 10:40:58 D/FileUtil: Creating temp file at /tmp/15298624/tvts/inv_4989505209976318543/inv_2312744551929213141 with prefix "VintfDeviceInfo.deviceinfo.json_" suffix ".txt.gz"
05-06 10:40:58 I/LogFileSaver: Saved gzip log file /tmp/15298624/tvts/inv_4989505209976318543/inv_2312744551929213141/VintfDeviceInfo.deviceinfo.json_9107440833596749718.txt.gz. [size=10, elapsed=1ms]
05-06 10:40:58 D/FileUtil: Creating temp file at /tmp/15298624/tvts/inv_4989505209976318543/inv_2312744551929213141 with prefix "DefaultAppDeviceInfo.deviceinfo.json_" suffix ".txt.gz"
05-06 10:40:58 I/LogFileSaver: Saved gzip log file /tmp/15298624/tvts/inv_4989505209976318543/inv_2312744551929213141/DefaultAppDeviceInfo.deviceinfo.json_7238256919711839561.txt.gz. [size=10, elapsed=0ms]
05-06 10:40:58 D/FileUtil: Creating temp file at /tmp/15298624/tvts/inv_4989505209976318543/inv_2312744551929213141 with prefix "PackageDeviceInfo.deviceinfo.json_" suffix ".txt.gz"
05-06 10:40:58 I/LogFileSaver: Saved gzip log file /tmp/15298624/tvts/inv_4989505209976318543/inv_2312744551929213141/PackageDeviceInfo.deviceinfo.json_10328037543896604652.txt.gz. [size=22497, elapsed=11ms]
05-06 10:40:58 D/FileUtil: Creating temp file at /home/dev2-google04/android-tvts/android-tvts-2.17r1-arm-15298624/android-tvts/tools/./../../android-tvts/logs/2026.05.06_10.40.21/inv_12800172045122819424 with prefix "device_manifest.xml_" suffix ".txt.gz"
05-06 10:40:58 I/LogFileSaver: Saved gzip log file /home/dev2-google04/android-tvts/android-tvts-2.17r1-arm-15298624/android-tvts/tools/./../../android-tvts/logs/2026.05.06_10.40.21/inv_12800172045122819424/device_manifest.xml_7942205622321473971.txt.gz. [size=10, elapsed=0ms]
05-06 10:40:58 D/CertificationSuiteResultReporter: Saved logs for device_manifest.xml in /home/dev2-google04/android-tvts/android-tvts-2.17r1-arm-15298624/android-tvts/tools/./../../android-tvts/logs/2026.05.06_10.40.21/inv_12800172045122819424/device_manifest.xml_7942205622321473971.txt.gz
05-06 10:40:58 D/FileUtil: Creating temp file at /tmp/15298624/tvts/inv_4989505209976318543/inv_2312744551929213141 with prefix "device_manifest.xml_" suffix ".txt.gz"
05-06 10:40:58 I/LogFileSaver: Saved gzip log file /tmp/15298624/tvts/inv_4989505209976318543/inv_2312744551929213141/device_manifest.xml_15037900216107356129.txt.gz. [size=10, elapsed=1ms]
05-06 10:40:58 D/FileUtil: Creating temp file at /home/dev2-google04/android-tvts/android-tvts-2.17r1-arm-15298624/android-tvts/tools/./../../android-tvts/logs/2026.05.06_10.40.21/inv_12800172045122819424 with prefix "framework_compatibility_matrix.xml_" suffix ".txt.gz"
05-06 10:40:58 I/LogFileSaver: Saved gzip log file /home/dev2-google04/android-tvts/android-tvts-2.17r1-arm-15298624/android-tvts/tools/./../../android-tvts/logs/2026.05.06_10.40.21/inv_12800172045122819424/framework_compatibility_matrix.xml_13143372102319161641.txt.gz. [size=10, elapsed=2ms]
05-06 10:40:58 D/CertificationSuiteResultReporter: Saved logs for framework_compatibility_matrix.xml in /home/dev2-google04/android-tvts/android-tvts-2.17r1-arm-15298624/android-tvts/tools/./../../android-tvts/logs/2026.05.06_10.40.21/inv_12800172045122819424/framework_compatibility_matrix.xml_13143372102319161641.txt.gz
05-06 10:40:58 D/FileUtil: Creating temp file at /tmp/15298624/tvts/inv_4989505209976318543/inv_2312744551929213141 with prefix "framework_compatibility_matrix.xml_" suffix ".txt.gz"
05-06 10:40:58 I/LogFileSaver: Saved gzip log file /tmp/15298624/tvts/inv_4989505209976318543/inv_2312744551929213141/framework_compatibility_matrix.xml_15393790323271774501.txt.gz. [size=10, elapsed=1ms]
05-06 10:40:58 D/FileUtil: Creating temp file at /tmp/15298624/tvts/inv_4989505209976318543/inv_2312744551929213141 with prefix "GraphicsDeviceInfo.deviceinfo.json_" suffix ".txt.gz"
05-06 10:40:58 I/LogFileSaver: Saved gzip log file /tmp/15298624/tvts/inv_4989505209976318543/inv_2312744551929213141/GraphicsDeviceInfo.deviceinfo.json_15176256789230673403.txt.gz. [size=10, elapsed=1ms]
05-06 10:40:58 D/FileUtil: Creating temp file at /tmp/15298624/tvts/inv_4989505209976318543/inv_2312744551929213141 with prefix "BiometricsDeviceInfo.deviceinfo.json_" suffix ".txt.gz"
05-06 10:40:58 I/LogFileSaver: Saved gzip log file /tmp/15298624/tvts/inv_4989505209976318543/inv_2312744551929213141/BiometricsDeviceInfo.deviceinfo.json_5923327744710569269.txt.gz. [size=10, elapsed=0ms]
05-06 10:40:58 D/FileUtil: Creating temp file at /tmp/15298624/tvts/inv_4989505209976318543/inv_2312744551929213141 with prefix "KeystoreAttestationDeviceInfo.deviceinfo.json_" suffix ".txt.gz"
05-06 10:40:58 I/LogFileSaver: Saved gzip log file /tmp/15298624/tvts/inv_4989505209976318543/inv_2312744551929213141/KeystoreAttestationDeviceInfo.deviceinfo.json_24200943587036239.txt.gz. [size=10, elapsed=0ms]
05-06 10:40:58 D/FileUtil: Creating temp file at /tmp/15298624/tvts/inv_4989505209976318543/inv_2312744551929213141 with prefix "MediaOutputDeviceInfo.deviceinfo.json_" suffix ".txt.gz"
05-06 10:40:58 I/LogFileSaver: Saved gzip log file /tmp/15298624/tvts/inv_4989505209976318543/inv_2312744551929213141/MediaOutputDeviceInfo.deviceinfo.json_9639939553982224640.txt.gz. [size=10, elapsed=0ms]
05-06 10:40:58 D/FileUtil: Creating temp file at /tmp/15298624/tvts/inv_4989505209976318543/inv_2312744551929213141 with prefix "StorageDeviceInfo.deviceinfo.json_" suffix ".txt.gz"
05-06 10:40:58 I/LogFileSaver: Saved gzip log file /tmp/15298624/tvts/inv_4989505209976318543/inv_2312744551929213141/StorageDeviceInfo.deviceinfo.json_15487076389381439845.txt.gz. [size=10, elapsed=0ms]
05-06 10:40:58 D/FileUtil: Creating temp file at /tmp/15298624/tvts/inv_4989505209976318543/inv_2312744551929213141 with prefix "GenericDeviceInfo.deviceinfo.json_" suffix ".txt.gz"
05-06 10:40:58 I/LogFileSaver: Saved gzip log file /tmp/15298624/tvts/inv_4989505209976318543/inv_2312744551929213141/GenericDeviceInfo.deviceinfo.json_4912510846714183034.txt.gz. [size=10, elapsed=0ms]
05-06 10:40:58 D/FileUtil: Creating temp file at /home/dev2-google04/android-tvts/android-tvts-2.17r1-arm-15298624/android-tvts/tools/./../../android-tvts/logs/2026.05.06_10.40.21/inv_12800172045122819424 with prefix "framework_manifest.xml_" suffix ".txt.gz"
05-06 10:40:58 I/LogFileSaver: Saved gzip log file /home/dev2-google04/android-tvts/android-tvts-2.17r1-arm-15298624/android-tvts/tools/./../../android-tvts/logs/2026.05.06_10.40.21/inv_12800172045122819424/framework_manifest.xml_9684520479755021667.txt.gz. [size=10, elapsed=0ms]
05-06 10:40:58 D/CertificationSuiteResultReporter: Saved logs for framework_manifest.xml in /home/dev2-google04/android-tvts/android-tvts-2.17r1-arm-15298624/android-tvts/tools/./../../android-tvts/logs/2026.05.06_10.40.21/inv_12800172045122819424/framework_manifest.xml_9684520479755021667.txt.gz
05-06 10:40:58 D/FileUtil: Creating temp file at /tmp/15298624/tvts/inv_4989505209976318543/inv_2312744551929213141 with prefix "framework_manifest.xml_" suffix ".txt.gz"
05-06 10:40:58 I/LogFileSaver: Saved gzip log file /tmp/15298624/tvts/inv_4989505209976318543/inv_2312744551929213141/framework_manifest.xml_7528395497968194915.txt.gz. [size=10, elapsed=0ms]
05-06 10:40:58 D/FileUtil: Creating temp file at /tmp/15298624/tvts/inv_4989505209976318543/inv_2312744551929213141 with prefix "HapticsDeviceInfo.deviceinfo.json_" suffix ".txt.gz"
05-06 10:40:58 I/LogFileSaver: Saved gzip log file /tmp/15298624/tvts/inv_4989505209976318543/inv_2312744551929213141/HapticsDeviceInfo.deviceinfo.json_11778579264867642487.txt.gz. [size=10, elapsed=0ms]
05-06 10:40:58 D/FileUtil: Creating temp file at /tmp/15298624/tvts/inv_4989505209976318543/inv_2312744551929213141 with prefix "AppStandbyDeviceInfo.deviceinfo.json_" suffix ".txt.gz"
05-06 10:40:58 I/LogFileSaver: Saved gzip log file /tmp/15298624/tvts/inv_4989505209976318543/inv_2312744551929213141/AppStandbyDeviceInfo.deviceinfo.json_5206852826630762369.txt.gz. [size=10, elapsed=0ms]
05-06 10:40:58 D/FileUtil: Creating temp file at /tmp/15298624/tvts/inv_4989505209976318543/inv_2312744551929213141 with prefix "DeviceIdleDeviceInfo.deviceinfo.json_" suffix ".txt.gz"
05-06 10:40:58 I/LogFileSaver: Saved gzip log file /tmp/15298624/tvts/inv_4989505209976318543/inv_2312744551929213141/DeviceIdleDeviceInfo.deviceinfo.json_14418048959020042161.txt.gz. [size=10, elapsed=0ms]
05-06 10:40:58 D/FileUtil: Creating temp file at /tmp/15298624/tvts/inv_4989505209976318543/inv_2312744551929213141 with prefix "FeatureDeviceInfo.deviceinfo.json_" suffix ".txt.gz"
05-06 10:40:58 I/LogFileSaver: Saved gzip log file /tmp/15298624/tvts/inv_4989505209976318543/inv_2312744551929213141/FeatureDeviceInfo.deviceinfo.json_10169242209632763849.txt.gz. [size=10, elapsed=0ms]
05-06 10:40:58 D/FileUtil: Creating temp file at /tmp/15298624/tvts/inv_4989505209976318543/inv_2312744551929213141 with prefix "ConfigurationDeviceInfo.deviceinfo.json_" suffix ".txt.gz"
05-06 10:40:58 I/LogFileSaver: Saved gzip log file /tmp/15298624/tvts/inv_4989505209976318543/inv_2312744551929213141/ConfigurationDeviceInfo.deviceinfo.json_10410254690711711587.txt.gz. [size=10, elapsed=1ms]
05-06 10:40:58 D/FileUtil: Creating temp file at /home/dev2-google04/android-tvts/android-tvts-2.17r1-arm-15298624/android-tvts/tools/./../../android-tvts/logs/2026.05.06_10.40.21/inv_12800172045122819424 with prefix "device_compatibility_matrix.xml_" suffix ".txt.gz"
05-06 10:40:58 I/LogFileSaver: Saved gzip log file /home/dev2-google04/android-tvts/android-tvts-2.17r1-arm-15298624/android-tvts/tools/./../../android-tvts/logs/2026.05.06_10.40.21/inv_12800172045122819424/device_compatibility_matrix.xml_2279020899305731518.txt.gz. [size=10, elapsed=0ms]
05-06 10:40:58 D/CertificationSuiteResultReporter: Saved logs for device_compatibility_matrix.xml in /home/dev2-google04/android-tvts/android-tvts-2.17r1-arm-15298624/android-tvts/tools/./../../android-tvts/logs/2026.05.06_10.40.21/inv_12800172045122819424/device_compatibility_matrix.xml_2279020899305731518.txt.gz
05-06 10:40:58 D/FileUtil: Creating temp file at /tmp/15298624/tvts/inv_4989505209976318543/inv_2312744551929213141 with prefix "device_compatibility_matrix.xml_" suffix ".txt.gz"
05-06 10:40:58 I/LogFileSaver: Saved gzip log file /tmp/15298624/tvts/inv_4989505209976318543/inv_2312744551929213141/device_compatibility_matrix.xml_8175024598045641380.txt.gz. [size=10, elapsed=0ms]
05-06 10:40:58 D/InvocationExecution: done with preparer 'com.android.compatibility.common.tradefed.targetprep.DeviceInfoCollector@258d0fdc' on device: 'SKBFXYWR0LWD' in 36s
05-06 10:40:58 D/InvocationExecution: starting preparer 'com.google.android.perfverify.tvts.prep.DeviceReliabilityVerifier@1d7034b5' on device: 'SKBFXYWR0LWD'
05-06 10:40:58 D/InvocationExecution: done with preparer 'com.google.android.perfverify.tvts.prep.DeviceReliabilityVerifier@1d7034b5' on device: 'SKBFXYWR0LWD' in 213 ms
05-06 10:40:58 D/InvocationExecution: starting preparer 'com.android.compatibility.common.tradefed.targetprep.ReportLogCollector@3fcafad9' on device: 'SKBFXYWR0LWD'
05-06 10:40:58 D/InvocationExecution: done with preparer 'com.android.compatibility.common.tradefed.targetprep.ReportLogCollector@3fcafad9' on device: 'SKBFXYWR0LWD' in 1 ms
05-06 10:40:58 D/InvocationExecution: starting preparer 'com.android.tradefed.targetprep.RunCommandTargetPreparer@461e83d4' on device: 'SKBFXYWR0LWD'
05-06 10:40:58 D/RunUtil: Running command [adb, -s, SKBFXYWR0LWD, shell, pkill, memhog] with timeout: 2m 0s
05-06 10:40:58 W/NativeDevice: Adb Shell Command : adb -s SKBFXYWR0LWD shell pkill memhog
05-06 10:40:58 W/NativeDevice: Adb Shell Command exited with status: FAILED
05-06 10:40:58 W/NativeDevice: Adb Shell Command shell stdout:


05-06 10:40:58 W/NativeDevice: Adb Shell Command shell stderr:


05-06 10:40:58 D/RunCommandTargetPreparer: cmd: 'pkill memhog' failed, returned:
stdout:
stderr:
05-06 10:40:58 D/RunUtil: Running command [adb, -s, SKBFXYWR0LWD, shell, pkill, cpuhog] with timeout: 2m 0s
05-06 10:40:58 W/NativeDevice: Adb Shell Command : adb -s SKBFXYWR0LWD shell pkill cpuhog
05-06 10:40:58 W/NativeDevice: Adb Shell Command exited with status: FAILED
05-06 10:40:58 W/NativeDevice: Adb Shell Command shell stdout:


05-06 10:40:58 W/NativeDevice: Adb Shell Command shell stderr:


05-06 10:40:58 D/RunCommandTargetPreparer: cmd: 'pkill cpuhog' failed, returned:
stdout:
stderr:
05-06 10:40:58 D/RunUtil: Running command [adb, -s, SKBFXYWR0LWD, shell, pkill, adb_marker] with timeout: 2m 0s
05-06 10:40:58 W/NativeDevice: Adb Shell Command : adb -s SKBFXYWR0LWD shell pkill adb_marker
05-06 10:40:58 W/NativeDevice: Adb Shell Command exited with status: FAILED
05-06 10:40:58 W/NativeDevice: Adb Shell Command shell stdout:


05-06 10:40:58 W/NativeDevice: Adb Shell Command shell stderr:


05-06 10:40:58 D/RunCommandTargetPreparer: cmd: 'pkill adb_marker' failed, returned:
stdout:
stderr:
05-06 10:40:58 D/InvocationExecution: done with preparer 'com.android.tradefed.targetprep.RunCommandTargetPreparer@461e83d4' on device: 'SKBFXYWR0LWD' in 220 ms
05-06 10:40:58 D/InvocationExecution: starting preparer 'com.android.compatibility.common.tradefed.targetprep.FilePusher@60196068' on device: 'SKBFXYWR0LWD'
05-06 10:40:58 D/PushFilePreparer: Trying to push local 'tvts_memhog' to remote '/data/local/tmp/memhog'
05-06 10:40:58 D/SearchArtifactUtil: Searching for file tvts_memhog. Search directories: [./../../android-tvts/testcases, /tmp/tf-workfolder10198943661423249041]
05-06 10:40:58 D/SearchArtifactUtil: Found file /home/dev2-google04/android-tvts/android-tvts-2.17r1-arm-15298624/android-tvts/tools/./../../android-tvts/testcases/tvts_memhog in search directory /home/dev2-google04/android-tvts/android-tvts-2.17r1-arm-15298624/android-tvts/tools/./../../android-tvts/testcases.
05-06 10:40:58 D/NativeDevice: Push file /home/dev2-google04/android-tvts/android-tvts-2.17r1-arm-15298624/android-tvts/tools/./../../android-tvts/testcases/tvts_memhog with size of 11772 bytes to the device.
05-06 10:40:58 D/RunUtil: Running command [adb, -s, SKBFXYWR0LWD, push, /home/dev2-google04/android-tvts/android-tvts-2.17r1-arm-15298624/android-tvts/tools/./../../android-tvts/testcases/tvts_memhog, /data/local/tmp/memhog] with timeout: 2m 0s
05-06 10:40:59 D/PushFilePreparer: Trying to push local 'tvts_cpuhog' to remote '/data/local/tmp/cpuhog'
05-06 10:40:59 D/SearchArtifactUtil: Searching for file tvts_cpuhog. Search directories: [./../../android-tvts/testcases, /tmp/tf-workfolder10198943661423249041]
05-06 10:40:59 D/SearchArtifactUtil: Found file /home/dev2-google04/android-tvts/android-tvts-2.17r1-arm-15298624/android-tvts/tools/./../../android-tvts/testcases/tvts_cpuhog in search directory /home/dev2-google04/android-tvts/android-tvts-2.17r1-arm-15298624/android-tvts/tools/./../../android-tvts/testcases.
05-06 10:40:59 D/NativeDevice: Push file /home/dev2-google04/android-tvts/android-tvts-2.17r1-arm-15298624/android-tvts/tools/./../../android-tvts/testcases/tvts_cpuhog with size of 9640 bytes to the device.
05-06 10:40:59 D/RunUtil: Running command [adb, -s, SKBFXYWR0LWD, push, /home/dev2-google04/android-tvts/android-tvts-2.17r1-arm-15298624/android-tvts/tools/./../../android-tvts/testcases/tvts_cpuhog, /data/local/tmp/cpuhog] with timeout: 2m 0s
05-06 10:40:59 D/PushFilePreparer: Trying to push local 'adb_marker' to remote '/data/local/tmp/adb_marker'
05-06 10:40:59 D/SearchArtifactUtil: Searching for file adb_marker. Search directories: [./../../android-tvts/testcases, /tmp/tf-workfolder10198943661423249041]
05-06 10:40:59 D/SearchArtifactUtil: Found file /home/dev2-google04/android-tvts/android-tvts-2.17r1-arm-15298624/android-tvts/tools/./../../android-tvts/testcases/adb_marker in search directory /home/dev2-google04/android-tvts/android-tvts-2.17r1-arm-15298624/android-tvts/tools/./../../android-tvts/testcases.
05-06 10:40:59 D/NativeDevice: Push file /home/dev2-google04/android-tvts/android-tvts-2.17r1-arm-15298624/android-tvts/tools/./../../android-tvts/testcases/adb_marker with size of 3188 bytes to the device.
05-06 10:40:59 D/RunUtil: Running command [adb, -s, SKBFXYWR0LWD, push, /home/dev2-google04/android-tvts/android-tvts-2.17r1-arm-15298624/android-tvts/tools/./../../android-tvts/testcases/adb_marker, /data/local/tmp/adb_marker] with timeout: 2m 0s
05-06 10:40:59 D/InvocationExecution: done with preparer 'com.android.compatibility.common.tradefed.targetprep.FilePusher@60196068' on device: 'SKBFXYWR0LWD' in 72 ms
05-06 10:40:59 D/InvocationExecution: starting preparer 'com.android.tradefed.targetprep.RunCommandTargetPreparer@74f04553' on device: 'SKBFXYWR0LWD'
05-06 10:40:59 D/RunUtil: Running command [adb, -s, SKBFXYWR0LWD, shell, chmod, +x, /data/local/tmp/memhog] with timeout: 2m 0s
05-06 10:40:59 D/RunUtil: Running command [adb, -s, SKBFXYWR0LWD, shell, chmod, +x, /data/local/tmp/cpuhog] with timeout: 2m 0s
05-06 10:40:59 D/RunUtil: Running command [adb, -s, SKBFXYWR0LWD, shell, chmod, +x, /data/local/tmp/adb_marker] with timeout: 2m 0s
05-06 10:40:59 D/InvocationExecution: done with preparer 'com.android.tradefed.targetprep.RunCommandTargetPreparer@74f04553' on device: 'SKBFXYWR0LWD' in 123 ms
05-06 10:40:59 D/InvocationExecution: starting preparer 'com.android.compatibility.common.tradefed.targetprep.PropertyCheck@78ad3738' on device: 'SKBFXYWR0LWD'
05-06 10:40:59 D/RunUtil: Running command [adb, -s, SKBFXYWR0LWD, shell, getprop, persist.sys.locale] with timeout: 45s
05-06 10:40:59 D/InvocationExecution: done with preparer 'com.android.compatibility.common.tradefed.targetprep.PropertyCheck@78ad3738' on device: 'SKBFXYWR0LWD' in 36 ms
05-06 10:40:59 D/InvocationExecution: starting preparer 'com.android.compatibility.common.tradefed.targetprep.PropertyCheck@523ca434' on device: 'SKBFXYWR0LWD'
05-06 10:40:59 D/NativeDevice: Using property ro.build.type=user from cache.
05-06 10:40:59 D/InvocationExecution: done with preparer 'com.android.compatibility.common.tradefed.targetprep.PropertyCheck@523ca434' on device: 'SKBFXYWR0LWD' in 0 ms
05-06 10:40:59 D/InvocationExecution: starting preparer 'com.android.tradefed.targetprep.suite.SuiteApkInstaller@7023b5a8' on device: 'SKBFXYWR0LWD'
05-06 10:40:59 D/NativeDevice: Using property ro.build.version.sdk=29 from cache.
05-06 10:40:59 D/NativeDevice: Using property ro.build.version.codename=REL from cache.
05-06 10:40:59 D/NativeDevice: Using property ro.build.version.sdk=29 from cache.
05-06 10:40:59 D/NativeDevice: Using property ro.build.version.codename=REL from cache.
05-06 10:40:59 D/NativeDevice: Using property ro.build.version.sdk=29 from cache.
05-06 10:40:59 D/NativeDevice: Using property ro.build.version.codename=REL from cache.
05-06 10:40:59 D/SearchArtifactUtil: Searching for file TvtsDeviceInformationTests.apk. Search directories: [./../../android-tvts/testcases, /tmp/tf-workfolder10198943661423249041]
05-06 10:40:59 D/SearchArtifactUtil: Found file /home/dev2-google04/android-tvts/android-tvts-2.17r1-arm-15298624/android-tvts/tools/./../../android-tvts/testcases/TvtsDeviceInformationTests.apk in search directory /home/dev2-google04/android-tvts/android-tvts-2.17r1-arm-15298624/android-tvts/tools/./../../android-tvts/testcases.
05-06 10:40:59 D/RunUtil: Running command [aapt2, dump, badging, /home/dev2-google04/android-tvts/android-tvts-2.17r1-arm-15298624/android-tvts/tools/./../../android-tvts/testcases/TvtsDeviceInformationTests.apk] with timeout: 1m 0s
05-06 10:40:59 D/RunUtil: Running command [aapt2, dump, xmltree, /home/dev2-google04/android-tvts/android-tvts-2.17r1-arm-15298624/android-tvts/tools/./../../android-tvts/testcases/TvtsDeviceInformationTests.apk, --file, AndroidManifest.xml] with timeout: 1m 0s
05-06 10:40:59 D/TestAppInstallSetup: Installing apk com.google.android.resolution.tvts with [/home/dev2-google04/android-tvts/android-tvts-2.17r1-arm-15298624/android-tvts/tools/./../../android-tvts/testcases/TvtsDeviceInformationTests.apk] ...
05-06 10:40:59 D/NativeDevice: Using property ro.build.version.sdk=29 from cache.
05-06 10:40:59 D/RunUtil: Running command [adb, -s, SKBFXYWR0LWD, install, -r, -g, -g, /home/dev2-google04/android-tvts/android-tvts-2.17r1-arm-15298624/android-tvts/tools/./../../android-tvts/testcases/TvtsDeviceInformationTests.apk] with timeout: 4m 0s
05-06 10:40:59 D/RunUtil: Running command [aapt, dump, badging, /home/dev2-google04/android-tvts/android-tvts-2.17r1-arm-15298624/android-tvts/tools/./../../android-tvts/testcases/TvtsDeviceInformationTests.apk] with timeout: 1m 0s
05-06 10:40:59 D/RunUtil: Running command [aapt, dump, xmltree, /home/dev2-google04/android-tvts/android-tvts-2.17r1-arm-15298624/android-tvts/tools/./../../android-tvts/testcases/TvtsDeviceInformationTests.apk, AndroidManifest.xml] with timeout: 1m 0s
05-06 10:40:59 D/RunUtil: Running command [adb, -s, SKBFXYWR0LWD, shell, appops, write-settings] with timeout: 2m 0s
05-06 10:40:59 D/InvocationExecution: done with preparer 'com.android.tradefed.targetprep.suite.SuiteApkInstaller@7023b5a8' on device: 'SKBFXYWR0LWD' in 761 ms
05-06 10:40:59 D/InvocationExecution: starting preparer 'com.google.android.perfverify.tvts.TvtsSetupAndTearDown@63bd7bc2' on device: 'SKBFXYWR0LWD'
05-06 10:40:59 D/InvocationExecution: done with preparer 'com.google.android.perfverify.tvts.TvtsSetupAndTearDown@63bd7bc2' on device: 'SKBFXYWR0LWD' in 5 ms
05-06 10:40:59 D/InvocationExecution: starting preparer 'com.google.android.perfverify.tvts.prep.ApkChecker@5cfed46d' on device: 'SKBFXYWR0LWD'
05-06 10:40:59 D/NativeDevice: Using property ro.build.version.sdk=29 from cache.
05-06 10:40:59 W/ApkChecker: Default min apk version: 112006300; Min apk version for Android API Level 29: 0; Min APK version for this device: 0
05-06 10:40:59 D/RunUtil: Running command [adb, -s, SKBFXYWR0LWD, shell, dumpsys, package, com.google.android.youtube.tv|, grep, versionCode] with timeout: 2m 0s
05-06 10:41:00 W/ApkChecker: The newest VersionCode found for the Package com.google.android.youtube.tv:  530320320
05-06 10:41:00 D/InvocationExecution: done with preparer 'com.google.android.perfverify.tvts.prep.ApkChecker@5cfed46d' on device: 'SKBFXYWR0LWD' in 145 ms
05-06 10:41:00 D/InvocationExecution: starting preparer 'com.google.android.perfverify.tvts.prep.ApkChecker@7e320b79' on device: 'SKBFXYWR0LWD'
05-06 10:41:00 D/NativeDevice: Using property ro.build.version.sdk=29 from cache.
05-06 10:41:00 W/ApkChecker: Default min apk version: 15021105; Min apk version for Android API Level 29: 0; Min APK version for this device: 0
05-06 10:41:00 D/RunUtil: Running command [adb, -s, SKBFXYWR0LWD, shell, dumpsys, package, com.google.android.katniss|, grep, versionCode] with timeout: 2m 0s
05-06 10:41:00 W/ApkChecker: The newest VersionCode found for the Package com.google.android.katniss:  15032599
05-06 10:41:00 D/InvocationExecution: done with preparer 'com.google.android.perfverify.tvts.prep.ApkChecker@7e320b79' on device: 'SKBFXYWR0LWD' in 66 ms
05-06 10:41:00 D/InvocationExecution: starting preparer 'com.google.android.perfverify.tvts.prep.ApkChecker@29698edd' on device: 'SKBFXYWR0LWD'
05-06 10:41:00 D/NativeDevice: Using property ro.build.version.sdk=29 from cache.
05-06 10:41:00 W/ApkChecker: Default min apk version: 624525470; Min apk version for Android API Level 29: 0; Min APK version for this device: 0
05-06 10:41:00 D/RunUtil: Running command [adb, -s, SKBFXYWR0LWD, shell, dumpsys, package, com.google.android.play.games|, grep, versionCode] with timeout: 2m 0s
05-06 10:41:00 W/ApkChecker: The newest VersionCode found for the Package com.google.android.play.games:  624523470
05-06 10:41:00 D/InvocationExecution: done with preparer 'com.google.android.perfverify.tvts.prep.ApkChecker@29698edd' on device: 'SKBFXYWR0LWD' in 66 ms
05-06 10:41:00 D/InvocationExecution: starting preparer 'com.google.android.perfverify.tvts.prep.ApkChecker@5334ca50' on device: 'SKBFXYWR0LWD'
05-06 10:41:00 D/NativeDevice: Using property ro.build.version.sdk=29 from cache.
05-06 10:41:00 W/ApkChecker: Default min apk version: 1010936617; Min apk version for Android API Level 29: 0; Min APK version for this device: 0
05-06 10:41:00 D/RunUtil: Running command [adb, -s, SKBFXYWR0LWD, shell, dumpsys, package, com.google.android.tvlauncher|, grep, versionCode] with timeout: 2m 0s
05-06 10:41:00 W/NativeDevice: Adb Shell Command : adb -s SKBFXYWR0LWD shell dumpsys package com.google.android.tvlauncher| grep versionCode
05-06 10:41:00 W/NativeDevice: Adb Shell Command exited with status: FAILED
05-06 10:41:00 W/NativeDevice: Adb Shell Command shell stdout:


05-06 10:41:00 W/NativeDevice: Adb Shell Command shell stderr:


05-06 10:41:00 W/ApkChecker: Property "com.google.android.tvlauncher" not found on device, cannot verify value "0" 
05-06 10:41:00 D/InvocationExecution: done with preparer 'com.google.android.perfverify.tvts.prep.ApkChecker@5334ca50' on device: 'SKBFXYWR0LWD' in 67 ms
05-06 10:41:00 D/InvocationExecution: starting preparer 'com.google.android.perfverify.tvts.prep.ApkChecker@794331e7' on device: 'SKBFXYWR0LWD'
05-06 10:41:00 D/NativeDevice: Using property ro.build.version.sdk=29 from cache.
05-06 10:41:00 W/ApkChecker: Default min apk version: 1010925681; Min apk version for Android API Level 29: 0; Min APK version for this device: 0
05-06 10:41:00 D/RunUtil: Running command [adb, -s, SKBFXYWR0LWD, shell, dumpsys, package, com.google.android.tvrecommendations|, grep, versionCode] with timeout: 2m 0s
05-06 10:41:00 W/ApkChecker: The newest VersionCode found for the Package com.google.android.tvrecommendations:  1010926449
05-06 10:41:00 D/InvocationExecution: done with preparer 'com.google.android.perfverify.tvts.prep.ApkChecker@794331e7' on device: 'SKBFXYWR0LWD' in 63 ms
05-06 10:41:00 D/InvocationExecution: starting preparer 'com.google.android.perfverify.tvts.prep.ApkChecker@17448475' on device: 'SKBFXYWR0LWD'
05-06 10:41:00 D/NativeDevice: Using property ro.build.version.sdk=29 from cache.
05-06 10:41:00 W/ApkChecker: Default min apk version: 1008002; Min apk version for Android API Level 29: 0; Min APK version for this device: 0
05-06 10:41:00 D/RunUtil: Running command [adb, -s, SKBFXYWR0LWD, shell, dumpsys, package, com.google.android.backdrop|, grep, versionCode] with timeout: 2m 0s
05-06 10:41:00 W/ApkChecker: The newest VersionCode found for the Package com.google.android.backdrop:  1008002
05-06 10:41:00 D/InvocationExecution: done with preparer 'com.google.android.perfverify.tvts.prep.ApkChecker@17448475' on device: 'SKBFXYWR0LWD' in 59 ms
05-06 10:41:00 D/InvocationExecution: starting preparer 'com.google.android.perfverify.tvts.prep.ApkChecker@723eef26' on device: 'SKBFXYWR0LWD'
05-06 10:41:00 D/NativeDevice: Using property ro.build.version.sdk=29 from cache.
05-06 10:41:00 W/ApkChecker: Default min apk version: 175416037; Min apk version for Android API Level 29: 0; Min APK version for this device: 0
05-06 10:41:00 D/RunUtil: Running command [adb, -s, SKBFXYWR0LWD, shell, dumpsys, package, com.google.android.inputmethod.latin|, grep, versionCode] with timeout: 2m 0s
05-06 10:41:00 W/NativeDevice: Adb Shell Command : adb -s SKBFXYWR0LWD shell dumpsys package com.google.android.inputmethod.latin| grep versionCode
05-06 10:41:00 W/NativeDevice: Adb Shell Command exited with status: FAILED
05-06 10:41:00 W/NativeDevice: Adb Shell Command shell stdout:


05-06 10:41:00 W/NativeDevice: Adb Shell Command shell stderr:


05-06 10:41:00 W/ApkChecker: Property "com.google.android.inputmethod.latin" not found on device, cannot verify value "0" 
05-06 10:41:00 D/InvocationExecution: done with preparer 'com.google.android.perfverify.tvts.prep.ApkChecker@723eef26' on device: 'SKBFXYWR0LWD' in 57 ms
05-06 10:41:00 D/InvocationExecution: starting preparer 'com.google.android.perfverify.tvts.prep.ApkChecker@72ddd7b' on device: 'SKBFXYWR0LWD'
05-06 10:41:00 D/NativeDevice: Using property ro.build.version.sdk=29 from cache.
05-06 10:41:00 W/ApkChecker: Default min apk version: 733920730; Min apk version for Android API Level 29: 0; Min APK version for this device: 0
05-06 10:41:00 D/RunUtil: Running command [adb, -s, SKBFXYWR0LWD, shell, dumpsys, package, com.google.android.webview|, grep, versionCode] with timeout: 2m 0s
05-06 10:41:00 W/ApkChecker: The newest VersionCode found for the Package com.google.android.webview:  772711100
05-06 10:41:00 D/InvocationExecution: done with preparer 'com.google.android.perfverify.tvts.prep.ApkChecker@72ddd7b' on device: 'SKBFXYWR0LWD' in 55 ms
05-06 10:41:00 D/InvocationExecution: starting preparer 'com.google.android.perfverify.tvts.prep.ApkChecker@67010870' on device: 'SKBFXYWR0LWD'
05-06 10:41:00 D/NativeDevice: Using property ro.build.version.sdk=29 from cache.
05-06 10:41:00 W/ApkChecker: Default min apk version: 252234118; Min apk version for Android API Level 29: 0; Min APK version for this device: 0
05-06 10:41:00 D/RunUtil: Running command [adb, -s, SKBFXYWR0LWD, shell, dumpsys, package, com.google.android.gms|, grep, versionCode] with timeout: 2m 0s
05-06 10:41:00 W/ApkChecker: The newest VersionCode found for the Package com.google.android.gms:  261631115
05-06 10:41:00 D/InvocationExecution: done with preparer 'com.google.android.perfverify.tvts.prep.ApkChecker@67010870' on device: 'SKBFXYWR0LWD' in 142 ms
05-06 10:41:00 D/InvocationExecution: starting preparer 'com.google.android.perfverify.tvts.prep.ApkChecker@54d54fc9' on device: 'SKBFXYWR0LWD'
05-06 10:41:00 D/NativeDevice: Using property ro.build.version.sdk=29 from cache.
05-06 10:41:00 W/ApkChecker: Default min apk version: 84721718; Min apk version for Android API Level 29: 0; Min APK version for this device: 0
05-06 10:41:00 D/RunUtil: Running command [adb, -s, SKBFXYWR0LWD, shell, dumpsys, package, com.android.vending|, grep, versionCode] with timeout: 2m 0s
05-06 10:41:00 W/ApkChecker: The newest VersionCode found for the Package com.android.vending:  85101708
05-06 10:41:00 D/InvocationExecution: done with preparer 'com.google.android.perfverify.tvts.prep.ApkChecker@54d54fc9' on device: 'SKBFXYWR0LWD' in 65 ms
05-06 10:41:00 D/InvocationExecution: starting preparer 'com.google.android.perfverify.tvts.prep.ApkChecker@5197cdaa' on device: 'SKBFXYWR0LWD'
05-06 10:41:00 D/NativeDevice: Using property ro.build.version.sdk=29 from cache.
05-06 10:41:00 W/ApkChecker: Default min apk version: 2018120016; Min apk version for Android API Level 29: 0; Min APK version for this device: 0
05-06 10:41:00 D/RunUtil: Running command [adb, -s, SKBFXYWR0LWD, shell, dumpsys, package, com.google.android.tungsten.setupwraith|, grep, versionCode] with timeout: 2m 0s
05-06 10:41:00 W/ApkChecker: The newest VersionCode found for the Package com.google.android.tungsten.setupwraith:  2018122044
05-06 10:41:00 D/InvocationExecution: done with preparer 'com.google.android.perfverify.tvts.prep.ApkChecker@5197cdaa' on device: 'SKBFXYWR0LWD' in 66 ms
05-06 10:41:00 D/InvocationExecution: starting preparer 'com.google.android.perfverify.tvts.prep.ApkChecker@38b814e6' on device: 'SKBFXYWR0LWD'
05-06 10:41:00 D/NativeDevice: Using property ro.build.version.sdk=29 from cache.
05-06 10:41:00 W/ApkChecker: Default min apk version: 740693; Min apk version for Android API Level 29: null; Min APK version for this device: 740693
05-06 10:41:00 D/RunUtil: Running command [adb, -s, SKBFXYWR0LWD, shell, dumpsys, package, com.google.android.apps.tv.launcherx|, grep, versionCode] with timeout: 2m 0s
05-06 10:41:00 W/NativeDevice: Adb Shell Command : adb -s SKBFXYWR0LWD shell dumpsys package com.google.android.apps.tv.launcherx| grep versionCode
05-06 10:41:00 W/NativeDevice: Adb Shell Command exited with status: FAILED
05-06 10:41:00 W/NativeDevice: Adb Shell Command shell stdout:


05-06 10:41:00 W/NativeDevice: Adb Shell Command shell stderr:


05-06 10:41:00 W/ApkChecker: Property "com.google.android.apps.tv.launcherx" not found on device, cannot verify value "740693" 
05-06 10:41:00 D/InvocationExecution: done with preparer 'com.google.android.perfverify.tvts.prep.ApkChecker@38b814e6' on device: 'SKBFXYWR0LWD' in 55 ms
05-06 10:41:00 D/InvocationExecution: starting preparer 'com.google.android.perfverify.tvts.prep.ApkChecker@5795d909' on device: 'SKBFXYWR0LWD'
05-06 10:41:00 D/NativeDevice: Using property ro.build.version.sdk=29 from cache.
05-06 10:41:00 W/ApkChecker: Default min apk version: 95855518; Min apk version for Android API Level 29: 0; Min APK version for this device: 0
05-06 10:41:00 D/RunUtil: Running command [adb, -s, SKBFXYWR0LWD, shell, dumpsys, package, com.google.android.tv.remote.service|, grep, versionCode] with timeout: 2m 0s
05-06 10:41:00 W/ApkChecker: The newest VersionCode found for the Package com.google.android.tv.remote.service:  95855530
05-06 10:41:00 D/InvocationExecution: done with preparer 'com.google.android.perfverify.tvts.prep.ApkChecker@5795d909' on device: 'SKBFXYWR0LWD' in 57 ms
05-06 10:41:00 D/InvocationExecution: Done with setup of device: 'SKBFXYWR0LWD'
05-06 10:41:00 D/RunUtil: Running command [adb, -s, SKBFXYWR0LWD, shell, uname, -a] with timeout: 2m 0s
05-06 10:41:00 I/InvocationExecution: Device SKBFXYWR0LWD kernel information: 'Linux localhost 4.9.178 #1 SMP PREEMPT Fri Apr 24 16:08:38 KST 2026 armv8l'
05-06 10:41:00 D/RunUtil: Running command [adb, -s, SKBFXYWR0LWD, shell, getprop, ro.system.build.fingerprint] with timeout: 45s
05-06 10:41:01 I/InvocationExecution: Device SKBFXYWR0LWD system image build information: 'SKB/BFX_UA300/BFX-UA300:10/QT/19.561.113-20260424:user/release-keys'
05-06 10:41:01 D/NativeDevice: Using property ro.vendor.build.fingerprint=SKB/BFX_UA300/BFX-UA300:10/QT/19.561.113-20260424:user/release-keys from cache.
05-06 10:41:01 I/InvocationExecution: Device SKBFXYWR0LWD vendor image build information: 'SKB/BFX_UA300/BFX-UA300:10/QT/19.561.113-20260424:user/release-keys'
05-06 10:41:01 D/InvocationExecution: Total setup duration: 38s'
05-06 10:41:01 D/LogFileSaver: Log data for device_logcat_setup_SKBFXYWR0LWD is already compressed, skipping compression
05-06 10:41:01 D/FileUtil: Creating temp file at /home/dev2-google04/android-tvts/android-tvts-2.17r1-arm-15298624/android-tvts/tools/./../../android-tvts/logs/2026.05.06_10.40.21/inv_12800172045122819424 with prefix "device_logcat_setup_SKBFXYWR0LWD_" suffix ".txt"
05-06 10:41:01 I/LogFileSaver: Saved log file /home/dev2-google04/android-tvts/android-tvts-2.17r1-arm-15298624/android-tvts/tools/./../../android-tvts/logs/2026.05.06_10.40.21/inv_12800172045122819424/device_logcat_setup_SKBFXYWR0LWD_4687338171076651598.txt. [size=1740159, elapsed=7ms]
05-06 10:41:01 D/CertificationSuiteResultReporter: Saved logs for device_logcat_setup_SKBFXYWR0LWD in /home/dev2-google04/android-tvts/android-tvts-2.17r1-arm-15298624/android-tvts/tools/./../../android-tvts/logs/2026.05.06_10.40.21/inv_12800172045122819424/device_logcat_setup_SKBFXYWR0LWD_4687338171076651598.txt
05-06 10:41:01 D/LogFileSaver: Log data for device_logcat_setup_SKBFXYWR0LWD is already compressed, skipping compression
05-06 10:41:01 D/FileUtil: Creating temp file at /tmp/15298624/tvts/inv_4989505209976318543/inv_2312744551929213141 with prefix "device_logcat_setup_SKBFXYWR0LWD_" suffix ".txt"
05-06 10:41:01 I/LogFileSaver: Saved log file /tmp/15298624/tvts/inv_4989505209976318543/inv_2312744551929213141/device_logcat_setup_SKBFXYWR0LWD_15112350322752368333.txt. [size=1740159, elapsed=66ms]
05-06 10:41:01 D/PrettyPrintDelimiter: 
===============================
===== TEST PHASE STARTING =====
===============================
05-06 10:41:01 D/TestDevice: No snapuserd notification in progress for BLOCK_BEFORE_TEST
05-06 10:41:01 D/RunUtil: Running command [adb, -s, SKBFXYWR0LWD, shell, cmd, device_state, print-states] with timeout: 2m 0s
05-06 10:41:01 W/NativeDevice: Adb Shell Command : adb -s SKBFXYWR0LWD shell cmd device_state print-states
05-06 10:41:01 W/NativeDevice: Adb Shell Command exited with status: FAILED
05-06 10:41:01 W/NativeDevice: Adb Shell Command shell stdout:


05-06 10:41:01 W/NativeDevice: Adb Shell Command shell stderr:
cmd: Can't find service: device_state


05-06 10:41:01 D/NativeDevice: Using property ro.product.cpu.abi=armeabi-v7a from cache.
05-06 10:41:01 D/BaseTestSuite: Initializing ModuleRepo
ABIs:[{armeabi-v7a, bitness=32}]
Test Args:[com.android.tradefed.testtype.AndroidJUnitTest:exclude-annotation:com.android.compatibility.common.util.PreviewOnly, com.android.compatibility.common.tradefed.testtype.JarHostTest:exclude-annotation:com.android.compatibility.common.util.PreviewOnly, com.android.tradefed.testtype.HostTest:exclude-annotation:com.android.compatibility.common.util.PreviewOnly, com.android.tradefed.testtype.AndroidJUnitTest:rerun-from-file:true, com.android.compatibility.testtype.LibcoreTest:rerun-from-file:true]
Module Args:[TvtsBootToBootCompletedHostTestCases:set-option:measure-launcher-cold-start:true]
Includes: {armeabi-v7a TvConcurrentMediaPlaybackHostTestCases=[TvConcurrentMediaPlaybackHostTestCases]}

05-06 10:41:01 D/BaseTestSuite: Loading tests from [/home/dev2-google04/android-tvts/android-tvts-2.17r1-arm-15298624/android-tvts/tools/./../../android-tvts/testcases]
05-06 10:41:01 D/ITestSuite: No remote build info, skipping stageTestArtifacts
05-06 10:41:01 D/ITestSuite: Resource not found for allowed preparers: /suite/google-allowed-preparers.txt
05-06 10:41:01 D/ITestSuite: [Total Unique Modules = 1]
05-06 10:41:01 I/ITestSuite: SKBFXYWR0LWD running 1 modules: [armeabi-v7a TvConcurrentMediaPlaybackHostTestCases]
05-06 10:41:01 D/TradefedFeatureClient: invoking feature 'skipFeature'
05-06 10:41:01 D/TradefedFeatureClient: Using reference id from metrics.
05-06 10:41:01 D/TradefedFeatureClient: name: "skipFeature"
reference_id: "2b33fe71-f127-4b5b-bb40-1681aafa39a8"

05-06 10:41:01 D/TradefedFeatureServer: Executing com.android.tradefed.result.skipped.SkipFeature@5c47d4fe with [name: "skipFeature"
reference_id: "2b33fe71-f127-4b5b-bb40-1681aafa39a8"
]
05-06 10:41:01 D/SkipManager: Final device digests are: {}
05-06 10:41:01 D/TradefedFeatureClient: Feature name: skipFeature. response: multi_part_response {
  response_part {
    key: "delimiter"
    value: "\\+,"
  }
  response_part {
    key: "presubmit"
    value: "false"
  }
  response_part {
    key: "skipModules"
  }
  response_part {
    key: "imageDigests"
  }
}

05-06 10:41:01 D/BaseTestSuite: Filters for 'armeabi-v7a TvConcurrentMediaPlaybackHostTestCases': []
05-06 10:41:01 D/ITestSuite: com.google.android.perfverify.tvts.collectors.DebugHostLogCollector@46c22a5b isn't applicable at module level. Skipping.
05-06 10:41:01 D/FileUtil: Creating temp file at /tmp/tf-workfolder10198943661423249041 with prefix "TvConcurrentMediaPlaybackHostTestCases" suffix ".xml"
05-06 10:41:01 D/RunUtil: Running command [chmod, ug+rwx, /tmp/15298624/tvts/inv_4989505209976318543/inv_2312744551929213141/TvConcurrentMediaPlaybackHostTestCases] with timeout: 10s
05-06 10:41:01 D/FileUtil: Creating temp directory at /tmp/15298624/tvts/inv_4989505209976318543/inv_2312744551929213141/TvConcurrentMediaPlaybackHostTestCases with prefix "inv_"
05-06 10:41:01 D/RunUtil: Running command [chmod, ug+rwx, /tmp/15298624/tvts/inv_4989505209976318543/inv_2312744551929213141/TvConcurrentMediaPlaybackHostTestCases/inv_3302497625518589861] with timeout: 10s
05-06 10:41:02 D/FileSystemLogSaver: Using log file directory /tmp/15298624/tvts/inv_4989505209976318543/inv_2312744551929213141/TvConcurrentMediaPlaybackHostTestCases/inv_3302497625518589861
05-06 10:41:02 I/LogFileSaver: Using log file directory /tmp/15298624/tvts/inv_4989505209976318543/inv_2312744551929213141/TvConcurrentMediaPlaybackHostTestCases/inv_3302497625518589861
05-06 10:41:02 D/RunUtil: Running command [chmod, ug+rwx, /home/dev2-google04/android-tvts/android-tvts-2.17r1-arm-15298624/android-tvts/tools/./../../android-tvts/logs/2026.05.06_10.40.21/inv_12800172045122819424/TvConcurrentMediaPlaybackHostTestCases] with timeout: 10s
05-06 10:41:02 D/FileUtil: Creating temp directory at /home/dev2-google04/android-tvts/android-tvts-2.17r1-arm-15298624/android-tvts/tools/./../../android-tvts/logs/2026.05.06_10.40.21/inv_12800172045122819424/TvConcurrentMediaPlaybackHostTestCases with prefix "inv_"
05-06 10:41:02 I/LogFileSaver: Using log file directory /home/dev2-google04/android-tvts/android-tvts-2.17r1-arm-15298624/android-tvts/tools/./../../android-tvts/logs/2026.05.06_10.40.21/inv_12800172045122819424/TvConcurrentMediaPlaybackHostTestCases/inv_6380757138456350547
05-06 10:41:02 D/LogFileSaver: Log data for module-configuration is already compressed, skipping compression
05-06 10:41:02 D/FileUtil: Creating temp file at /home/dev2-google04/android-tvts/android-tvts-2.17r1-arm-15298624/android-tvts/tools/./../../android-tvts/logs/2026.05.06_10.40.21/inv_12800172045122819424/TvConcurrentMediaPlaybackHostTestCases/inv_6380757138456350547 with prefix "module-configuration_" suffix ".xml"
05-06 10:41:02 I/LogFileSaver: Saved log file /home/dev2-google04/android-tvts/android-tvts-2.17r1-arm-15298624/android-tvts/tools/./../../android-tvts/logs/2026.05.06_10.40.21/inv_12800172045122819424/TvConcurrentMediaPlaybackHostTestCases/inv_6380757138456350547/module-configuration_5852860315978394719.xml. [size=2079, elapsed=1ms]
05-06 10:41:02 D/CertificationSuiteResultReporter: Saved logs for module-configuration in /home/dev2-google04/android-tvts/android-tvts-2.17r1-arm-15298624/android-tvts/tools/./../../android-tvts/logs/2026.05.06_10.40.21/inv_12800172045122819424/TvConcurrentMediaPlaybackHostTestCases/inv_6380757138456350547/module-configuration_5852860315978394719.xml
05-06 10:41:02 D/LogFileSaver: Log data for module-configuration is already compressed, skipping compression
05-06 10:41:02 D/FileUtil: Creating temp file at /tmp/15298624/tvts/inv_4989505209976318543/inv_2312744551929213141/TvConcurrentMediaPlaybackHostTestCases/inv_3302497625518589861 with prefix "module-configuration_" suffix ".xml"
05-06 10:41:02 I/LogFileSaver: Saved log file /tmp/15298624/tvts/inv_4989505209976318543/inv_2312744551929213141/TvConcurrentMediaPlaybackHostTestCases/inv_3302497625518589861/module-configuration_6887791541021479911.xml (type:HARNESS_CONFIG). [size=2079, elapsed=0ms]
05-06 10:41:02 D/ModuleDefinition: Running module armeabi-v7a TvConcurrentMediaPlaybackHostTestCases
05-06 10:41:02 D/ModuleDefinition: Running setup preparer: DynamicConfigPusher
05-06 10:41:02 I/UrlReplacement: UrlReplacement file [/home/dev2-google04/android-tvts/android-tvts-2.17r1-arm-15298624/android-tvts/tools/UrlReplacement.xml] does not exist
05-06 10:41:02 D/SearchArtifactUtil: Searching for file CtsTVConcurrentPlaybackTestCases.dynamic. Search directories: [/home/dev2-google04/android-tvts/android-tvts-2.17r1-arm-15298624/android-tvts/tools/./../../android-tvts/testcases, ./../../android-tvts/testcases, /tmp/tf-workfolder10198943661423249041]
05-06 10:41:02 W/SearchArtifactUtil: we have a module name: TvConcurrentMediaPlaybackHostTestCases but no directory found in /home/dev2-google04/android-tvts/android-tvts-2.17r1-arm-15298624/android-tvts/tools/./../../android-tvts/testcases.
05-06 10:41:02 D/SearchArtifactUtil: Found file /home/dev2-google04/android-tvts/android-tvts-2.17r1-arm-15298624/android-tvts/tools/./../../android-tvts/testcases/CtsTVConcurrentPlaybackTestCases.dynamic in search directory /home/dev2-google04/android-tvts/android-tvts-2.17r1-arm-15298624/android-tvts/tools/./../../android-tvts/testcases.
05-06 10:41:02 I/DynamicConfigPusher: Replacing {suite-name} placeholder with CTS from test suite tags in dynamic config url.
05-06 10:41:02 D/ModuleDefinition: Running setup preparer: DynamicConfigPusher
05-06 10:41:02 D/SearchArtifactUtil: Searching for file CtsTVConcurrentPlaybackTestCases.dynamic. Search directories: [/home/dev2-google04/android-tvts/android-tvts-2.17r1-arm-15298624/android-tvts/tools/./../../android-tvts/testcases, ./../../android-tvts/testcases, /tmp/tf-workfolder10198943661423249041]
05-06 10:41:02 W/SearchArtifactUtil: we have a module name: TvConcurrentMediaPlaybackHostTestCases but no directory found in /home/dev2-google04/android-tvts/android-tvts-2.17r1-arm-15298624/android-tvts/tools/./../../android-tvts/testcases.
05-06 10:41:02 D/SearchArtifactUtil: Found file /home/dev2-google04/android-tvts/android-tvts-2.17r1-arm-15298624/android-tvts/tools/./../../android-tvts/testcases/CtsTVConcurrentPlaybackTestCases.dynamic in search directory /home/dev2-google04/android-tvts/android-tvts-2.17r1-arm-15298624/android-tvts/tools/./../../android-tvts/testcases.
05-06 10:41:02 I/DynamicConfigPusher: Replacing {suite-name} placeholder with CTS from test suite tags in dynamic config url.
05-06 10:41:02 D/NativeDevice: Using property ro.build.version.sdk=29 from cache.
05-06 10:41:02 D/NativeDevice: Push file /tmp/CtsTVConcurrentPlaybackTestCases1617750389388198423.dynamic with size of 516 bytes to the device.
05-06 10:41:02 D/RunUtil: Running command [adb, -s, SKBFXYWR0LWD, push, /tmp/CtsTVConcurrentPlaybackTestCases1617750389388198423.dynamic, /sdcard/dynamic-config-files/CtsTVConcurrentPlaybackTestCases.dynamic] with timeout: 2m 0s
05-06 10:41:02 D/NativeDevice: Using property ro.build.version.sdk=29 from cache.
05-06 10:41:02 D/NativeDevice: Using property ro.build.version.sdk=29 from cache.
05-06 10:41:02 D/NativeDevice: Using property ro.build.version.sdk=29 from cache.
05-06 10:41:02 D/TradefedContentProvider.apk12878362708764750706.apk: Uploading TradefedContentProvider.apk12878362708764750706.apk onto device 'SKBFXYWR0LWD'
05-06 10:41:02 D/DeviceImpl: Uploading file onto device 'SKBFXYWR0LWD'
05-06 10:41:02 D/FilePermissionUtil: Reading file permission of /tmp/TradefedContentProvider.apk12878362708764750706.apk as: rw-rw-r--
05-06 10:41:03 D/RunUtil: Running command [aapt, dump, badging, /tmp/TradefedContentProvider.apk12878362708764750706.apk] with timeout: 1m 0s
05-06 10:41:03 D/RunUtil: Running command [aapt, dump, xmltree, /tmp/TradefedContentProvider.apk12878362708764750706.apk, AndroidManifest.xml] with timeout: 1m 0s
05-06 10:41:03 D/RunUtil: Running command [adb, -s, SKBFXYWR0LWD, shell, appops, write-settings] with timeout: 2m 0s
05-06 10:41:03 D/RunUtil: Running command [adb, -s, SKBFXYWR0LWD, shell, cmd, appops, set, android.tradefed.contentprovider, android:legacy_storage, allow] with timeout: 2m 0s
05-06 10:41:03 D/RunUtil: Running command [adb, -s, SKBFXYWR0LWD, shell, cmd, appops, get, android.tradefed.contentprovider] with timeout: 2m 0s
05-06 10:41:03 D/ModuleDefinition: Running setup preparer: MediaPreparer
05-06 10:41:03 D/NativeDevice: Using property ro.build.version.sdk=29 from cache.
05-06 10:41:04 I/MediaPreparer: host downloads to: /tmp/CtsTVConcurrentPlaybackTestCases
05-06 10:41:04 I/MediaPreparer: new cache semantics: verify against a TOC
05-06 10:41:04 I/MediaPreparer: Host-cached copy is complete in /tmp/CtsTVConcurrentPlaybackTestCases
05-06 10:41:04 I/MediaPreparer: Media files located on host at: /tmp/CtsTVConcurrentPlaybackTestCases/CtsTVConcurrentPlaybackTestCases-1.7.1
05-06 10:41:04 D/ModuleDefinition: Running setup preparer: SuiteApkInstaller
05-06 10:41:04 D/TestAppInstallSetup: Using abi armeabi-v7a from abi option.
05-06 10:41:04 D/NativeDevice: Using property ro.build.version.sdk=29 from cache.
05-06 10:41:04 D/NativeDevice: Using property ro.build.version.sdk=29 from cache.
05-06 10:41:04 D/NativeDevice: Using property ro.build.version.codename=REL from cache.
05-06 10:41:04 D/NativeDevice: Using property ro.build.version.sdk=29 from cache.
05-06 10:41:04 D/NativeDevice: Using property ro.build.version.codename=REL from cache.
05-06 10:41:04 D/NativeDevice: Using property ro.build.version.sdk=29 from cache.
05-06 10:41:04 D/NativeDevice: Using property ro.build.version.codename=REL from cache.
05-06 10:41:04 D/SearchArtifactUtil: Searching for file CtsTVConcurrentPlaybackTestCases.apk. Search directories: [/home/dev2-google04/android-tvts/android-tvts-2.17r1-arm-15298624/android-tvts/tools/./../../android-tvts/testcases, ./../../android-tvts/testcases, /tmp/tf-workfolder10198943661423249041]
05-06 10:41:04 W/SearchArtifactUtil: we have a module name: TvConcurrentMediaPlaybackHostTestCases but no directory found in /home/dev2-google04/android-tvts/android-tvts-2.17r1-arm-15298624/android-tvts/tools/./../../android-tvts/testcases.
05-06 10:41:04 D/SearchArtifactUtil: Found file /home/dev2-google04/android-tvts/android-tvts-2.17r1-arm-15298624/android-tvts/tools/./../../android-tvts/testcases/CtsTVConcurrentPlaybackTestCases.apk in search directory /home/dev2-google04/android-tvts/android-tvts-2.17r1-arm-15298624/android-tvts/tools/./../../android-tvts/testcases.
05-06 10:41:04 D/RunUtil: Running command [aapt2, dump, badging, /home/dev2-google04/android-tvts/android-tvts-2.17r1-arm-15298624/android-tvts/tools/./../../android-tvts/testcases/CtsTVConcurrentPlaybackTestCases.apk] with timeout: 1m 0s
05-06 10:41:04 D/RunUtil: Running command [aapt2, dump, xmltree, /home/dev2-google04/android-tvts/android-tvts-2.17r1-arm-15298624/android-tvts/tools/./../../android-tvts/testcases/CtsTVConcurrentPlaybackTestCases.apk, --file, AndroidManifest.xml] with timeout: 1m 0s
05-06 10:41:04 D/TestAppInstallSetup: Installing apk android.tvconcurrent.tvts with [/home/dev2-google04/android-tvts/android-tvts-2.17r1-arm-15298624/android-tvts/tools/./../../android-tvts/testcases/CtsTVConcurrentPlaybackTestCases.apk] ...
05-06 10:41:04 D/NativeDevice: Using property ro.build.version.sdk=29 from cache.
05-06 10:41:04 D/RunUtil: Running command [adb, -s, SKBFXYWR0LWD, install, -r, -g, --abi, armeabi-v7a, -g, /home/dev2-google04/android-tvts/android-tvts-2.17r1-arm-15298624/android-tvts/tools/./../../android-tvts/testcases/CtsTVConcurrentPlaybackTestCases.apk] with timeout: 4m 0s
05-06 10:41:07 D/RunUtil: Running command [aapt, dump, badging, /home/dev2-google04/android-tvts/android-tvts-2.17r1-arm-15298624/android-tvts/tools/./../../android-tvts/testcases/CtsTVConcurrentPlaybackTestCases.apk] with timeout: 1m 0s
05-06 10:41:07 D/RunUtil: Running command [aapt, dump, xmltree, /home/dev2-google04/android-tvts/android-tvts-2.17r1-arm-15298624/android-tvts/tools/./../../android-tvts/testcases/CtsTVConcurrentPlaybackTestCases.apk, AndroidManifest.xml] with timeout: 1m 0s
05-06 10:41:07 D/NativeDevice: Using property ro.build.version.sdk=29 from cache.
05-06 10:41:08 D/RunUtil: Running command [adb, -s, SKBFXYWR0LWD, shell, appops, set, --user, 0, --uid, android.tvconcurrent.tvts, MANAGE_EXTERNAL_STORAGE, 0] with timeout: 2m 0s
05-06 10:41:08 W/NativeDevice: Adb Shell Command : adb -s SKBFXYWR0LWD shell appops set --user 0 --uid android.tvconcurrent.tvts MANAGE_EXTERNAL_STORAGE 0
05-06 10:41:08 W/NativeDevice: Adb Shell Command exited with status: FAILED
05-06 10:41:08 W/NativeDevice: Adb Shell Command shell stdout:


05-06 10:41:08 W/NativeDevice: Adb Shell Command shell stderr:
Error: Unknown operation string: MANAGE_EXTERNAL_STORAGE


05-06 10:41:08 E/TestDevice: Failed to set MANAGE_EXTERNAL_STORAGE App Op to allow legacy external storage for: android.tvconcurrent.tvts ; stderr: Error: Unknown operation string: MANAGE_EXTERNAL_STORAGE

05-06 10:41:08 D/RunUtil: Running command [adb, -s, SKBFXYWR0LWD, shell, appops, write-settings] with timeout: 2m 0s
05-06 10:41:08 D/PrettyTestEventLogger: 
==================== com.google.android.tv.concurrent.TvConcurrentPlaybackHostTest RUN STARTED: Wed May 06 10:41:08 KST 2026 ====================
05-06 10:41:08 D/ModuleListener: ModuleListener.testRunStarted(com.google.android.tv.concurrent.TvConcurrentPlaybackHostTest, 730, 0) on SKBFXYWR0LWD
05-06 10:41:08 D/RunUtil: Running command [adb, -s, SKBFXYWR0LWD, shell, pm, list, features] with timeout: 2m 0s
05-06 10:41:08 W/TestDevice: Feature: feature:com.google.android.tv.hardware.picture_in_picture is not available on SKBFXYWR0LWD
05-06 10:41:08 D/PrettyTestEventLogger: 
==================== com.google.android.tv.concurrent.TvConcurrentPlaybackHostTest#testConcurrentQuadTunnelPlaybackPip STARTED: Wed May 06 10:41:08 KST 2026 ====================
05-06 10:41:08 D/ModuleListener: ModuleListener.testStarted(com.google.android.tv.concurrent.TvConcurrentPlaybackHostTest#testConcurrentQuadTunnelPlaybackPip) on SKBFXYWR0LWD
05-06 10:41:08 D/PrettyTestEventLogger: 
==================== com.google.android.tv.concurrent.TvConcurrentPlaybackHostTest#testConcurrentQuadTunnelPlaybackPip ENDED: Wed May 06 10:41:08 KST 2026 ====================
05-06 10:41:08 I/ModuleListener: [1/730] SKBFXYWR0LWD com.google.android.tv.concurrent.TvConcurrentPlaybackHostTest#testConcurrentQuadTunnelPlaybackPip ASSUMPTION_FAILURE: org.junit.AssumptionViolatedException: Missing feature: com.google.android.tv.hardware.picture_in_picture
	at com.google.android.tv.concurrent.TvConcurrentRunner.runChild(TvConcurrentRunner.java:64)
	at com.google.android.tv.concurrent.TvConcurrentRunner.runChild(TvConcurrentRunner.java:46)
	at org.junit.runners.ParentRunner$4.run(ParentRunner.java:331)
	at org.junit.runners.ParentRunner$1.schedule(ParentRunner.java:79)
	at org.junit.runners.ParentRunner.runChildren(ParentRunner.java:329)
	at org.junit.runners.ParentRunner$2.evaluate(ParentRunner.java:293)
	at org.junit.runners.ParentRunner$3.evaluate(ParentRunner.java:306)
	at org.junit.runners.ParentRunner.run(ParentRunner.java:413)
	at com.android.tradefed.testtype.junit4.ExceptionThrowingRunnerWrapper.run(ExceptionThrowingRunnerWrapper.java:43)
	at org.junit.runner.JUnitCore.run(JUnitCore.java:137)
	at com.android.tradefed.testtype.HostTest.runJUnit4Tests(HostTest.java:780)
	at com.android.tradefed.testtype.HostTest.runTestClasses(HostTest.java:660)
	at com.android.tradefed.testtype.HostTest.run(HostTest.java:608)
	at com.android.tradefed.testtype.suite.GranularRetriableTestWrapper.intraModuleRun(GranularRetriableTestWrapper.java:464)
	at com.android.tradefed.testtype.suite.GranularRetriableTestWrapper.run(GranularRetriableTestWrapper.java:353)
	at com.android.tradefed.testtype.suite.ModuleDefinition.run(ModuleDefinition.java:701)
	at com.android.tradefed.testtype.suite.ITestSuite.runSingleModule(ITestSuite.java:1522)
	at com.android.tradefed.testtype.suite.ITestSuite.run(ITestSuite.java:1130)
	at com.android.tradefed.invoker.InvocationExecution.runTest(InvocationExecution.java:1561)
	at com.android.tradefed.invoker.InvocationExecution.runTests(InvocationExecution.java:1324)
	at com.android.tradefed.invoker.TestInvocation.prepareAndRun(TestInvocation.java:696)
	at com.android.tradefed.invoker.TestInvocation.performInvocation(TestInvocation.java:310)
	at com.android.tradefed.invoker.TestInvocation.invoke(TestInvocation.java:1558)
	at com.android.tradefed.command.CommandScheduler$InvocationThread.run(CommandScheduler.java:723)

05-06 10:41:08 D/RunUtil: Running command [adb, -s, SKBFXYWR0LWD, shell, pm, list, features] with timeout: 2m 0s
05-06 10:41:08 W/TestDevice: Feature: feature:com.google.android.tv.hardware.picture_in_picture is not available on SKBFXYWR0LWD
05-06 10:41:08 D/PrettyTestEventLogger: 
==================== com.google.android.tv.concurrent.TvConcurrentPlaybackHostTest#testConcurrentSecondaryTunnelPlaybackPip STARTED: Wed May 06 10:41:08 KST 2026 ====================
05-06 10:41:08 D/ModuleListener: ModuleListener.testStarted(com.google.android.tv.concurrent.TvConcurrentPlaybackHostTest#testConcurrentSecondaryTunnelPlaybackPip) on SKBFXYWR0LWD
05-06 10:41:08 D/PrettyTestEventLogger: 
==================== com.google.android.tv.concurrent.TvConcurrentPlaybackHostTest#testConcurrentSecondaryTunnelPlaybackPip ENDED: Wed May 06 10:41:08 KST 2026 ====================
05-06 10:41:08 I/ModuleListener: [2/730] SKBFXYWR0LWD com.google.android.tv.concurrent.TvConcurrentPlaybackHostTest#testConcurrentSecondaryTunnelPlaybackPip ASSUMPTION_FAILURE: org.junit.AssumptionViolatedException: Missing feature: com.google.android.tv.hardware.picture_in_picture
	at com.google.android.tv.concurrent.TvConcurrentRunner.runChild(TvConcurrentRunner.java:64)
	at com.google.android.tv.concurrent.TvConcurrentRunner.runChild(TvConcurrentRunner.java:46)
	at org.junit.runners.ParentRunner$4.run(ParentRunner.java:331)
	at org.junit.runners.ParentRunner$1.schedule(ParentRunner.java:79)
	at org.junit.runners.ParentRunner.runChildren(ParentRunner.java:329)
	at org.junit.runners.ParentRunner$2.evaluate(ParentRunner.java:293)
	at org.junit.runners.ParentRunner$3.evaluate(ParentRunner.java:306)
	at org.junit.runners.ParentRunner.run(ParentRunner.java:413)
	at com.android.tradefed.testtype.junit4.ExceptionThrowingRunnerWrapper.run(ExceptionThrowingRunnerWrapper.java:43)
	at org.junit.runner.JUnitCore.run(JUnitCore.java:137)
	at com.android.tradefed.testtype.HostTest.runJUnit4Tests(HostTest.java:780)
	at com.android.tradefed.testtype.HostTest.runTestClasses(HostTest.java:660)
	at com.android.tradefed.testtype.HostTest.run(HostTest.java:608)
	at com.android.tradefed.testtype.suite.GranularRetriableTestWrapper.intraModuleRun(GranularRetriableTestWrapper.java:464)
	at com.android.tradefed.testtype.suite.GranularRetriableTestWrapper.run(GranularRetriableTestWrapper.java:353)
	at com.android.tradefed.testtype.suite.ModuleDefinition.run(ModuleDefinition.java:701)
	at com.android.tradefed.testtype.suite.ITestSuite.runSingleModule(ITestSuite.java:1522)
	at com.android.tradefed.testtype.suite.ITestSuite.run(ITestSuite.java:1130)
	at com.android.tradefed.invoker.InvocationExecution.runTest(InvocationExecution.java:1561)
	at com.android.tradefed.invoker.InvocationExecution.runTests(InvocationExecution.java:1324)
	at com.android.tradefed.invoker.TestInvocation.prepareAndRun(TestInvocation.java:696)
	at com.android.tradefed.invoker.TestInvocation.performInvocation(TestInvocation.java:310)
	at com.android.tradefed.invoker.TestInvocation.invoke(TestInvocation.java:1558)
	at com.android.tradefed.command.CommandScheduler$InvocationThread.run(CommandScheduler.java:723)

05-06 10:41:08 D/RunUtil: Running command [adb, -s, SKBFXYWR0LWD, shell, pm, list, features] with timeout: 2m 0s
05-06 10:41:08 W/TestDevice: Feature: feature:com.google.android.tv.hardware.quad_playback_4k60 is not available on SKBFXYWR0LWD
05-06 10:41:08 D/RunUtil: Running command [adb, -s, SKBFXYWR0LWD, shell, pm, list, features] with timeout: 2m 0s
05-06 10:41:08 W/TestDevice: Feature: feature:com.google.android.tv.hardware.quad_playback_4k30 is not available on SKBFXYWR0LWD
05-06 10:41:08 D/RunUtil: Running command [adb, -s, SKBFXYWR0LWD, shell, pm, list, features] with timeout: 2m 0s
05-06 10:41:08 W/TestDevice: Feature: feature:com.google.android.tv.hardware.quad_playback_1080p60 is not available on SKBFXYWR0LWD
05-06 10:41:08 D/RunUtil: Running command [adb, -s, SKBFXYWR0LWD, shell, pm, list, features] with timeout: 2m 0s
05-06 10:41:08 W/TestDevice: Feature: feature:com.google.android.tv.hardware.quad_playback_1080p30 is not available on SKBFXYWR0LWD
05-06 10:41:08 D/RunUtil: Running command [adb, -s, SKBFXYWR0LWD, shell, pm, list, features] with timeout: 2m 0s
05-06 10:41:08 W/TestDevice: Feature: feature:com.google.android.tv.hardware.quad_playback_720p60 is not available on SKBFXYWR0LWD
05-06 10:41:08 D/RunUtil: Running command [adb, -s, SKBFXYWR0LWD, shell, pm, list, features] with timeout: 2m 0s
05-06 10:41:08 W/TestDevice: Feature: feature:com.google.android.tv.hardware.quad_playback_720p30 is not available on SKBFXYWR0LWD
05-06 10:41:08 D/RunUtil: Running command [adb, -s, SKBFXYWR0LWD, shell, pm, list, features] with timeout: 2m 0s
05-06 10:41:09 W/TestDevice: Feature: feature:com.google.android.tv.hardware.quad_playback_540p60 is not available on SKBFXYWR0LWD
05-06 10:41:09 D/RunUtil: Running command [adb, -s, SKBFXYWR0LWD, shell, pm, list, features] with timeout: 2m 0s
05-06 10:41:09 W/TestDevice: Feature: feature:com.google.android.tv.hardware.quad_playback_540p30 is not available on SKBFXYWR0LWD
05-06 10:41:09 D/RunUtil: Running command [adb, -s, SKBFXYWR0LWD, shell, pm, list, features] with timeout: 2m 0s
05-06 10:41:09 W/TestDevice: Feature: feature:com.google.android.tv.hardware.quad_playback_480p60 is not available on SKBFXYWR0LWD
05-06 10:41:09 D/RunUtil: Running command [adb, -s, SKBFXYWR0LWD, shell, pm, list, features] with timeout: 2m 0s
05-06 10:41:09 W/TestDevice: Feature: feature:com.google.android.tv.hardware.quad_playback_480p30 is not available on SKBFXYWR0LWD
05-06 10:41:09 D/com.google.android.tv.concurrent.TvConcurrentPlaybackHostTest: com.google.android.tv.hardware.quad_playback_ not declared on device
05-06 10:41:09 D/PrettyTestEventLogger: 
==================== com.google.android.tv.concurrent.TvConcurrentPlaybackHostTest#testConcurrentQuadPlayback STARTED: Wed May 06 10:41:09 KST 2026 ====================
05-06 10:41:09 D/ModuleListener: ModuleListener.testStarted(com.google.android.tv.concurrent.TvConcurrentPlaybackHostTest#testConcurrentQuadPlayback) on SKBFXYWR0LWD
05-06 10:41:09 D/PrettyTestEventLogger: 
==================== com.google.android.tv.concurrent.TvConcurrentPlaybackHostTest#testConcurrentQuadPlayback ENDED: Wed May 06 10:41:09 KST 2026 ====================
05-06 10:41:09 I/ModuleListener: [3/730] SKBFXYWR0LWD com.google.android.tv.concurrent.TvConcurrentPlaybackHostTest#testConcurrentQuadPlayback ASSUMPTION_FAILURE: org.junit.AssumptionViolatedException: Missing capability for: com.google.android.tv.hardware.quad_playback_
	at com.google.android.tv.concurrent.TvConcurrentRunner.runChild(TvConcurrentRunner.java:64)
	at com.google.android.tv.concurrent.TvConcurrentRunner.runChild(TvConcurrentRunner.java:46)
	at org.junit.runners.ParentRunner$4.run(ParentRunner.java:331)
	at org.junit.runners.ParentRunner$1.schedule(ParentRunner.java:79)
	at org.junit.runners.ParentRunner.runChildren(ParentRunner.java:329)
	at org.junit.runners.ParentRunner$2.evaluate(ParentRunner.java:293)
	at org.junit.runners.ParentRunner$3.evaluate(ParentRunner.java:306)
	at org.junit.runners.ParentRunner.run(ParentRunner.java:413)
	at com.android.tradefed.testtype.junit4.ExceptionThrowingRunnerWrapper.run(ExceptionThrowingRunnerWrapper.java:43)
	at org.junit.runner.JUnitCore.run(JUnitCore.java:137)
	at com.android.tradefed.testtype.HostTest.runJUnit4Tests(HostTest.java:780)
	at com.android.tradefed.testtype.HostTest.runTestClasses(HostTest.java:660)
	at com.android.tradefed.testtype.HostTest.run(HostTest.java:608)
	at com.android.tradefed.testtype.suite.GranularRetriableTestWrapper.intraModuleRun(GranularRetriableTestWrapper.java:464)
	at com.android.tradefed.testtype.suite.GranularRetriableTestWrapper.run(GranularRetriableTestWrapper.java:353)
	at com.android.tradefed.testtype.suite.ModuleDefinition.run(ModuleDefinition.java:701)
	at com.android.tradefed.testtype.suite.ITestSuite.runSingleModule(ITestSuite.java:1522)
	at com.android.tradefed.testtype.suite.ITestSuite.run(ITestSuite.java:1130)
	at com.android.tradefed.invoker.InvocationExecution.runTest(InvocationExecution.java:1561)
	at com.android.tradefed.invoker.InvocationExecution.runTests(InvocationExecution.java:1324)
	at com.android.tradefed.invoker.TestInvocation.prepareAndRun(TestInvocation.java:696)
	at com.android.tradefed.invoker.TestInvocation.performInvocation(TestInvocation.java:310)
	at com.android.tradefed.invoker.TestInvocation.invoke(TestInvocation.java:1558)
	at com.android.tradefed.command.CommandScheduler$InvocationThread.run(CommandScheduler.java:723)

05-06 10:41:09 D/RunUtil: Running command [adb, -s, SKBFXYWR0LWD, shell, pm, list, features] with timeout: 2m 0s
05-06 10:41:09 W/TestDevice: Feature: feature:com.google.android.tv.hardware.secondary_playback_4k60 is not available on SKBFXYWR0LWD
05-06 10:41:09 D/RunUtil: Running command [adb, -s, SKBFXYWR0LWD, shell, pm, list, features] with timeout: 2m 0s
05-06 10:41:09 W/TestDevice: Feature: feature:com.google.android.tv.hardware.secondary_playback_4k30 is not available on SKBFXYWR0LWD
05-06 10:41:09 D/RunUtil: Running command [adb, -s, SKBFXYWR0LWD, shell, pm, list, features] with timeout: 2m 0s
05-06 10:41:09 W/TestDevice: Feature: feature:com.google.android.tv.hardware.secondary_playback_1080p60 is not available on SKBFXYWR0LWD
05-06 10:41:09 D/RunUtil: Running command [adb, -s, SKBFXYWR0LWD, shell, pm, list, features] with timeout: 2m 0s
05-06 10:41:09 W/TestDevice: Feature: feature:com.google.android.tv.hardware.secondary_playback_1080p30 is not available on SKBFXYWR0LWD
05-06 10:41:09 D/RunUtil: Running command [adb, -s, SKBFXYWR0LWD, shell, pm, list, features] with timeout: 2m 0s
05-06 10:41:09 W/TestDevice: Feature: feature:com.google.android.tv.hardware.secondary_playback_720p60 is not available on SKBFXYWR0LWD
05-06 10:41:09 D/RunUtil: Running command [adb, -s, SKBFXYWR0LWD, shell, pm, list, features] with timeout: 2m 0s
05-06 10:41:09 W/TestDevice: Feature: feature:com.google.android.tv.hardware.secondary_playback_720p30 is not available on SKBFXYWR0LWD
05-06 10:41:09 D/RunUtil: Running command [adb, -s, SKBFXYWR0LWD, shell, pm, list, features] with timeout: 2m 0s
05-06 10:41:09 W/TestDevice: Feature: feature:com.google.android.tv.hardware.secondary_playback_540p60 is not available on SKBFXYWR0LWD
05-06 10:41:09 D/RunUtil: Running command [adb, -s, SKBFXYWR0LWD, shell, pm, list, features] with timeout: 2m 0s
05-06 10:41:09 W/TestDevice: Feature: feature:com.google.android.tv.hardware.secondary_playback_540p30 is not available on SKBFXYWR0LWD
05-06 10:41:09 D/RunUtil: Running command [adb, -s, SKBFXYWR0LWD, shell, pm, list, features] with timeout: 2m 0s
05-06 10:41:09 W/TestDevice: Feature: feature:com.google.android.tv.hardware.secondary_playback_480p60 is not available on SKBFXYWR0LWD
05-06 10:41:09 D/RunUtil: Running command [adb, -s, SKBFXYWR0LWD, shell, pm, list, features] with timeout: 2m 0s
05-06 10:41:09 W/TestDevice: Feature: feature:com.google.android.tv.hardware.secondary_playback_480p30 is not available on SKBFXYWR0LWD
05-06 10:41:09 D/com.google.android.tv.concurrent.TvConcurrentPlaybackHostTest: com.google.android.tv.hardware.secondary_playback_ not declared on device
05-06 10:41:09 D/PrettyTestEventLogger: 
==================== com.google.android.tv.concurrent.TvConcurrentPlaybackHostTest#testConcurrentSecondaryPlayback STARTED: Wed May 06 10:41:09 KST 2026 ====================
05-06 10:41:09 D/ModuleListener: ModuleListener.testStarted(com.google.android.tv.concurrent.TvConcurrentPlaybackHostTest#testConcurrentSecondaryPlayback) on SKBFXYWR0LWD
05-06 10:41:09 D/PrettyTestEventLogger: 
==================== com.google.android.tv.concurrent.TvConcurrentPlaybackHostTest#testConcurrentSecondaryPlayback ENDED: Wed May 06 10:41:09 KST 2026 ====================
05-06 10:41:09 I/ModuleListener: [4/730] SKBFXYWR0LWD com.google.android.tv.concurrent.TvConcurrentPlaybackHostTest#testConcurrentSecondaryPlayback ASSUMPTION_FAILURE: org.junit.AssumptionViolatedException: Missing capability for: com.google.android.tv.hardware.secondary_playback_
	at com.google.android.tv.concurrent.TvConcurrentRunner.runChild(TvConcurrentRunner.java:64)
	at com.google.android.tv.concurrent.TvConcurrentRunner.runChild(TvConcurrentRunner.java:46)
	at org.junit.runners.ParentRunner$4.run(ParentRunner.java:331)
	at org.junit.runners.ParentRunner$1.schedule(ParentRunner.java:79)
	at org.junit.runners.ParentRunner.runChildren(ParentRunner.java:329)
	at org.junit.runners.ParentRunner$2.evaluate(ParentRunner.java:293)
	at org.junit.runners.ParentRunner$3.evaluate(ParentRunner.java:306)
	at org.junit.runners.ParentRunner.run(ParentRunner.java:413)
	at com.android.tradefed.testtype.junit4.ExceptionThrowingRunnerWrapper.run(ExceptionThrowingRunnerWrapper.java:43)
	at org.junit.runner.JUnitCore.run(JUnitCore.java:137)
	at com.android.tradefed.testtype.HostTest.runJUnit4Tests(HostTest.java:780)
	at com.android.tradefed.testtype.HostTest.runTestClasses(HostTest.java:660)
	at com.android.tradefed.testtype.HostTest.run(HostTest.java:608)
	at com.android.tradefed.testtype.suite.GranularRetriableTestWrapper.intraModuleRun(GranularRetriableTestWrapper.java:464)
	at com.android.tradefed.testtype.suite.GranularRetriableTestWrapper.run(GranularRetriableTestWrapper.java:353)
	at com.android.tradefed.testtype.suite.ModuleDefinition.run(ModuleDefinition.java:701)
	at com.android.tradefed.testtype.suite.ITestSuite.runSingleModule(ITestSuite.java:1522)
	at com.android.tradefed.testtype.suite.ITestSuite.run(ITestSuite.java:1130)
	at com.android.tradefed.invoker.InvocationExecution.runTest(InvocationExecution.java:1561)
	at com.android.tradefed.invoker.InvocationExecution.runTests(InvocationExecution.java:1324)
	at com.android.tradefed.invoker.TestInvocation.prepareAndRun(TestInvocation.java:696)
	at com.android.tradefed.invoker.TestInvocation.performInvocation(TestInvocation.java:310)
	at com.android.tradefed.invoker.TestInvocation.invoke(TestInvocation.java:1558)
	at com.android.tradefed.command.CommandScheduler$InvocationThread.run(CommandScheduler.java:723)

05-06 10:41:09 D/RunUtil: Running command [adb, -s, SKBFXYWR0LWD, shell, pm, list, features] with timeout: 2m 0s
05-06 10:41:09 W/TestDevice: Feature: feature:com.google.android.tv.hardware.tunnel_secondary_playback_4k60 is not available on SKBFXYWR0LWD
05-06 10:41:09 D/RunUtil: Running command [adb, -s, SKBFXYWR0LWD, shell, pm, list, features] with timeout: 2m 0s
05-06 10:41:09 W/TestDevice: Feature: feature:com.google.android.tv.hardware.tunnel_secondary_playback_4k30 is not available on SKBFXYWR0LWD
05-06 10:41:09 D/RunUtil: Running command [adb, -s, SKBFXYWR0LWD, shell, pm, list, features] with timeout: 2m 0s
05-06 10:41:10 W/TestDevice: Feature: feature:com.google.android.tv.hardware.tunnel_secondary_playback_1080p60 is not available on SKBFXYWR0LWD
05-06 10:41:10 D/RunUtil: Running command [adb, -s, SKBFXYWR0LWD, shell, pm, list, features] with timeout: 2m 0s
05-06 10:41:10 W/TestDevice: Feature: feature:com.google.android.tv.hardware.tunnel_secondary_playback_1080p30 is not available on SKBFXYWR0LWD
05-06 10:41:10 D/RunUtil: Running command [adb, -s, SKBFXYWR0LWD, shell, pm, list, features] with timeout: 2m 0s
05-06 10:41:10 W/TestDevice: Feature: feature:com.google.android.tv.hardware.tunnel_secondary_playback_720p60 is not available on SKBFXYWR0LWD
05-06 10:41:10 D/RunUtil: Running command [adb, -s, SKBFXYWR0LWD, shell, pm, list, features] with timeout: 2m 0s
05-06 10:41:10 W/TestDevice: Feature: feature:com.google.android.tv.hardware.tunnel_secondary_playback_720p30 is not available on SKBFXYWR0LWD
05-06 10:41:10 D/RunUtil: Running command [adb, -s, SKBFXYWR0LWD, shell, pm, list, features] with timeout: 2m 0s
05-06 10:41:10 W/TestDevice: Feature: feature:com.google.android.tv.hardware.tunnel_secondary_playback_540p60 is not available on SKBFXYWR0LWD
05-06 10:41:10 D/RunUtil: Running command [adb, -s, SKBFXYWR0LWD, shell, pm, list, features] with timeout: 2m 0s
05-06 10:41:10 W/TestDevice: Feature: feature:com.google.android.tv.hardware.tunnel_secondary_playback_540p30 is not available on SKBFXYWR0LWD
05-06 10:41:10 D/RunUtil: Running command [adb, -s, SKBFXYWR0LWD, shell, pm, list, features] with timeout: 2m 0s
05-06 10:41:10 W/TestDevice: Feature: feature:com.google.android.tv.hardware.tunnel_secondary_playback_480p60 is not available on SKBFXYWR0LWD
05-06 10:41:10 D/RunUtil: Running command [adb, -s, SKBFXYWR0LWD, shell, pm, list, features] with timeout: 2m 0s
05-06 10:41:10 W/TestDevice: Feature: feature:com.google.android.tv.hardware.tunnel_secondary_playback_480p30 is not available on SKBFXYWR0LWD
05-06 10:41:10 D/com.google.android.tv.concurrent.TvConcurrentPlaybackHostTest: com.google.android.tv.hardware.tunnel_secondary_playback_ not declared on device
05-06 10:41:10 D/PrettyTestEventLogger: 
==================== com.google.android.tv.concurrent.TvConcurrentPlaybackHostTest#testConcurrentBasicSecondaryTunnelPlayback STARTED: Wed May 06 10:41:10 KST 2026 ====================
05-06 10:41:10 D/ModuleListener: ModuleListener.testStarted(com.google.android.tv.concurrent.TvConcurrentPlaybackHostTest#testConcurrentBasicSecondaryTunnelPlayback) on SKBFXYWR0LWD
05-06 10:41:10 D/PrettyTestEventLogger: 
==================== com.google.android.tv.concurrent.TvConcurrentPlaybackHostTest#testConcurrentBasicSecondaryTunnelPlayback ENDED: Wed May 06 10:41:10 KST 2026 ====================
05-06 10:41:10 I/ModuleListener: [5/730] SKBFXYWR0LWD com.google.android.tv.concurrent.TvConcurrentPlaybackHostTest#testConcurrentBasicSecondaryTunnelPlayback ASSUMPTION_FAILURE: org.junit.AssumptionViolatedException: Missing capability for: com.google.android.tv.hardware.tunnel_secondary_playback_
	at com.google.android.tv.concurrent.TvConcurrentRunner.runChild(TvConcurrentRunner.java:64)
	at com.google.android.tv.concurrent.TvConcurrentRunner.runChild(TvConcurrentRunner.java:46)
	at org.junit.runners.ParentRunner$4.run(ParentRunner.java:331)
	at org.junit.runners.ParentRunner$1.schedule(ParentRunner.java:79)
	at org.junit.runners.ParentRunner.runChildren(ParentRunner.java:329)
	at org.junit.runners.ParentRunner$2.evaluate(ParentRunner.java:293)
	at org.junit.runners.ParentRunner$3.evaluate(ParentRunner.java:306)
	at org.junit.runners.ParentRunner.run(ParentRunner.java:413)
	at com.android.tradefed.testtype.junit4.ExceptionThrowingRunnerWrapper.run(ExceptionThrowingRunnerWrapper.java:43)
	at org.junit.runner.JUnitCore.run(JUnitCore.java:137)
	at com.android.tradefed.testtype.HostTest.runJUnit4Tests(HostTest.java:780)
	at com.android.tradefed.testtype.HostTest.runTestClasses(HostTest.java:660)
	at com.android.tradefed.testtype.HostTest.run(HostTest.java:608)
	at com.android.tradefed.testtype.suite.GranularRetriableTestWrapper.intraModuleRun(GranularRetriableTestWrapper.java:464)
	at com.android.tradefed.testtype.suite.GranularRetriableTestWrapper.run(GranularRetriableTestWrapper.java:353)
	at com.android.tradefed.testtype.suite.ModuleDefinition.run(ModuleDefinition.java:701)
	at com.android.tradefed.testtype.suite.ITestSuite.runSingleModule(ITestSuite.java:1522)
	at com.android.tradefed.testtype.suite.ITestSuite.run(ITestSuite.java:1130)
	at com.android.tradefed.invoker.InvocationExecution.runTest(InvocationExecution.java:1561)
	at com.android.tradefed.invoker.InvocationExecution.runTests(InvocationExecution.java:1324)
	at com.android.tradefed.invoker.TestInvocation.prepareAndRun(TestInvocation.java:696)
	at com.android.tradefed.invoker.TestInvocation.performInvocation(TestInvocation.java:310)
	at com.android.tradefed.invoker.TestInvocation.invoke(TestInvocation.java:1558)
	at com.android.tradefed.command.CommandScheduler$InvocationThread.run(CommandScheduler.java:723)

05-06 10:41:10 D/RunUtil: Running command [adb, -s, SKBFXYWR0LWD, shell, pm, list, features] with timeout: 2m 0s
05-06 10:41:10 W/TestDevice: Feature: feature:com.google.android.tv.hardware.picture_in_picture is not available on SKBFXYWR0LWD
05-06 10:41:10 D/PrettyTestEventLogger: 
==================== com.google.android.tv.concurrent.TvConcurrentPlaybackHostTest#testConcurrentQuadPlaybackPip STARTED: Wed May 06 10:41:10 KST 2026 ====================
05-06 10:41:10 D/ModuleListener: ModuleListener.testStarted(com.google.android.tv.concurrent.TvConcurrentPlaybackHostTest#testConcurrentQuadPlaybackPip) on SKBFXYWR0LWD
05-06 10:41:10 D/PrettyTestEventLogger: 
==================== com.google.android.tv.concurrent.TvConcurrentPlaybackHostTest#testConcurrentQuadPlaybackPip ENDED: Wed May 06 10:41:10 KST 2026 ====================
05-06 10:41:10 I/ModuleListener: [6/730] SKBFXYWR0LWD com.google.android.tv.concurrent.TvConcurrentPlaybackHostTest#testConcurrentQuadPlaybackPip ASSUMPTION_FAILURE: org.junit.AssumptionViolatedException: Missing feature: com.google.android.tv.hardware.picture_in_picture
	at com.google.android.tv.concurrent.TvConcurrentRunner.runChild(TvConcurrentRunner.java:64)
	at com.google.android.tv.concurrent.TvConcurrentRunner.runChild(TvConcurrentRunner.java:46)
	at org.junit.runners.ParentRunner$4.run(ParentRunner.java:331)
	at org.junit.runners.ParentRunner$1.schedule(ParentRunner.java:79)
	at org.junit.runners.ParentRunner.runChildren(ParentRunner.java:329)
	at org.junit.runners.ParentRunner$2.evaluate(ParentRunner.java:293)
	at org.junit.runners.ParentRunner$3.evaluate(ParentRunner.java:306)
	at org.junit.runners.ParentRunner.run(ParentRunner.java:413)
	at com.android.tradefed.testtype.junit4.ExceptionThrowingRunnerWrapper.run(ExceptionThrowingRunnerWrapper.java:43)
	at org.junit.runner.JUnitCore.run(JUnitCore.java:137)
	at com.android.tradefed.testtype.HostTest.runJUnit4Tests(HostTest.java:780)
	at com.android.tradefed.testtype.HostTest.runTestClasses(HostTest.java:660)
	at com.android.tradefed.testtype.HostTest.run(HostTest.java:608)
	at com.android.tradefed.testtype.suite.GranularRetriableTestWrapper.intraModuleRun(GranularRetriableTestWrapper.java:464)
	at com.android.tradefed.testtype.suite.GranularRetriableTestWrapper.run(GranularRetriableTestWrapper.java:353)
	at com.android.tradefed.testtype.suite.ModuleDefinition.run(ModuleDefinition.java:701)
	at com.android.tradefed.testtype.suite.ITestSuite.runSingleModule(ITestSuite.java:1522)
	at com.android.tradefed.testtype.suite.ITestSuite.run(ITestSuite.java:1130)
	at com.android.tradefed.invoker.InvocationExecution.runTest(InvocationExecution.java:1561)
	at com.android.tradefed.invoker.InvocationExecution.runTests(InvocationExecution.java:1324)
	at com.android.tradefed.invoker.TestInvocation.prepareAndRun(TestInvocation.java:696)
	at com.android.tradefed.invoker.TestInvocation.performInvocation(TestInvocation.java:310)
	at com.android.tradefed.invoker.TestInvocation.invoke(TestInvocation.java:1558)
	at com.android.tradefed.command.CommandScheduler$InvocationThread.run(CommandScheduler.java:723)

05-06 10:41:10 D/RunUtil: Running command [adb, -s, SKBFXYWR0LWD, shell, pm, list, features] with timeout: 2m 0s
05-06 10:41:10 W/TestDevice: Feature: feature:com.google.android.tv.hardware.tunnel_dual_playback_4k60 is not available on SKBFXYWR0LWD
05-06 10:41:10 D/RunUtil: Running command [adb, -s, SKBFXYWR0LWD, shell, pm, list, features] with timeout: 2m 0s
05-06 10:41:10 W/TestDevice: Feature: feature:com.google.android.tv.hardware.tunnel_dual_playback_4k30 is not available on SKBFXYWR0LWD
05-06 10:41:10 D/RunUtil: Running command [adb, -s, SKBFXYWR0LWD, shell, pm, list, features] with timeout: 2m 0s
05-06 10:41:10 W/TestDevice: Feature: feature:com.google.android.tv.hardware.tunnel_dual_playback_1080p60 is not available on SKBFXYWR0LWD
05-06 10:41:10 D/RunUtil: Running command [adb, -s, SKBFXYWR0LWD, shell, pm, list, features] with timeout: 2m 0s
05-06 10:41:10 W/TestDevice: Feature: feature:com.google.android.tv.hardware.tunnel_dual_playback_1080p30 is not available on SKBFXYWR0LWD
05-06 10:41:10 D/RunUtil: Running command [adb, -s, SKBFXYWR0LWD, shell, pm, list, features] with timeout: 2m 0s
05-06 10:41:10 W/TestDevice: Feature: feature:com.google.android.tv.hardware.tunnel_dual_playback_720p60 is not available on SKBFXYWR0LWD
05-06 10:41:10 D/RunUtil: Running command [adb, -s, SKBFXYWR0LWD, shell, pm, list, features] with timeout: 2m 0s
05-06 10:41:10 W/TestDevice: Feature: feature:com.google.android.tv.hardware.tunnel_dual_playback_720p30 is not available on SKBFXYWR0LWD
05-06 10:41:10 D/RunUtil: Running command [adb, -s, SKBFXYWR0LWD, shell, pm, list, features] with timeout: 2m 0s
05-06 10:41:10 W/TestDevice: Feature: feature:com.google.android.tv.hardware.tunnel_dual_playback_540p60 is not available on SKBFXYWR0LWD
05-06 10:41:10 D/RunUtil: Running command [adb, -s, SKBFXYWR0LWD, shell, pm, list, features] with timeout: 2m 0s
05-06 10:41:11 W/TestDevice: Feature: feature:com.google.android.tv.hardware.tunnel_dual_playback_540p30 is not available on SKBFXYWR0LWD
05-06 10:41:11 D/RunUtil: Running command [adb, -s, SKBFXYWR0LWD, shell, pm, list, features] with timeout: 2m 0s
05-06 10:41:11 W/TestDevice: Feature: feature:com.google.android.tv.hardware.tunnel_dual_playback_480p60 is not available on SKBFXYWR0LWD
05-06 10:41:11 D/RunUtil: Running command [adb, -s, SKBFXYWR0LWD, shell, pm, list, features] with timeout: 2m 0s
05-06 10:41:11 W/TestDevice: Feature: feature:com.google.android.tv.hardware.tunnel_dual_playback_480p30 is not available on SKBFXYWR0LWD
05-06 10:41:11 D/com.google.android.tv.concurrent.TvConcurrentPlaybackHostTest: com.google.android.tv.hardware.tunnel_dual_playback_ not declared on device
05-06 10:41:11 D/PrettyTestEventLogger: 
==================== com.google.android.tv.concurrent.TvConcurrentPlaybackHostTest#testConcurrentDualTunnelPlayback STARTED: Wed May 06 10:41:11 KST 2026 ====================
05-06 10:41:11 D/ModuleListener: ModuleListener.testStarted(com.google.android.tv.concurrent.TvConcurrentPlaybackHostTest#testConcurrentDualTunnelPlayback) on SKBFXYWR0LWD
05-06 10:41:11 D/PrettyTestEventLogger: 
==================== com.google.android.tv.concurrent.TvConcurrentPlaybackHostTest#testConcurrentDualTunnelPlayback ENDED: Wed May 06 10:41:11 KST 2026 ====================
05-06 10:41:11 I/ModuleListener: [7/730] SKBFXYWR0LWD com.google.android.tv.concurrent.TvConcurrentPlaybackHostTest#testConcurrentDualTunnelPlayback ASSUMPTION_FAILURE: org.junit.AssumptionViolatedException: Missing capability for: com.google.android.tv.hardware.tunnel_dual_playback_
	at com.google.android.tv.concurrent.TvConcurrentRunner.runChild(TvConcurrentRunner.java:64)
	at com.google.android.tv.concurrent.TvConcurrentRunner.runChild(TvConcurrentRunner.java:46)
	at org.junit.runners.ParentRunner$4.run(ParentRunner.java:331)
	at org.junit.runners.ParentRunner$1.schedule(ParentRunner.java:79)
	at org.junit.runners.ParentRunner.runChildren(ParentRunner.java:329)
	at org.junit.runners.ParentRunner$2.evaluate(ParentRunner.java:293)
	at org.junit.runners.ParentRunner$3.evaluate(ParentRunner.java:306)
	at org.junit.runners.ParentRunner.run(ParentRunner.java:413)
	at com.android.tradefed.testtype.junit4.ExceptionThrowingRunnerWrapper.run(ExceptionThrowingRunnerWrapper.java:43)
	at org.junit.runner.JUnitCore.run(JUnitCore.java:137)
	at com.android.tradefed.testtype.HostTest.runJUnit4Tests(HostTest.java:780)
	at com.android.tradefed.testtype.HostTest.runTestClasses(HostTest.java:660)
	at com.android.tradefed.testtype.HostTest.run(HostTest.java:608)
	at com.android.tradefed.testtype.suite.GranularRetriableTestWrapper.intraModuleRun(GranularRetriableTestWrapper.java:464)
	at com.android.tradefed.testtype.suite.GranularRetriableTestWrapper.run(GranularRetriableTestWrapper.java:353)
	at com.android.tradefed.testtype.suite.ModuleDefinition.run(ModuleDefinition.java:701)
	at com.android.tradefed.testtype.suite.ITestSuite.runSingleModule(ITestSuite.java:1522)
	at com.android.tradefed.testtype.suite.ITestSuite.run(ITestSuite.java:1130)
	at com.android.tradefed.invoker.InvocationExecution.runTest(InvocationExecution.java:1561)
	at com.android.tradefed.invoker.InvocationExecution.runTests(InvocationExecution.java:1324)
	at com.android.tradefed.invoker.TestInvocation.prepareAndRun(TestInvocation.java:696)
	at com.android.tradefed.invoker.TestInvocation.performInvocation(TestInvocation.java:310)
	at com.android.tradefed.invoker.TestInvocation.invoke(TestInvocation.java:1558)
	at com.android.tradefed.command.CommandScheduler$InvocationThread.run(CommandScheduler.java:723)

05-06 10:41:11 D/RunUtil: Running command [adb, -s, SKBFXYWR0LWD, shell, pm, list, features] with timeout: 2m 0s
05-06 10:41:11 W/TestDevice: Feature: feature:com.google.android.tv.hardware.picture_in_picture is not available on SKBFXYWR0LWD
05-06 10:41:11 D/PrettyTestEventLogger: 
==================== com.google.android.tv.concurrent.TvConcurrentPlaybackHostTest#testConcurrentSecondaryPlaybackPip STARTED: Wed May 06 10:41:11 KST 2026 ====================
05-06 10:41:11 D/ModuleListener: ModuleListener.testStarted(com.google.android.tv.concurrent.TvConcurrentPlaybackHostTest#testConcurrentSecondaryPlaybackPip) on SKBFXYWR0LWD
05-06 10:41:11 D/PrettyTestEventLogger: 
==================== com.google.android.tv.concurrent.TvConcurrentPlaybackHostTest#testConcurrentSecondaryPlaybackPip ENDED: Wed May 06 10:41:11 KST 2026 ====================
05-06 10:41:11 I/ModuleListener: [8/730] SKBFXYWR0LWD com.google.android.tv.concurrent.TvConcurrentPlaybackHostTest#testConcurrentSecondaryPlaybackPip ASSUMPTION_FAILURE: org.junit.AssumptionViolatedException: Missing feature: com.google.android.tv.hardware.picture_in_picture
	at com.google.android.tv.concurrent.TvConcurrentRunner.runChild(TvConcurrentRunner.java:64)
	at com.google.android.tv.concurrent.TvConcurrentRunner.runChild(TvConcurrentRunner.java:46)
	at org.junit.runners.ParentRunner$4.run(ParentRunner.java:331)
	at org.junit.runners.ParentRunner$1.schedule(ParentRunner.java:79)
	at org.junit.runners.ParentRunner.runChildren(ParentRunner.java:329)
	at org.junit.runners.ParentRunner$2.evaluate(ParentRunner.java:293)
	at org.junit.runners.ParentRunner$3.evaluate(ParentRunner.java:306)
	at org.junit.runners.ParentRunner.run(ParentRunner.java:413)
	at com.android.tradefed.testtype.junit4.ExceptionThrowingRunnerWrapper.run(ExceptionThrowingRunnerWrapper.java:43)
	at org.junit.runner.JUnitCore.run(JUnitCore.java:137)
	at com.android.tradefed.testtype.HostTest.runJUnit4Tests(HostTest.java:780)
	at com.android.tradefed.testtype.HostTest.runTestClasses(HostTest.java:660)
	at com.android.tradefed.testtype.HostTest.run(HostTest.java:608)
	at com.android.tradefed.testtype.suite.GranularRetriableTestWrapper.intraModuleRun(GranularRetriableTestWrapper.java:464)
	at com.android.tradefed.testtype.suite.GranularRetriableTestWrapper.run(GranularRetriableTestWrapper.java:353)
	at com.android.tradefed.testtype.suite.ModuleDefinition.run(ModuleDefinition.java:701)
	at com.android.tradefed.testtype.suite.ITestSuite.runSingleModule(ITestSuite.java:1522)
	at com.android.tradefed.testtype.suite.ITestSuite.run(ITestSuite.java:1130)
	at com.android.tradefed.invoker.InvocationExecution.runTest(InvocationExecution.java:1561)
	at com.android.tradefed.invoker.InvocationExecution.runTests(InvocationExecution.java:1324)
	at com.android.tradefed.invoker.TestInvocation.prepareAndRun(TestInvocation.java:696)
	at com.android.tradefed.invoker.TestInvocation.performInvocation(TestInvocation.java:310)
	at com.android.tradefed.invoker.TestInvocation.invoke(TestInvocation.java:1558)
	at com.android.tradefed.command.CommandScheduler$InvocationThread.run(CommandScheduler.java:723)

05-06 10:41:11 D/RunUtil: Running command [adb, -s, SKBFXYWR0LWD, shell, pm, list, features] with timeout: 2m 0s
05-06 10:41:11 W/TestDevice: Feature: feature:com.google.android.tv.hardware.dual_playback_4k60 is not available on SKBFXYWR0LWD
05-06 10:41:11 D/RunUtil: Running command [adb, -s, SKBFXYWR0LWD, shell, pm, list, features] with timeout: 2m 0s
05-06 10:41:11 W/TestDevice: Feature: feature:com.google.android.tv.hardware.dual_playback_4k30 is not available on SKBFXYWR0LWD
05-06 10:41:11 D/RunUtil: Running command [adb, -s, SKBFXYWR0LWD, shell, pm, list, features] with timeout: 2m 0s
05-06 10:41:11 W/TestDevice: Feature: feature:com.google.android.tv.hardware.dual_playback_1080p60 is not available on SKBFXYWR0LWD
05-06 10:41:11 D/RunUtil: Running command [adb, -s, SKBFXYWR0LWD, shell, pm, list, features] with timeout: 2m 0s
05-06 10:41:11 W/TestDevice: Feature: feature:com.google.android.tv.hardware.dual_playback_1080p30 is not available on SKBFXYWR0LWD
05-06 10:41:11 D/RunUtil: Running command [adb, -s, SKBFXYWR0LWD, shell, pm, list, features] with timeout: 2m 0s
05-06 10:41:11 W/TestDevice: Feature: feature:com.google.android.tv.hardware.dual_playback_720p60 is not available on SKBFXYWR0LWD
05-06 10:41:11 D/RunUtil: Running command [adb, -s, SKBFXYWR0LWD, shell, pm, list, features] with timeout: 2m 0s
05-06 10:41:11 W/TestDevice: Feature: feature:com.google.android.tv.hardware.dual_playback_720p30 is not available on SKBFXYWR0LWD
05-06 10:41:11 D/RunUtil: Running command [adb, -s, SKBFXYWR0LWD, shell, pm, list, features] with timeout: 2m 0s
05-06 10:41:11 W/TestDevice: Feature: feature:com.google.android.tv.hardware.dual_playback_540p60 is not available on SKBFXYWR0LWD
05-06 10:41:11 D/RunUtil: Running command [adb, -s, SKBFXYWR0LWD, shell, pm, list, features] with timeout: 2m 0s
05-06 10:41:11 W/TestDevice: Feature: feature:com.google.android.tv.hardware.dual_playback_540p30 is not available on SKBFXYWR0LWD
05-06 10:41:11 D/RunUtil: Running command [adb, -s, SKBFXYWR0LWD, shell, pm, list, features] with timeout: 2m 0s
05-06 10:41:11 W/TestDevice: Feature: feature:com.google.android.tv.hardware.dual_playback_480p60 is not available on SKBFXYWR0LWD
05-06 10:41:11 D/RunUtil: Running command [adb, -s, SKBFXYWR0LWD, shell, pm, list, features] with timeout: 2m 0s
05-06 10:41:11 W/TestDevice: Feature: feature:com.google.android.tv.hardware.dual_playback_480p30 is not available on SKBFXYWR0LWD
05-06 10:41:11 D/com.google.android.tv.concurrent.TvConcurrentPlaybackHostTest: com.google.android.tv.hardware.dual_playback_ not declared on device
05-06 10:41:11 D/PrettyTestEventLogger: 
==================== com.google.android.tv.concurrent.TvConcurrentPlaybackHostTest#testConcurrentDualPlayback STARTED: Wed May 06 10:41:11 KST 2026 ====================
05-06 10:41:11 D/ModuleListener: ModuleListener.testStarted(com.google.android.tv.concurrent.TvConcurrentPlaybackHostTest#testConcurrentDualPlayback) on SKBFXYWR0LWD
05-06 10:41:11 D/PrettyTestEventLogger: 
==================== com.google.android.tv.concurrent.TvConcurrentPlaybackHostTest#testConcurrentDualPlayback ENDED: Wed May 06 10:41:11 KST 2026 ====================
05-06 10:41:11 I/ModuleListener: [9/730] SKBFXYWR0LWD com.google.android.tv.concurrent.TvConcurrentPlaybackHostTest#testConcurrentDualPlayback ASSUMPTION_FAILURE: org.junit.AssumptionViolatedException: Missing capability for: com.google.android.tv.hardware.dual_playback_
	at com.google.android.tv.concurrent.TvConcurrentRunner.runChild(TvConcurrentRunner.java:64)
	at com.google.android.tv.concurrent.TvConcurrentRunner.runChild(TvConcurrentRunner.java:46)
	at org.junit.runners.ParentRunner$4.run(ParentRunner.java:331)
	at org.junit.runners.ParentRunner$1.schedule(ParentRunner.java:79)
	at org.junit.runners.ParentRunner.runChildren(ParentRunner.java:329)
	at org.junit.runners.ParentRunner$2.evaluate(ParentRunner.java:293)
	at org.junit.runners.ParentRunner$3.evaluate(ParentRunner.java:306)
	at org.junit.runners.ParentRunner.run(ParentRunner.java:413)
	at com.android.tradefed.testtype.junit4.ExceptionThrowingRunnerWrapper.run(ExceptionThrowingRunnerWrapper.java:43)
	at org.junit.runner.JUnitCore.run(JUnitCore.java:137)
	at com.android.tradefed.testtype.HostTest.runJUnit4Tests(HostTest.java:780)
	at com.android.tradefed.testtype.HostTest.runTestClasses(HostTest.java:660)
	at com.android.tradefed.testtype.HostTest.run(HostTest.java:608)
	at com.android.tradefed.testtype.suite.GranularRetriableTestWrapper.intraModuleRun(GranularRetriableTestWrapper.java:464)
	at com.android.tradefed.testtype.suite.GranularRetriableTestWrapper.run(GranularRetriableTestWrapper.java:353)
	at com.android.tradefed.testtype.suite.ModuleDefinition.run(ModuleDefinition.java:701)
	at com.android.tradefed.testtype.suite.ITestSuite.runSingleModule(ITestSuite.java:1522)
	at com.android.tradefed.testtype.suite.ITestSuite.run(ITestSuite.java:1130)
	at com.android.tradefed.invoker.InvocationExecution.runTest(InvocationExecution.java:1561)
	at com.android.tradefed.invoker.InvocationExecution.runTests(InvocationExecution.java:1324)
	at com.android.tradefed.invoker.TestInvocation.prepareAndRun(TestInvocation.java:696)
	at com.android.tradefed.invoker.TestInvocation.performInvocation(TestInvocation.java:310)
	at com.android.tradefed.invoker.TestInvocation.invoke(TestInvocation.java:1558)
	at com.android.tradefed.command.CommandScheduler$InvocationThread.run(CommandScheduler.java:723)

05-06 10:41:11 D/RunUtil: Running command [adb, -s, SKBFXYWR0LWD, shell, pm, list, features] with timeout: 2m 0s
05-06 10:41:11 W/TestDevice: Feature: feature:com.google.android.tv.hardware.tunnel_quad_playback_4k60 is not available on SKBFXYWR0LWD
05-06 10:41:11 D/RunUtil: Running command [adb, -s, SKBFXYWR0LWD, shell, pm, list, features] with timeout: 2m 0s
05-06 10:41:11 W/TestDevice: Feature: feature:com.google.android.tv.hardware.tunnel_quad_playback_4k30 is not available on SKBFXYWR0LWD
05-06 10:41:11 D/RunUtil: Running command [adb, -s, SKBFXYWR0LWD, shell, pm, list, features] with timeout: 2m 0s
05-06 10:41:12 W/TestDevice: Feature: feature:com.google.android.tv.hardware.tunnel_quad_playback_1080p60 is not available on SKBFXYWR0LWD
05-06 10:41:12 D/RunUtil: Running command [adb, -s, SKBFXYWR0LWD, shell, pm, list, features] with timeout: 2m 0s
05-06 10:41:12 W/TestDevice: Feature: feature:com.google.android.tv.hardware.tunnel_quad_playback_1080p30 is not available on SKBFXYWR0LWD
05-06 10:41:12 D/RunUtil: Running command [adb, -s, SKBFXYWR0LWD, shell, pm, list, features] with timeout: 2m 0s
05-06 10:41:12 W/TestDevice: Feature: feature:com.google.android.tv.hardware.tunnel_quad_playback_720p60 is not available on SKBFXYWR0LWD
05-06 10:41:12 D/RunUtil: Running command [adb, -s, SKBFXYWR0LWD, shell, pm, list, features] with timeout: 2m 0s
05-06 10:41:12 W/TestDevice: Feature: feature:com.google.android.tv.hardware.tunnel_quad_playback_720p30 is not available on SKBFXYWR0LWD
05-06 10:41:12 D/RunUtil: Running command [adb, -s, SKBFXYWR0LWD, shell, pm, list, features] with timeout: 2m 0s
05-06 10:41:12 W/TestDevice: Feature: feature:com.google.android.tv.hardware.tunnel_quad_playback_540p60 is not available on SKBFXYWR0LWD
05-06 10:41:12 D/RunUtil: Running command [adb, -s, SKBFXYWR0LWD, shell, pm, list, features] with timeout: 2m 0s
05-06 10:41:12 W/TestDevice: Feature: feature:com.google.android.tv.hardware.tunnel_quad_playback_540p30 is not available on SKBFXYWR0LWD
05-06 10:41:12 D/RunUtil: Running command [adb, -s, SKBFXYWR0LWD, shell, pm, list, features] with timeout: 2m 0s
05-06 10:41:12 W/TestDevice: Feature: feature:com.google.android.tv.hardware.tunnel_quad_playback_480p60 is not available on SKBFXYWR0LWD
05-06 10:41:12 D/RunUtil: Running command [adb, -s, SKBFXYWR0LWD, shell, pm, list, features] with timeout: 2m 0s
05-06 10:41:12 W/TestDevice: Feature: feature:com.google.android.tv.hardware.tunnel_quad_playback_480p30 is not available on SKBFXYWR0LWD
05-06 10:41:12 D/com.google.android.tv.concurrent.TvConcurrentPlaybackHostTest: com.google.android.tv.hardware.tunnel_quad_playback_ not declared on device
05-06 10:41:12 D/PrettyTestEventLogger: 
==================== com.google.android.tv.concurrent.TvConcurrentPlaybackHostTest#testConcurrentQuadTunnelPlayback STARTED: Wed May 06 10:41:12 KST 2026 ====================
05-06 10:41:12 D/ModuleListener: ModuleListener.testStarted(com.google.android.tv.concurrent.TvConcurrentPlaybackHostTest#testConcurrentQuadTunnelPlayback) on SKBFXYWR0LWD
05-06 10:41:12 D/PrettyTestEventLogger: 
==================== com.google.android.tv.concurrent.TvConcurrentPlaybackHostTest#testConcurrentQuadTunnelPlayback ENDED: Wed May 06 10:41:12 KST 2026 ====================
05-06 10:41:12 I/ModuleListener: [10/730] SKBFXYWR0LWD com.google.android.tv.concurrent.TvConcurrentPlaybackHostTest#testConcurrentQuadTunnelPlayback ASSUMPTION_FAILURE: org.junit.AssumptionViolatedException: Missing capability for: com.google.android.tv.hardware.tunnel_quad_playback_
	at com.google.android.tv.concurrent.TvConcurrentRunner.runChild(TvConcurrentRunner.java:64)
	at com.google.android.tv.concurrent.TvConcurrentRunner.runChild(TvConcurrentRunner.java:46)
	at org.junit.runners.ParentRunner$4.run(ParentRunner.java:331)
	at org.junit.runners.ParentRunner$1.schedule(ParentRunner.java:79)
	at org.junit.runners.ParentRunner.runChildren(ParentRunner.java:329)
	at org.junit.runners.ParentRunner$2.evaluate(ParentRunner.java:293)
	at org.junit.runners.ParentRunner$3.evaluate(ParentRunner.java:306)
	at org.junit.runners.ParentRunner.run(ParentRunner.java:413)
	at com.android.tradefed.testtype.junit4.ExceptionThrowingRunnerWrapper.run(ExceptionThrowingRunnerWrapper.java:43)
	at org.junit.runner.JUnitCore.run(JUnitCore.java:137)
	at com.android.tradefed.testtype.HostTest.runJUnit4Tests(HostTest.java:780)
	at com.android.tradefed.testtype.HostTest.runTestClasses(HostTest.java:660)
	at com.android.tradefed.testtype.HostTest.run(HostTest.java:608)
	at com.android.tradefed.testtype.suite.GranularRetriableTestWrapper.intraModuleRun(GranularRetriableTestWrapper.java:464)
	at com.android.tradefed.testtype.suite.GranularRetriableTestWrapper.run(GranularRetriableTestWrapper.java:353)
	at com.android.tradefed.testtype.suite.ModuleDefinition.run(ModuleDefinition.java:701)
	at com.android.tradefed.testtype.suite.ITestSuite.runSingleModule(ITestSuite.java:1522)
	at com.android.tradefed.testtype.suite.ITestSuite.run(ITestSuite.java:1130)
	at com.android.tradefed.invoker.InvocationExecution.runTest(InvocationExecution.java:1561)
	at com.android.tradefed.invoker.InvocationExecution.runTests(InvocationExecution.java:1324)
	at com.android.tradefed.invoker.TestInvocation.prepareAndRun(TestInvocation.java:696)
	at com.android.tradefed.invoker.TestInvocation.performInvocation(TestInvocation.java:310)
	at com.android.tradefed.invoker.TestInvocation.invoke(TestInvocation.java:1558)
	at com.android.tradefed.command.CommandScheduler$InvocationThread.run(CommandScheduler.java:723)

05-06 10:41:12 D/NativeDevice: Using property ro.build.version.sdk=29 from cache.
05-06 10:41:12 D/DeviceHostUtils: apiLevel: 29
05-06 10:41:12 D/PrettyTestEventLogger: 
==================== com.google.android.tv.concurrent.TvConcurrentPlaybackHostTest#testConcurrentBasicSecondaryPlayback_AV1_AVC STARTED: Wed May 06 10:41:12 KST 2026 ====================
05-06 10:41:12 D/ModuleListener: ModuleListener.testStarted(com.google.android.tv.concurrent.TvConcurrentPlaybackHostTest#testConcurrentBasicSecondaryPlayback_AV1_AVC) on SKBFXYWR0LWD
05-06 10:41:12 D/ListInstrumentationParser: instrumentation:android.tvconcurrent.tvts/androidx.test.runner.AndroidJUnitRunner (target=android.tvconcurrent.tvts)
05-06 10:41:12 D/ListInstrumentationParser: instrumentation:com.google.android.resolution.tvts/androidx.test.runner.AndroidJUnitRunner (target=com.google.android.resolution.tvts)
05-06 10:41:12 D/ListInstrumentationParser: 
05-06 10:41:12 I/RemoteAndroidTestRunner: Running am instrument -w -r --abi armeabi-v7a  -e timeout_msec 600000 -e class 'com.google.android.resolution.tvts.DeviceResolutionTest#testMimeTypeVp9Uhd' com.google.android.resolution.tvts/androidx.test.runner.AndroidJUnitRunner on foxconn-bfx_ua300-SKBFXYWR0LWD
05-06 10:41:15 I/BaseHostJUnit4Test: Test com.google.android.resolution.tvts.DeviceResolutionTest#testMimeTypeVp9Uhd: PASSED
05-06 10:41:15 D/ListInstrumentationParser: instrumentation:android.tvconcurrent.tvts/androidx.test.runner.AndroidJUnitRunner (target=android.tvconcurrent.tvts)
05-06 10:41:15 D/ListInstrumentationParser: instrumentation:com.google.android.resolution.tvts/androidx.test.runner.AndroidJUnitRunner (target=com.google.android.resolution.tvts)
05-06 10:41:15 D/ListInstrumentationParser: 
05-06 10:41:15 I/RemoteAndroidTestRunner: Running am instrument -w -r --abi armeabi-v7a  -e timeout_msec 600000 -e class 'com.google.android.resolution.tvts.DeviceResolutionTest#testMimeTypeVp9Wqhd' com.google.android.resolution.tvts/androidx.test.runner.AndroidJUnitRunner on foxconn-bfx_ua300-SKBFXYWR0LWD
05-06 10:41:17 I/BaseHostJUnit4Test: Test com.google.android.resolution.tvts.DeviceResolutionTest#testMimeTypeVp9Wqhd: PASSED
05-06 10:41:17 D/ListInstrumentationParser: instrumentation:android.tvconcurrent.tvts/androidx.test.runner.AndroidJUnitRunner (target=android.tvconcurrent.tvts)
05-06 10:41:17 D/ListInstrumentationParser: instrumentation:com.google.android.resolution.tvts/androidx.test.runner.AndroidJUnitRunner (target=com.google.android.resolution.tvts)
05-06 10:41:17 D/ListInstrumentationParser: 
05-06 10:41:17 I/RemoteAndroidTestRunner: Running am instrument -w -r --abi armeabi-v7a  -e timeout_msec 600000 -e class 'com.google.android.resolution.tvts.DeviceResolutionTest#testMimeTypeVp9Fhd' com.google.android.resolution.tvts/androidx.test.runner.AndroidJUnitRunner on foxconn-bfx_ua300-SKBFXYWR0LWD
05-06 10:41:19 I/BaseHostJUnit4Test: Test com.google.android.resolution.tvts.DeviceResolutionTest#testMimeTypeVp9Fhd: PASSED
05-06 10:41:19 D/ListInstrumentationParser: instrumentation:android.tvconcurrent.tvts/androidx.test.runner.AndroidJUnitRunner (target=android.tvconcurrent.tvts)
05-06 10:41:19 D/ListInstrumentationParser: instrumentation:com.google.android.resolution.tvts/androidx.test.runner.AndroidJUnitRunner (target=com.google.android.resolution.tvts)
05-06 10:41:19 D/ListInstrumentationParser: 
05-06 10:41:19 I/RemoteAndroidTestRunner: Running am instrument -w -r --abi armeabi-v7a  -e timeout_msec 600000 -e class 'com.google.android.resolution.tvts.DeviceResolutionTest#testMimeTypeVp9Hd' com.google.android.resolution.tvts/androidx.test.runner.AndroidJUnitRunner on foxconn-bfx_ua300-SKBFXYWR0LWD
05-06 10:41:22 I/BaseHostJUnit4Test: Test com.google.android.resolution.tvts.DeviceResolutionTest#testMimeTypeVp9Hd: PASSED
05-06 10:41:22 D/ListInstrumentationParser: instrumentation:android.tvconcurrent.tvts/androidx.test.runner.AndroidJUnitRunner (target=android.tvconcurrent.tvts)
05-06 10:41:22 D/ListInstrumentationParser: instrumentation:com.google.android.resolution.tvts/androidx.test.runner.AndroidJUnitRunner (target=com.google.android.resolution.tvts)
05-06 10:41:22 D/ListInstrumentationParser: 
05-06 10:41:22 I/RemoteAndroidTestRunner: Running am instrument -w -r --abi armeabi-v7a  -e timeout_msec 600000 -e class 'com.google.android.resolution.tvts.DeviceResolutionTest#testMimeTypeH264Uhd' com.google.android.resolution.tvts/androidx.test.runner.AndroidJUnitRunner on foxconn-bfx_ua300-SKBFXYWR0LWD
05-06 10:41:24 I/BaseHostJUnit4Test: Test com.google.android.resolution.tvts.DeviceResolutionTest#testMimeTypeH264Uhd: PASSED
05-06 10:41:24 D/ListInstrumentationParser: instrumentation:android.tvconcurrent.tvts/androidx.test.runner.AndroidJUnitRunner (target=android.tvconcurrent.tvts)
05-06 10:41:24 D/ListInstrumentationParser: instrumentation:com.google.android.resolution.tvts/androidx.test.runner.AndroidJUnitRunner (target=com.google.android.resolution.tvts)
05-06 10:41:24 D/ListInstrumentationParser: 
05-06 10:41:24 I/RemoteAndroidTestRunner: Running am instrument -w -r --abi armeabi-v7a  -e timeout_msec 600000 -e class 'com.google.android.resolution.tvts.DeviceResolutionTest#testMimeTypeH264Wqhd' com.google.android.resolution.tvts/androidx.test.runner.AndroidJUnitRunner on foxconn-bfx_ua300-SKBFXYWR0LWD
05-06 10:41:26 I/BaseHostJUnit4Test: Test com.google.android.resolution.tvts.DeviceResolutionTest#testMimeTypeH264Wqhd: PASSED
05-06 10:41:26 D/ListInstrumentationParser: instrumentation:android.tvconcurrent.tvts/androidx.test.runner.AndroidJUnitRunner (target=android.tvconcurrent.tvts)
05-06 10:41:26 D/ListInstrumentationParser: instrumentation:com.google.android.resolution.tvts/androidx.test.runner.AndroidJUnitRunner (target=com.google.android.resolution.tvts)
05-06 10:41:26 D/ListInstrumentationParser: 
05-06 10:41:26 I/RemoteAndroidTestRunner: Running am instrument -w -r --abi armeabi-v7a  -e timeout_msec 600000 -e class 'com.google.android.resolution.tvts.DeviceResolutionTest#testMimeTypeH264Fhd' com.google.android.resolution.tvts/androidx.test.runner.AndroidJUnitRunner on foxconn-bfx_ua300-SKBFXYWR0LWD
05-06 10:41:29 I/BaseHostJUnit4Test: Test com.google.android.resolution.tvts.DeviceResolutionTest#testMimeTypeH264Fhd: PASSED
05-06 10:41:29 D/ListInstrumentationParser: instrumentation:android.tvconcurrent.tvts/androidx.test.runner.AndroidJUnitRunner (target=android.tvconcurrent.tvts)
05-06 10:41:29 D/ListInstrumentationParser: instrumentation:com.google.android.resolution.tvts/androidx.test.runner.AndroidJUnitRunner (target=com.google.android.resolution.tvts)
05-06 10:41:29 D/ListInstrumentationParser: 
05-06 10:41:29 I/RemoteAndroidTestRunner: Running am instrument -w -r --abi armeabi-v7a  -e timeout_msec 600000 -e class 'com.google.android.resolution.tvts.DeviceResolutionTest#testMimeTypeH264Hd' com.google.android.resolution.tvts/androidx.test.runner.AndroidJUnitRunner on foxconn-bfx_ua300-SKBFXYWR0LWD
05-06 10:41:31 I/BaseHostJUnit4Test: Test com.google.android.resolution.tvts.DeviceResolutionTest#testMimeTypeH264Hd: PASSED
05-06 10:41:31 D/ListInstrumentationParser: instrumentation:android.tvconcurrent.tvts/androidx.test.runner.AndroidJUnitRunner (target=android.tvconcurrent.tvts)
05-06 10:41:31 D/ListInstrumentationParser: instrumentation:com.google.android.resolution.tvts/androidx.test.runner.AndroidJUnitRunner (target=com.google.android.resolution.tvts)
05-06 10:41:31 D/ListInstrumentationParser: 
05-06 10:41:31 I/RemoteAndroidTestRunner: Running am instrument -w -r --abi armeabi-v7a  -e timeout_msec 600000 -e class 'com.google.android.resolution.tvts.DeviceResolutionTest#testMimeTypeHevcUhd' com.google.android.resolution.tvts/androidx.test.runner.AndroidJUnitRunner on foxconn-bfx_ua300-SKBFXYWR0LWD
05-06 10:41:34 I/BaseHostJUnit4Test: Test com.google.android.resolution.tvts.DeviceResolutionTest#testMimeTypeHevcUhd: PASSED
05-06 10:41:34 D/ListInstrumentationParser: instrumentation:android.tvconcurrent.tvts/androidx.test.runner.AndroidJUnitRunner (target=android.tvconcurrent.tvts)
05-06 10:41:34 D/ListInstrumentationParser: instrumentation:com.google.android.resolution.tvts/androidx.test.runner.AndroidJUnitRunner (target=com.google.android.resolution.tvts)
05-06 10:41:34 D/ListInstrumentationParser: 
05-06 10:41:34 I/RemoteAndroidTestRunner: Running am instrument -w -r --abi armeabi-v7a  -e timeout_msec 600000 -e class 'com.google.android.resolution.tvts.DeviceResolutionTest#testMimeTypeHevcWqhd' com.google.android.resolution.tvts/androidx.test.runner.AndroidJUnitRunner on foxconn-bfx_ua300-SKBFXYWR0LWD
05-06 10:41:36 I/BaseHostJUnit4Test: Test com.google.android.resolution.tvts.DeviceResolutionTest#testMimeTypeHevcWqhd: PASSED
05-06 10:41:36 D/ListInstrumentationParser: instrumentation:android.tvconcurrent.tvts/androidx.test.runner.AndroidJUnitRunner (target=android.tvconcurrent.tvts)
05-06 10:41:36 D/ListInstrumentationParser: instrumentation:com.google.android.resolution.tvts/androidx.test.runner.AndroidJUnitRunner (target=com.google.android.resolution.tvts)
05-06 10:41:36 D/ListInstrumentationParser: 
05-06 10:41:36 I/RemoteAndroidTestRunner: Running am instrument -w -r --abi armeabi-v7a  -e timeout_msec 600000 -e class 'com.google.android.resolution.tvts.DeviceResolutionTest#testMimeTypeHevcFhd' com.google.android.resolution.tvts/androidx.test.runner.AndroidJUnitRunner on foxconn-bfx_ua300-SKBFXYWR0LWD
05-06 10:41:38 I/BaseHostJUnit4Test: Test com.google.android.resolution.tvts.DeviceResolutionTest#testMimeTypeHevcFhd: PASSED
05-06 10:41:38 D/ListInstrumentationParser: instrumentation:android.tvconcurrent.tvts/androidx.test.runner.AndroidJUnitRunner (target=android.tvconcurrent.tvts)
05-06 10:41:38 D/ListInstrumentationParser: instrumentation:com.google.android.resolution.tvts/androidx.test.runner.AndroidJUnitRunner (target=com.google.android.resolution.tvts)
05-06 10:41:38 D/ListInstrumentationParser: 
05-06 10:41:38 I/RemoteAndroidTestRunner: Running am instrument -w -r --abi armeabi-v7a  -e timeout_msec 600000 -e class 'com.google.android.resolution.tvts.DeviceResolutionTest#testMimeTypeHevcHd' com.google.android.resolution.tvts/androidx.test.runner.AndroidJUnitRunner on foxconn-bfx_ua300-SKBFXYWR0LWD
05-06 10:41:41 I/BaseHostJUnit4Test: Test com.google.android.resolution.tvts.DeviceResolutionTest#testMimeTypeHevcHd: PASSED
05-06 10:41:41 D/ListInstrumentationParser: instrumentation:android.tvconcurrent.tvts/androidx.test.runner.AndroidJUnitRunner (target=android.tvconcurrent.tvts)
05-06 10:41:41 D/ListInstrumentationParser: instrumentation:com.google.android.resolution.tvts/androidx.test.runner.AndroidJUnitRunner (target=com.google.android.resolution.tvts)
05-06 10:41:41 D/ListInstrumentationParser: 
05-06 10:41:41 I/RemoteAndroidTestRunner: Running am instrument -w -r --abi armeabi-v7a  -e timeout_msec 600000 -e class 'com.google.android.resolution.tvts.DeviceResolutionTest#testMimeTypeAv1Uhd' com.google.android.resolution.tvts/androidx.test.runner.AndroidJUnitRunner on foxconn-bfx_ua300-SKBFXYWR0LWD
05-06 10:41:43 I/BaseHostJUnit4Test: Test com.google.android.resolution.tvts.DeviceResolutionTest#testMimeTypeAv1Uhd: PASSED
05-06 10:41:43 D/ListInstrumentationParser: instrumentation:android.tvconcurrent.tvts/androidx.test.runner.AndroidJUnitRunner (target=android.tvconcurrent.tvts)
05-06 10:41:43 D/ListInstrumentationParser: instrumentation:com.google.android.resolution.tvts/androidx.test.runner.AndroidJUnitRunner (target=com.google.android.resolution.tvts)
05-06 10:41:43 D/ListInstrumentationParser: 
05-06 10:41:43 I/RemoteAndroidTestRunner: Running am instrument -w -r --abi armeabi-v7a  -e timeout_msec 600000 -e class 'com.google.android.resolution.tvts.DeviceResolutionTest#testMimeTypeAv1Wqhd' com.google.android.resolution.tvts/androidx.test.runner.AndroidJUnitRunner on foxconn-bfx_ua300-SKBFXYWR0LWD
05-06 10:41:45 I/BaseHostJUnit4Test: Test com.google.android.resolution.tvts.DeviceResolutionTest#testMimeTypeAv1Wqhd: PASSED
05-06 10:41:45 D/ListInstrumentationParser: instrumentation:android.tvconcurrent.tvts/androidx.test.runner.AndroidJUnitRunner (target=android.tvconcurrent.tvts)
05-06 10:41:45 D/ListInstrumentationParser: instrumentation:com.google.android.resolution.tvts/androidx.test.runner.AndroidJUnitRunner (target=com.google.android.resolution.tvts)
05-06 10:41:45 D/ListInstrumentationParser: 
05-06 10:41:45 I/RemoteAndroidTestRunner: Running am instrument -w -r --abi armeabi-v7a  -e timeout_msec 600000 -e class 'com.google.android.resolution.tvts.DeviceResolutionTest#testMimeTypeAv1Fhd' com.google.android.resolution.tvts/androidx.test.runner.AndroidJUnitRunner on foxconn-bfx_ua300-SKBFXYWR0LWD
05-06 10:41:48 I/BaseHostJUnit4Test: Test com.google.android.resolution.tvts.DeviceResolutionTest#testMimeTypeAv1Fhd: PASSED
05-06 10:41:48 D/ListInstrumentationParser: instrumentation:android.tvconcurrent.tvts/androidx.test.runner.AndroidJUnitRunner (target=android.tvconcurrent.tvts)
05-06 10:41:48 D/ListInstrumentationParser: instrumentation:com.google.android.resolution.tvts/androidx.test.runner.AndroidJUnitRunner (target=com.google.android.resolution.tvts)
05-06 10:41:48 D/ListInstrumentationParser: 
05-06 10:41:48 I/RemoteAndroidTestRunner: Running am instrument -w -r --abi armeabi-v7a  -e timeout_msec 600000 -e class 'com.google.android.resolution.tvts.DeviceResolutionTest#testMimeTypeAv1Hd' com.google.android.resolution.tvts/androidx.test.runner.AndroidJUnitRunner on foxconn-bfx_ua300-SKBFXYWR0LWD
05-06 10:41:50 I/BaseHostJUnit4Test: Test com.google.android.resolution.tvts.DeviceResolutionTest#testMimeTypeAv1Hd: PASSED
05-06 10:41:50 D/ListInstrumentationParser: instrumentation:android.tvconcurrent.tvts/androidx.test.runner.AndroidJUnitRunner (target=android.tvconcurrent.tvts)
05-06 10:41:50 D/ListInstrumentationParser: instrumentation:com.google.android.resolution.tvts/androidx.test.runner.AndroidJUnitRunner (target=com.google.android.resolution.tvts)
05-06 10:41:50 D/ListInstrumentationParser: 
05-06 10:41:50 I/RemoteAndroidTestRunner: Running am instrument -w -r --abi armeabi-v7a  -e timeout_msec 600000 -e class 'com.google.android.resolution.tvts.DeviceResolutionTest#testMimeTypeWidevineVp9Uhd' com.google.android.resolution.tvts/androidx.test.runner.AndroidJUnitRunner on foxconn-bfx_ua300-SKBFXYWR0LWD
05-06 10:41:52 I/BaseHostJUnit4Test: Test com.google.android.resolution.tvts.DeviceResolutionTest#testMimeTypeWidevineVp9Uhd: PASSED
05-06 10:41:53 D/ListInstrumentationParser: instrumentation:android.tvconcurrent.tvts/androidx.test.runner.AndroidJUnitRunner (target=android.tvconcurrent.tvts)
05-06 10:41:53 D/ListInstrumentationParser: instrumentation:com.google.android.resolution.tvts/androidx.test.runner.AndroidJUnitRunner (target=com.google.android.resolution.tvts)
05-06 10:41:53 D/ListInstrumentationParser: 
05-06 10:41:53 I/RemoteAndroidTestRunner: Running am instrument -w -r --abi armeabi-v7a  -e timeout_msec 600000 -e class 'com.google.android.resolution.tvts.DeviceResolutionTest#testMimeTypeWidevineVp9Wqhd' com.google.android.resolution.tvts/androidx.test.runner.AndroidJUnitRunner on foxconn-bfx_ua300-SKBFXYWR0LWD
05-06 10:41:55 I/BaseHostJUnit4Test: Test com.google.android.resolution.tvts.DeviceResolutionTest#testMimeTypeWidevineVp9Wqhd: PASSED
05-06 10:41:55 D/ListInstrumentationParser: instrumentation:android.tvconcurrent.tvts/androidx.test.runner.AndroidJUnitRunner (target=android.tvconcurrent.tvts)
05-06 10:41:55 D/ListInstrumentationParser: instrumentation:com.google.android.resolution.tvts/androidx.test.runner.AndroidJUnitRunner (target=com.google.android.resolution.tvts)
05-06 10:41:55 D/ListInstrumentationParser: 
05-06 10:41:55 I/RemoteAndroidTestRunner: Running am instrument -w -r --abi armeabi-v7a  -e timeout_msec 600000 -e class 'com.google.android.resolution.tvts.DeviceResolutionTest#testMimeTypeWidevineVp9Fhd' com.google.android.resolution.tvts/androidx.test.runner.AndroidJUnitRunner on foxconn-bfx_ua300-SKBFXYWR0LWD
05-06 10:41:57 I/BaseHostJUnit4Test: Test com.google.android.resolution.tvts.DeviceResolutionTest#testMimeTypeWidevineVp9Fhd: PASSED
05-06 10:41:57 D/ListInstrumentationParser: instrumentation:android.tvconcurrent.tvts/androidx.test.runner.AndroidJUnitRunner (target=android.tvconcurrent.tvts)
05-06 10:41:57 D/ListInstrumentationParser: instrumentation:com.google.android.resolution.tvts/androidx.test.runner.AndroidJUnitRunner (target=com.google.android.resolution.tvts)
05-06 10:41:57 D/ListInstrumentationParser: 
05-06 10:41:57 I/RemoteAndroidTestRunner: Running am instrument -w -r --abi armeabi-v7a  -e timeout_msec 600000 -e class 'com.google.android.resolution.tvts.DeviceResolutionTest#testMimeTypeWidevineVp9Hd' com.google.android.resolution.tvts/androidx.test.runner.AndroidJUnitRunner on foxconn-bfx_ua300-SKBFXYWR0LWD
05-06 10:42:00 I/BaseHostJUnit4Test: Test com.google.android.resolution.tvts.DeviceResolutionTest#testMimeTypeWidevineVp9Hd: PASSED
05-06 10:42:00 D/ListInstrumentationParser: instrumentation:android.tvconcurrent.tvts/androidx.test.runner.AndroidJUnitRunner (target=android.tvconcurrent.tvts)
05-06 10:42:00 D/ListInstrumentationParser: instrumentation:com.google.android.resolution.tvts/androidx.test.runner.AndroidJUnitRunner (target=com.google.android.resolution.tvts)
05-06 10:42:00 D/ListInstrumentationParser: 
05-06 10:42:00 I/RemoteAndroidTestRunner: Running am instrument -w -r --abi armeabi-v7a  -e timeout_msec 600000 -e class 'com.google.android.resolution.tvts.DeviceResolutionTest#testMimeTypeWidevineH264Uhd' com.google.android.resolution.tvts/androidx.test.runner.AndroidJUnitRunner on foxconn-bfx_ua300-SKBFXYWR0LWD
05-06 10:42:02 I/BaseHostJUnit4Test: Test com.google.android.resolution.tvts.DeviceResolutionTest#testMimeTypeWidevineH264Uhd: PASSED
05-06 10:42:02 D/ListInstrumentationParser: instrumentation:android.tvconcurrent.tvts/androidx.test.runner.AndroidJUnitRunner (target=android.tvconcurrent.tvts)
05-06 10:42:02 D/ListInstrumentationParser: instrumentation:com.google.android.resolution.tvts/androidx.test.runner.AndroidJUnitRunner (target=com.google.android.resolution.tvts)
05-06 10:42:02 D/ListInstrumentationParser: 
05-06 10:42:02 I/RemoteAndroidTestRunner: Running am instrument -w -r --abi armeabi-v7a  -e timeout_msec 600000 -e class 'com.google.android.resolution.tvts.DeviceResolutionTest#testMimeTypeWidevineH264Wqhd' com.google.android.resolution.tvts/androidx.test.runner.AndroidJUnitRunner on foxconn-bfx_ua300-SKBFXYWR0LWD
05-06 10:42:04 I/BaseHostJUnit4Test: Test com.google.android.resolution.tvts.DeviceResolutionTest#testMimeTypeWidevineH264Wqhd: PASSED
05-06 10:42:04 D/ListInstrumentationParser: instrumentation:android.tvconcurrent.tvts/androidx.test.runner.AndroidJUnitRunner (target=android.tvconcurrent.tvts)
05-06 10:42:04 D/ListInstrumentationParser: instrumentation:com.google.android.resolution.tvts/androidx.test.runner.AndroidJUnitRunner (target=com.google.android.resolution.tvts)
05-06 10:42:04 D/ListInstrumentationParser: 
05-06 10:42:04 I/RemoteAndroidTestRunner: Running am instrument -w -r --abi armeabi-v7a  -e timeout_msec 600000 -e class 'com.google.android.resolution.tvts.DeviceResolutionTest#testMimeTypeWidevineH264Fhd' com.google.android.resolution.tvts/androidx.test.runner.AndroidJUnitRunner on foxconn-bfx_ua300-SKBFXYWR0LWD
05-06 10:42:07 I/BaseHostJUnit4Test: Test com.google.android.resolution.tvts.DeviceResolutionTest#testMimeTypeWidevineH264Fhd: PASSED
05-06 10:42:07 D/ListInstrumentationParser: instrumentation:android.tvconcurrent.tvts/androidx.test.runner.AndroidJUnitRunner (target=android.tvconcurrent.tvts)
05-06 10:42:07 D/ListInstrumentationParser: instrumentation:com.google.android.resolution.tvts/androidx.test.runner.AndroidJUnitRunner (target=com.google.android.resolution.tvts)
05-06 10:42:07 D/ListInstrumentationParser: 
05-06 10:42:07 I/RemoteAndroidTestRunner: Running am instrument -w -r --abi armeabi-v7a  -e timeout_msec 600000 -e class 'com.google.android.resolution.tvts.DeviceResolutionTest#testMimeTypeWidevineH264Hd' com.google.android.resolution.tvts/androidx.test.runner.AndroidJUnitRunner on foxconn-bfx_ua300-SKBFXYWR0LWD
05-06 10:42:09 I/BaseHostJUnit4Test: Test com.google.android.resolution.tvts.DeviceResolutionTest#testMimeTypeWidevineH264Hd: PASSED
05-06 10:42:09 D/ListInstrumentationParser: instrumentation:android.tvconcurrent.tvts/androidx.test.runner.AndroidJUnitRunner (target=android.tvconcurrent.tvts)
05-06 10:42:09 D/ListInstrumentationParser: instrumentation:com.google.android.resolution.tvts/androidx.test.runner.AndroidJUnitRunner (target=com.google.android.resolution.tvts)
05-06 10:42:09 D/ListInstrumentationParser: 
05-06 10:42:09 I/RemoteAndroidTestRunner: Running am instrument -w -r --abi armeabi-v7a  -e timeout_msec 600000 -e class 'com.google.android.resolution.tvts.DeviceResolutionTest#testMimeTypeWidevineHevcUhd' com.google.android.resolution.tvts/androidx.test.runner.AndroidJUnitRunner on foxconn-bfx_ua300-SKBFXYWR0LWD
05-06 10:42:12 I/BaseHostJUnit4Test: Test com.google.android.resolution.tvts.DeviceResolutionTest#testMimeTypeWidevineHevcUhd: PASSED
05-06 10:42:12 D/ListInstrumentationParser: instrumentation:android.tvconcurrent.tvts/androidx.test.runner.AndroidJUnitRunner (target=android.tvconcurrent.tvts)
05-06 10:42:12 D/ListInstrumentationParser: instrumentation:com.google.android.resolution.tvts/androidx.test.runner.AndroidJUnitRunner (target=com.google.android.resolution.tvts)
05-06 10:42:12 D/ListInstrumentationParser: 
05-06 10:42:12 I/RemoteAndroidTestRunner: Running am instrument -w -r --abi armeabi-v7a  -e timeout_msec 600000 -e class 'com.google.android.resolution.tvts.DeviceResolutionTest#testMimeTypeWidevineHevcWqhd' com.google.android.resolution.tvts/androidx.test.runner.AndroidJUnitRunner on foxconn-bfx_ua300-SKBFXYWR0LWD
05-06 10:42:14 I/BaseHostJUnit4Test: Test com.google.android.resolution.tvts.DeviceResolutionTest#testMimeTypeWidevineHevcWqhd: PASSED
05-06 10:42:14 D/ListInstrumentationParser: instrumentation:android.tvconcurrent.tvts/androidx.test.runner.AndroidJUnitRunner (target=android.tvconcurrent.tvts)
05-06 10:42:14 D/ListInstrumentationParser: instrumentation:com.google.android.resolution.tvts/androidx.test.runner.AndroidJUnitRunner (target=com.google.android.resolution.tvts)
05-06 10:42:14 D/ListInstrumentationParser: 
05-06 10:42:14 I/RemoteAndroidTestRunner: Running am instrument -w -r --abi armeabi-v7a  -e timeout_msec 600000 -e class 'com.google.android.resolution.tvts.DeviceResolutionTest#testMimeTypeWidevineHevcFhd' com.google.android.resolution.tvts/androidx.test.runner.AndroidJUnitRunner on foxconn-bfx_ua300-SKBFXYWR0LWD
05-06 10:42:16 I/BaseHostJUnit4Test: Test com.google.android.resolution.tvts.DeviceResolutionTest#testMimeTypeWidevineHevcFhd: PASSED
05-06 10:42:16 D/ListInstrumentationParser: instrumentation:android.tvconcurrent.tvts/androidx.test.runner.AndroidJUnitRunner (target=android.tvconcurrent.tvts)
05-06 10:42:16 D/ListInstrumentationParser: instrumentation:com.google.android.resolution.tvts/androidx.test.runner.AndroidJUnitRunner (target=com.google.android.resolution.tvts)
05-06 10:42:16 D/ListInstrumentationParser: 
05-06 10:42:16 I/RemoteAndroidTestRunner: Running am instrument -w -r --abi armeabi-v7a  -e timeout_msec 600000 -e class 'com.google.android.resolution.tvts.DeviceResolutionTest#testMimeTypeWidevineHevcHd' com.google.android.resolution.tvts/androidx.test.runner.AndroidJUnitRunner on foxconn-bfx_ua300-SKBFXYWR0LWD
05-06 10:42:19 I/BaseHostJUnit4Test: Test com.google.android.resolution.tvts.DeviceResolutionTest#testMimeTypeWidevineHevcHd: PASSED
05-06 10:42:19 D/ListInstrumentationParser: instrumentation:android.tvconcurrent.tvts/androidx.test.runner.AndroidJUnitRunner (target=android.tvconcurrent.tvts)
05-06 10:42:19 D/ListInstrumentationParser: instrumentation:com.google.android.resolution.tvts/androidx.test.runner.AndroidJUnitRunner (target=com.google.android.resolution.tvts)
05-06 10:42:19 D/ListInstrumentationParser: 
05-06 10:42:19 I/RemoteAndroidTestRunner: Running am instrument -w -r --abi armeabi-v7a  -e timeout_msec 600000 -e class 'com.google.android.resolution.tvts.DeviceResolutionTest#testRefreshRate' com.google.android.resolution.tvts/androidx.test.runner.AndroidJUnitRunner on foxconn-bfx_ua300-SKBFXYWR0LWD
05-06 10:42:21 I/BaseHostJUnit4Test: Test com.google.android.resolution.tvts.DeviceResolutionTest#testRefreshRate: PASSED
05-06 10:42:21 I/InstrumentationDerivedProperties: Instrumentation derived properties populated for device: com.android.tradefed.device.TestDevice@3959308b, with these resolutions: [HD, FHD, WQHD, UHD]
05-06 10:42:21 D/RunUtil: Running command [adb, -s, SKBFXYWR0LWD, shell, pm, list, features] with timeout: 2m 0s
05-06 10:42:21 W/TestDevice: Feature: feature:com.google.android.tv.hardware.multi_hdr_playback is not available on SKBFXYWR0LWD
05-06 10:42:21 D/NativeDevice: Using property ro.build.version.sdk=29 from cache.
05-06 10:42:21 D/DeviceHostUtils: apiLevel: 29
05-06 10:42:21 D/NativeDevice: Using property ro.build.version.sdk=29 from cache.
05-06 10:42:21 D/NativeDevice: Using property ro.build.version.sdk=29 from cache.
05-06 10:42:21 D/RunUtil: Running command [adb, -s, SKBFXYWR0LWD, shell, pm, list, features] with timeout: 2m 0s
05-06 10:42:21 W/TestDevice: Feature: feature:com.google.android.tv.hardware.secondary_playback_4k60 is not available on SKBFXYWR0LWD
05-06 10:42:21 D/RunUtil: Running command [adb, -s, SKBFXYWR0LWD, shell, pm, list, features] with timeout: 2m 0s
05-06 10:42:21 W/TestDevice: Feature: feature:com.google.android.tv.hardware.secondary_playback_4k30 is not available on SKBFXYWR0LWD
05-06 10:42:21 D/RunUtil: Running command [adb, -s, SKBFXYWR0LWD, shell, pm, list, features] with timeout: 2m 0s
05-06 10:42:22 W/TestDevice: Feature: feature:com.google.android.tv.hardware.secondary_playback_1080p60 is not available on SKBFXYWR0LWD
05-06 10:42:22 D/RunUtil: Running command [adb, -s, SKBFXYWR0LWD, shell, pm, list, features] with timeout: 2m 0s
05-06 10:42:22 W/TestDevice: Feature: feature:com.google.android.tv.hardware.secondary_playback_1080p30 is not available on SKBFXYWR0LWD
05-06 10:42:22 D/RunUtil: Running command [adb, -s, SKBFXYWR0LWD, shell, pm, list, features] with timeout: 2m 0s
05-06 10:42:22 W/TestDevice: Feature: feature:com.google.android.tv.hardware.secondary_playback_720p60 is not available on SKBFXYWR0LWD
05-06 10:42:22 D/RunUtil: Running command [adb, -s, SKBFXYWR0LWD, shell, pm, list, features] with timeout: 2m 0s
05-06 10:42:22 W/TestDevice: Feature: feature:com.google.android.tv.hardware.secondary_playback_720p30 is not available on SKBFXYWR0LWD
05-06 10:42:22 D/RunUtil: Running command [adb, -s, SKBFXYWR0LWD, shell, pm, list, features] with timeout: 2m 0s
05-06 10:42:22 W/TestDevice: Feature: feature:com.google.android.tv.hardware.secondary_playback_540p60 is not available on SKBFXYWR0LWD
05-06 10:42:22 D/RunUtil: Running command [adb, -s, SKBFXYWR0LWD, shell, pm, list, features] with timeout: 2m 0s
05-06 10:42:22 W/TestDevice: Feature: feature:com.google.android.tv.hardware.secondary_playback_540p30 is not available on SKBFXYWR0LWD
05-06 10:42:22 D/RunUtil: Running command [adb, -s, SKBFXYWR0LWD, shell, pm, list, features] with timeout: 2m 0s
05-06 10:42:22 W/TestDevice: Feature: feature:com.google.android.tv.hardware.secondary_playback_480p60 is not available on SKBFXYWR0LWD
05-06 10:42:22 D/RunUtil: Running command [adb, -s, SKBFXYWR0LWD, shell, pm, list, features] with timeout: 2m 0s
05-06 10:42:22 W/TestDevice: Feature: feature:com.google.android.tv.hardware.secondary_playback_480p30 is not available on SKBFXYWR0LWD
05-06 10:42:22 D/com.google.android.tv.concurrent.TvConcurrentPlaybackHostTest: com.google.android.tv.hardware.secondary_playback_ not declared on device
05-06 10:42:22 D/NativeDevice: Using property ro.build.version.sdk=29 from cache.
05-06 10:42:22 D/RunUtil: Running command [adb, -s, SKBFXYWR0LWD, shell, getprop, ro.config.low_ram] with timeout: 45s
05-06 10:42:22 D/RunUtil: Running command [adb, -s, SKBFXYWR0LWD, shell, pm, list, features] with timeout: 2m 0s
05-06 10:42:22 W/TestDevice: Feature: feature:com.google.android.feature.AMATI_EXPERIENCE is not available on SKBFXYWR0LWD
05-06 10:42:22 D/RunUtil: Running command [adb, -s, SKBFXYWR0LWD, shell, pm, list, features] with timeout: 2m 0s
05-06 10:42:22 D/RunUtil: Running command [adb, -s, SKBFXYWR0LWD, shell, pm, list, features] with timeout: 2m 0s
05-06 10:42:22 W/TestDevice: Feature: feature:com.google.android.feature.tv.REFERENCE_PLUS is not available on SKBFXYWR0LWD
05-06 10:42:22 D/RunUtil: Running command [adb, -s, SKBFXYWR0LWD, shell, getprop, ro.product.first_api_level] with timeout: 45s
05-06 10:42:22 D/RunUtil: Running command [adb, -s, SKBFXYWR0LWD, shell, getprop, ro.boot.product.hardware.sku] with timeout: 45s
05-06 10:42:22 I/DeviceProfileCache: Product Hardware SKU Property null
05-06 10:42:22 D/NativeDevice: Using property ro.product.cpu.abi=armeabi-v7a from cache.
05-06 10:42:22 I/DeviceProfileCache: Device Profile Cache created for device: com.android.tradefed.device.TestDevice@3959308b
05-06 10:42:22 W/TvConcurrentPlaybackHostTest: com.google.android.tv.concurrent.TvConcurrentPlaybackHostTest
05-06 10:42:22 D/NativeDevice: Using property ro.build.version.sdk=29 from cache.
05-06 10:42:22 D/NativeDevice: Using property ro.build.version.sdk=29 from cache.
05-06 10:42:22 D/PrettyTestEventLogger: 
==================== com.google.android.tv.concurrent.TvConcurrentPlaybackHostTest#testConcurrentBasicSecondaryPlayback_AV1_AVC ENDED: Wed May 06 10:42:22 KST 2026 ====================
05-06 10:42:22 I/ModuleListener: [11/730] SKBFXYWR0LWD com.google.android.tv.concurrent.TvConcurrentPlaybackHostTest#testConcurrentBasicSecondaryPlayback_AV1_AVC PASSED
05-06 10:42:22 D/NativeDevice: Using property ro.build.version.sdk=29 from cache.
05-06 10:42:22 D/DeviceHostUtils: apiLevel: 29
05-06 10:42:22 D/PrettyTestEventLogger: 
==================== com.google.android.tv.concurrent.TvConcurrentPlaybackHostTest#testConcurrentBasicSecondaryPlayback_AVC_AVC STARTED: Wed May 06 10:42:22 KST 2026 ====================
05-06 10:42:22 D/ModuleListener: ModuleListener.testStarted(com.google.android.tv.concurrent.TvConcurrentPlaybackHostTest#testConcurrentBasicSecondaryPlayback_AVC_AVC) on SKBFXYWR0LWD
05-06 10:42:22 D/RunUtil: Running command [adb, -s, SKBFXYWR0LWD, shell, pm, list, features] with timeout: 2m 0s
05-06 10:42:23 W/TestDevice: Feature: feature:com.google.android.tv.hardware.multi_hdr_playback is not available on SKBFXYWR0LWD
05-06 10:42:23 D/NativeDevice: Using property ro.build.version.sdk=29 from cache.
05-06 10:42:23 D/DeviceHostUtils: apiLevel: 29
05-06 10:42:23 D/NativeDevice: Using property ro.build.version.sdk=29 from cache.
05-06 10:42:23 D/NativeDevice: Using property ro.build.version.sdk=29 from cache.
05-06 10:42:23 D/RunUtil: Running command [adb, -s, SKBFXYWR0LWD, shell, pm, list, features] with timeout: 2m 0s
05-06 10:42:23 W/TestDevice: Feature: feature:com.google.android.tv.hardware.secondary_playback_4k60 is not available on SKBFXYWR0LWD
05-06 10:42:23 D/RunUtil: Running command [adb, -s, SKBFXYWR0LWD, shell, pm, list, features] with timeout: 2m 0s
05-06 10:42:23 W/TestDevice: Feature: feature:com.google.android.tv.hardware.secondary_playback_4k30 is not available on SKBFXYWR0LWD
05-06 10:42:23 D/RunUtil: Running command [adb, -s, SKBFXYWR0LWD, shell, pm, list, features] with timeout: 2m 0s
05-06 10:42:23 W/TestDevice: Feature: feature:com.google.android.tv.hardware.secondary_playback_1080p60 is not available on SKBFXYWR0LWD
05-06 10:42:23 D/RunUtil: Running command [adb, -s, SKBFXYWR0LWD, shell, pm, list, features] with timeout: 2m 0s
05-06 10:42:23 W/TestDevice: Feature: feature:com.google.android.tv.hardware.secondary_playback_1080p30 is not available on SKBFXYWR0LWD
05-06 10:42:23 D/RunUtil: Running command [adb, -s, SKBFXYWR0LWD, shell, pm, list, features] with timeout: 2m 0s
05-06 10:42:23 W/TestDevice: Feature: feature:com.google.android.tv.hardware.secondary_playback_720p60 is not available on SKBFXYWR0LWD
05-06 10:42:23 D/RunUtil: Running command [adb, -s, SKBFXYWR0LWD, shell, pm, list, features] with timeout: 2m 0s
05-06 10:42:23 W/TestDevice: Feature: feature:com.google.android.tv.hardware.secondary_playback_720p30 is not available on SKBFXYWR0LWD
05-06 10:42:23 D/RunUtil: Running command [adb, -s, SKBFXYWR0LWD, shell, pm, list, features] with timeout: 2m 0s
05-06 10:42:23 W/TestDevice: Feature: feature:com.google.android.tv.hardware.secondary_playback_540p60 is not available on SKBFXYWR0LWD
05-06 10:42:23 D/RunUtil: Running command [adb, -s, SKBFXYWR0LWD, shell, pm, list, features] with timeout: 2m 0s
05-06 10:42:23 W/TestDevice: Feature: feature:com.google.android.tv.hardware.secondary_playback_540p30 is not available on SKBFXYWR0LWD
05-06 10:42:23 D/RunUtil: Running command [adb, -s, SKBFXYWR0LWD, shell, pm, list, features] with timeout: 2m 0s
05-06 10:42:23 W/TestDevice: Feature: feature:com.google.android.tv.hardware.secondary_playback_480p60 is not available on SKBFXYWR0LWD
05-06 10:42:23 D/RunUtil: Running command [adb, -s, SKBFXYWR0LWD, shell, pm, list, features] with timeout: 2m 0s
05-06 10:42:23 W/TestDevice: Feature: feature:com.google.android.tv.hardware.secondary_playback_480p30 is not available on SKBFXYWR0LWD
05-06 10:42:23 D/com.google.android.tv.concurrent.TvConcurrentPlaybackHostTest: com.google.android.tv.hardware.secondary_playback_ not declared on device
05-06 10:42:23 D/NativeDevice: Using property ro.build.version.sdk=29 from cache.
05-06 10:42:24 W/TvConcurrentPlaybackHostTest: com.google.android.tv.concurrent.TvConcurrentPlaybackHostTest
05-06 10:42:24 D/NativeDevice: Using property ro.build.version.sdk=29 from cache.
05-06 10:42:24 D/NativeDevice: Using property ro.build.version.sdk=29 from cache.
05-06 10:42:24 D/PrettyTestEventLogger: 
==================== com.google.android.tv.concurrent.TvConcurrentPlaybackHostTest#testConcurrentBasicSecondaryPlayback_AVC_AVC ENDED: Wed May 06 10:42:24 KST 2026 ====================
05-06 10:42:24 I/ModuleListener: [12/730] SKBFXYWR0LWD com.google.android.tv.concurrent.TvConcurrentPlaybackHostTest#testConcurrentBasicSecondaryPlayback_AVC_AVC PASSED
05-06 10:42:24 D/NativeDevice: Using property ro.build.version.sdk=29 from cache.
05-06 10:42:24 D/DeviceHostUtils: apiLevel: 29
05-06 10:42:24 D/PrettyTestEventLogger: 
==================== com.google.android.tv.concurrent.TvConcurrentPlaybackHostTest#testConcurrentBasicSecondaryPlayback_VP9_AVC STARTED: Wed May 06 10:42:24 KST 2026 ====================
05-06 10:42:24 D/ModuleListener: ModuleListener.testStarted(com.google.android.tv.concurrent.TvConcurrentPlaybackHostTest#testConcurrentBasicSecondaryPlayback_VP9_AVC) on SKBFXYWR0LWD
05-06 10:42:24 D/RunUtil: Running command [adb, -s, SKBFXYWR0LWD, shell, pm, list, features] with timeout: 2m 0s
05-06 10:42:24 W/TestDevice: Feature: feature:com.google.android.tv.hardware.multi_hdr_playback is not available on SKBFXYWR0LWD
05-06 10:42:24 D/NativeDevice: Using property ro.build.version.sdk=29 from cache.
05-06 10:42:24 D/DeviceHostUtils: apiLevel: 29
05-06 10:42:24 D/NativeDevice: Using property ro.build.version.sdk=29 from cache.
05-06 10:42:24 D/NativeDevice: Using property ro.build.version.sdk=29 from cache.
05-06 10:42:24 D/RunUtil: Running command [adb, -s, SKBFXYWR0LWD, shell, pm, list, features] with timeout: 2m 0s
05-06 10:42:24 W/TestDevice: Feature: feature:com.google.android.tv.hardware.secondary_playback_4k60 is not available on SKBFXYWR0LWD
05-06 10:42:24 D/RunUtil: Running command [adb, -s, SKBFXYWR0LWD, shell, pm, list, features] with timeout: 2m 0s
05-06 10:42:24 W/TestDevice: Feature: feature:com.google.android.tv.hardware.secondary_playback_4k30 is not available on SKBFXYWR0LWD
05-06 10:42:24 D/RunUtil: Running command [adb, -s, SKBFXYWR0LWD, shell, pm, list, features] with timeout: 2m 0s
05-06 10:42:24 W/TestDevice: Feature: feature:com.google.android.tv.hardware.secondary_playback_1080p60 is not available on SKBFXYWR0LWD
05-06 10:42:24 D/RunUtil: Running command [adb, -s, SKBFXYWR0LWD, shell, pm, list, features] with timeout: 2m 0s
05-06 10:42:24 W/TestDevice: Feature: feature:com.google.android.tv.hardware.secondary_playback_1080p30 is not available on SKBFXYWR0LWD
05-06 10:42:24 D/RunUtil: Running command [adb, -s, SKBFXYWR0LWD, shell, pm, list, features] with timeout: 2m 0s
05-06 10:42:25 W/TestDevice: Feature: feature:com.google.android.tv.hardware.secondary_playback_720p60 is not available on SKBFXYWR0LWD
05-06 10:42:25 D/RunUtil: Running command [adb, -s, SKBFXYWR0LWD, shell, pm, list, features] with timeout: 2m 0s
05-06 10:42:25 W/TestDevice: Feature: feature:com.google.android.tv.hardware.secondary_playback_720p30 is not available on SKBFXYWR0LWD
05-06 10:42:25 D/RunUtil: Running command [adb, -s, SKBFXYWR0LWD, shell, pm, list, features] with timeout: 2m 0s
05-06 10:42:25 W/TestDevice: Feature: feature:com.google.android.tv.hardware.secondary_playback_540p60 is not available on SKBFXYWR0LWD
05-06 10:42:25 D/RunUtil: Running command [adb, -s, SKBFXYWR0LWD, shell, pm, list, features] with timeout: 2m 0s
05-06 10:42:25 W/TestDevice: Feature: feature:com.google.android.tv.hardware.secondary_playback_540p30 is not available on SKBFXYWR0LWD
05-06 10:42:25 D/RunUtil: Running command [adb, -s, SKBFXYWR0LWD, shell, pm, list, features] with timeout: 2m 0s
05-06 10:42:25 W/TestDevice: Feature: feature:com.google.android.tv.hardware.secondary_playback_480p60 is not available on SKBFXYWR0LWD
05-06 10:42:25 D/RunUtil: Running command [adb, -s, SKBFXYWR0LWD, shell, pm, list, features] with timeout: 2m 0s
05-06 10:42:25 W/TestDevice: Feature: feature:com.google.android.tv.hardware.secondary_playback_480p30 is not available on SKBFXYWR0LWD
05-06 10:42:25 D/com.google.android.tv.concurrent.TvConcurrentPlaybackHostTest: com.google.android.tv.hardware.secondary_playback_ not declared on device
05-06 10:42:25 D/NativeDevice: Using property ro.build.version.sdk=29 from cache.
05-06 10:42:25 W/TvConcurrentPlaybackHostTest: com.google.android.tv.concurrent.TvConcurrentPlaybackHostTest
05-06 10:42:25 D/NativeDevice: Using property ro.build.version.sdk=29 from cache.
05-06 10:42:25 D/NativeDevice: Using property ro.build.version.sdk=29 from cache.
05-06 10:42:25 D/PrettyTestEventLogger: 
==================== com.google.android.tv.concurrent.TvConcurrentPlaybackHostTest#testConcurrentBasicSecondaryPlayback_VP9_AVC ENDED: Wed May 06 10:42:25 KST 2026 ====================
05-06 10:42:25 I/ModuleListener: [13/730] SKBFXYWR0LWD com.google.android.tv.concurrent.TvConcurrentPlaybackHostTest#testConcurrentBasicSecondaryPlayback_VP9_AVC PASSED
05-06 10:42:25 D/NativeDevice: Using property ro.build.version.sdk=29 from cache.
05-06 10:42:25 D/DeviceHostUtils: apiLevel: 29
05-06 10:42:25 D/PrettyTestEventLogger: 
==================== com.google.android.tv.concurrent.TvConcurrentPlaybackHostTest#testConcurrentBasicSecondaryPlayback_HEVC_AVC STARTED: Wed May 06 10:42:25 KST 2026 ====================
05-06 10:42:25 D/ModuleListener: ModuleListener.testStarted(com.google.android.tv.concurrent.TvConcurrentPlaybackHostTest#testConcurrentBasicSecondaryPlayback_HEVC_AVC) on SKBFXYWR0LWD
05-06 10:42:25 D/RunUtil: Running command [adb, -s, SKBFXYWR0LWD, shell, pm, list, features] with timeout: 2m 0s
05-06 10:42:25 W/TestDevice: Feature: feature:com.google.android.tv.hardware.multi_hdr_playback is not available on SKBFXYWR0LWD
05-06 10:42:25 D/NativeDevice: Using property ro.build.version.sdk=29 from cache.
05-06 10:42:25 D/DeviceHostUtils: apiLevel: 29
05-06 10:42:25 D/NativeDevice: Using property ro.build.version.sdk=29 from cache.
05-06 10:42:25 D/NativeDevice: Using property ro.build.version.sdk=29 from cache.
05-06 10:42:26 D/RunUtil: Running command [adb, -s, SKBFXYWR0LWD, shell, pm, list, features] with timeout: 2m 0s
05-06 10:42:26 W/TestDevice: Feature: feature:com.google.android.tv.hardware.secondary_playback_4k60 is not available on SKBFXYWR0LWD
05-06 10:42:26 D/RunUtil: Running command [adb, -s, SKBFXYWR0LWD, shell, pm, list, features] with timeout: 2m 0s
05-06 10:42:26 W/TestDevice: Feature: feature:com.google.android.tv.hardware.secondary_playback_4k30 is not available on SKBFXYWR0LWD
05-06 10:42:26 D/RunUtil: Running command [adb, -s, SKBFXYWR0LWD, shell, pm, list, features] with timeout: 2m 0s
05-06 10:42:26 W/TestDevice: Feature: feature:com.google.android.tv.hardware.secondary_playback_1080p60 is not available on SKBFXYWR0LWD
05-06 10:42:26 D/RunUtil: Running command [adb, -s, SKBFXYWR0LWD, shell, pm, list, features] with timeout: 2m 0s
05-06 10:42:26 W/TestDevice: Feature: feature:com.google.android.tv.hardware.secondary_playback_1080p30 is not available on SKBFXYWR0LWD
05-06 10:42:26 D/RunUtil: Running command [adb, -s, SKBFXYWR0LWD, shell, pm, list, features] with timeout: 2m 0s
05-06 10:42:26 W/TestDevice: Feature: feature:com.google.android.tv.hardware.secondary_playback_720p60 is not available on SKBFXYWR0LWD
05-06 10:42:26 D/RunUtil: Running command [adb, -s, SKBFXYWR0LWD, shell, pm, list, features] with timeout: 2m 0s
05-06 10:42:26 W/TestDevice: Feature: feature:com.google.android.tv.hardware.secondary_playback_720p30 is not available on SKBFXYWR0LWD
05-06 10:42:26 D/RunUtil: Running command [adb, -s, SKBFXYWR0LWD, shell, pm, list, features] with timeout: 2m 0s
05-06 10:42:26 W/TestDevice: Feature: feature:com.google.android.tv.hardware.secondary_playback_540p60 is not available on SKBFXYWR0LWD
05-06 10:42:26 D/RunUtil: Running command [adb, -s, SKBFXYWR0LWD, shell, pm, list, features] with timeout: 2m 0s
05-06 10:42:26 W/TestDevice: Feature: feature:com.google.android.tv.hardware.secondary_playback_540p30 is not available on SKBFXYWR0LWD
05-06 10:42:26 D/RunUtil: Running command [adb, -s, SKBFXYWR0LWD, shell, pm, list, features] with timeout: 2m 0s
05-06 10:42:26 W/TestDevice: Feature: feature:com.google.android.tv.hardware.secondary_playback_480p60 is not available on SKBFXYWR0LWD
05-06 10:42:26 D/RunUtil: Running command [adb, -s, SKBFXYWR0LWD, shell, pm, list, features] with timeout: 2m 0s
05-06 10:42:26 W/TestDevice: Feature: feature:com.google.android.tv.hardware.secondary_playback_480p30 is not available on SKBFXYWR0LWD
05-06 10:42:26 D/com.google.android.tv.concurrent.TvConcurrentPlaybackHostTest: com.google.android.tv.hardware.secondary_playback_ not declared on device
05-06 10:42:26 D/NativeDevice: Using property ro.build.version.sdk=29 from cache.
05-06 10:42:26 W/TvConcurrentPlaybackHostTest: com.google.android.tv.concurrent.TvConcurrentPlaybackHostTest
05-06 10:42:26 D/NativeDevice: Using property ro.build.version.sdk=29 from cache.
05-06 10:42:26 D/NativeDevice: Using property ro.build.version.sdk=29 from cache.
05-06 10:42:26 D/PrettyTestEventLogger: 
==================== com.google.android.tv.concurrent.TvConcurrentPlaybackHostTest#testConcurrentBasicSecondaryPlayback_HEVC_AVC ENDED: Wed May 06 10:42:26 KST 2026 ====================
05-06 10:42:26 I/ModuleListener: [14/730] SKBFXYWR0LWD com.google.android.tv.concurrent.TvConcurrentPlaybackHostTest#testConcurrentBasicSecondaryPlayback_HEVC_AVC PASSED
05-06 10:42:26 D/NativeDevice: Using property ro.build.version.sdk=29 from cache.
05-06 10:42:26 D/DeviceHostUtils: apiLevel: 29
05-06 10:42:26 D/PrettyTestEventLogger: 
==================== com.google.android.tv.concurrent.TvConcurrentPlaybackHostTest#testConcurrentBasicSecondaryPlayback_AV1_AVC_L3 STARTED: Wed May 06 10:42:26 KST 2026 ====================
05-06 10:42:26 D/ModuleListener: ModuleListener.testStarted(com.google.android.tv.concurrent.TvConcurrentPlaybackHostTest#testConcurrentBasicSecondaryPlayback_AV1_AVC_L3) on SKBFXYWR0LWD
05-06 10:42:26 D/RunUtil: Running command [adb, -s, SKBFXYWR0LWD, shell, pm, list, features] with timeout: 2m 0s
05-06 10:42:26 W/TestDevice: Feature: feature:com.google.android.tv.hardware.multi_hdr_playback is not available on SKBFXYWR0LWD
05-06 10:42:26 D/NativeDevice: Using property ro.build.version.sdk=29 from cache.
05-06 10:42:26 D/DeviceHostUtils: apiLevel: 29
05-06 10:42:27 D/NativeDevice: Using property ro.build.version.sdk=29 from cache.
05-06 10:42:27 D/NativeDevice: Using property ro.build.version.sdk=29 from cache.
05-06 10:42:27 D/RunUtil: Running command [adb, -s, SKBFXYWR0LWD, shell, pm, list, features] with timeout: 2m 0s
05-06 10:42:27 W/TestDevice: Feature: feature:com.google.android.tv.hardware.secondary_playback_4k60 is not available on SKBFXYWR0LWD
05-06 10:42:27 D/RunUtil: Running command [adb, -s, SKBFXYWR0LWD, shell, pm, list, features] with timeout: 2m 0s
05-06 10:42:27 W/TestDevice: Feature: feature:com.google.android.tv.hardware.secondary_playback_4k30 is not available on SKBFXYWR0LWD
05-06 10:42:27 D/RunUtil: Running command [adb, -s, SKBFXYWR0LWD, shell, pm, list, features] with timeout: 2m 0s
05-06 10:42:27 W/TestDevice: Feature: feature:com.google.android.tv.hardware.secondary_playback_1080p60 is not available on SKBFXYWR0LWD
05-06 10:42:27 D/RunUtil: Running command [adb, -s, SKBFXYWR0LWD, shell, pm, list, features] with timeout: 2m 0s
05-06 10:42:27 W/TestDevice: Feature: feature:com.google.android.tv.hardware.secondary_playback_1080p30 is not available on SKBFXYWR0LWD
05-06 10:42:27 D/RunUtil: Running command [adb, -s, SKBFXYWR0LWD, shell, pm, list, features] with timeout: 2m 0s
05-06 10:42:27 W/TestDevice: Feature: feature:com.google.android.tv.hardware.secondary_playback_720p60 is not available on SKBFXYWR0LWD
05-06 10:42:27 D/RunUtil: Running command [adb, -s, SKBFXYWR0LWD, shell, pm, list, features] with timeout: 2m 0s
05-06 10:42:27 W/TestDevice: Feature: feature:com.google.android.tv.hardware.secondary_playback_720p30 is not available on SKBFXYWR0LWD
05-06 10:42:27 D/RunUtil: Running command [adb, -s, SKBFXYWR0LWD, shell, pm, list, features] with timeout: 2m 0s
05-06 10:42:27 W/TestDevice: Feature: feature:com.google.android.tv.hardware.secondary_playback_540p60 is not available on SKBFXYWR0LWD
05-06 10:42:27 D/RunUtil: Running command [adb, -s, SKBFXYWR0LWD, shell, pm, list, features] with timeout: 2m 0s
05-06 10:42:27 W/TestDevice: Feature: feature:com.google.android.tv.hardware.secondary_playback_540p30 is not available on SKBFXYWR0LWD
05-06 10:42:27 D/RunUtil: Running command [adb, -s, SKBFXYWR0LWD, shell, pm, list, features] with timeout: 2m 0s
05-06 10:42:27 W/TestDevice: Feature: feature:com.google.android.tv.hardware.secondary_playback_480p60 is not available on SKBFXYWR0LWD
05-06 10:42:27 D/RunUtil: Running command [adb, -s, SKBFXYWR0LWD, shell, pm, list, features] with timeout: 2m 0s
05-06 10:42:27 W/TestDevice: Feature: feature:com.google.android.tv.hardware.secondary_playback_480p30 is not available on SKBFXYWR0LWD
05-06 10:42:27 D/com.google.android.tv.concurrent.TvConcurrentPlaybackHostTest: com.google.android.tv.hardware.secondary_playback_ not declared on device
05-06 10:42:27 D/NativeDevice: Using property ro.build.version.sdk=29 from cache.
05-06 10:42:27 W/TvConcurrentPlaybackHostTest: com.google.android.tv.concurrent.TvConcurrentPlaybackHostTest
05-06 10:42:28 D/NativeDevice: Using property ro.build.version.sdk=29 from cache.
05-06 10:42:28 D/NativeDevice: Using property ro.build.version.sdk=29 from cache.
05-06 10:42:28 D/PrettyTestEventLogger: 
==================== com.google.android.tv.concurrent.TvConcurrentPlaybackHostTest#testConcurrentBasicSecondaryPlayback_AV1_AVC_L3 ENDED: Wed May 06 10:42:28 KST 2026 ====================
05-06 10:42:28 I/ModuleListener: [15/730] SKBFXYWR0LWD com.google.android.tv.concurrent.TvConcurrentPlaybackHostTest#testConcurrentBasicSecondaryPlayback_AV1_AVC_L3 PASSED
05-06 10:42:28 D/NativeDevice: Using property ro.build.version.sdk=29 from cache.
05-06 10:42:28 D/DeviceHostUtils: apiLevel: 29
05-06 10:42:28 D/PrettyTestEventLogger: 
==================== com.google.android.tv.concurrent.TvConcurrentPlaybackHostTest#testConcurrentBasicSecondaryPlayback_AVC_AVC_L3 STARTED: Wed May 06 10:42:28 KST 2026 ====================
05-06 10:42:28 D/ModuleListener: ModuleListener.testStarted(com.google.android.tv.concurrent.TvConcurrentPlaybackHostTest#testConcurrentBasicSecondaryPlayback_AVC_AVC_L3) on SKBFXYWR0LWD
05-06 10:42:28 D/RunUtil: Running command [adb, -s, SKBFXYWR0LWD, shell, pm, list, features] with timeout: 2m 0s
05-06 10:42:28 W/TestDevice: Feature: feature:com.google.android.tv.hardware.multi_hdr_playback is not available on SKBFXYWR0LWD
05-06 10:42:28 D/NativeDevice: Using property ro.build.version.sdk=29 from cache.
05-06 10:42:28 D/DeviceHostUtils: apiLevel: 29
05-06 10:42:28 D/NativeDevice: Using property ro.build.version.sdk=29 from cache.
05-06 10:42:28 D/NativeDevice: Using property ro.build.version.sdk=29 from cache.
05-06 10:42:28 D/RunUtil: Running command [adb, -s, SKBFXYWR0LWD, shell, pm, list, features] with timeout: 2m 0s
05-06 10:42:28 W/TestDevice: Feature: feature:com.google.android.tv.hardware.secondary_playback_4k60 is not available on SKBFXYWR0LWD
05-06 10:42:28 D/RunUtil: Running command [adb, -s, SKBFXYWR0LWD, shell, pm, list, features] with timeout: 2m 0s
05-06 10:42:28 W/TestDevice: Feature: feature:com.google.android.tv.hardware.secondary_playback_4k30 is not available on SKBFXYWR0LWD
05-06 10:42:28 D/RunUtil: Running command [adb, -s, SKBFXYWR0LWD, shell, pm, list, features] with timeout: 2m 0s
05-06 10:42:28 W/TestDevice: Feature: feature:com.google.android.tv.hardware.secondary_playback_1080p60 is not available on SKBFXYWR0LWD
05-06 10:42:28 D/RunUtil: Running command [adb, -s, SKBFXYWR0LWD, shell, pm, list, features] with timeout: 2m 0s
05-06 10:42:28 W/TestDevice: Feature: feature:com.google.android.tv.hardware.secondary_playback_1080p30 is not available on SKBFXYWR0LWD
05-06 10:42:28 D/RunUtil: Running command [adb, -s, SKBFXYWR0LWD, shell, pm, list, features] with timeout: 2m 0s
05-06 10:42:28 W/TestDevice: Feature: feature:com.google.android.tv.hardware.secondary_playback_720p60 is not available on SKBFXYWR0LWD
05-06 10:42:28 D/RunUtil: Running command [adb, -s, SKBFXYWR0LWD, shell, pm, list, features] with timeout: 2m 0s
05-06 10:42:28 W/TestDevice: Feature: feature:com.google.android.tv.hardware.secondary_playback_720p30 is not available on SKBFXYWR0LWD
05-06 10:42:28 D/RunUtil: Running command [adb, -s, SKBFXYWR0LWD, shell, pm, list, features] with timeout: 2m 0s
05-06 10:42:29 W/TestDevice: Feature: feature:com.google.android.tv.hardware.secondary_playback_540p60 is not available on SKBFXYWR0LWD
05-06 10:42:29 D/RunUtil: Running command [adb, -s, SKBFXYWR0LWD, shell, pm, list, features] with timeout: 2m 0s
05-06 10:42:29 W/TestDevice: Feature: feature:com.google.android.tv.hardware.secondary_playback_540p30 is not available on SKBFXYWR0LWD
05-06 10:42:29 D/RunUtil: Running command [adb, -s, SKBFXYWR0LWD, shell, pm, list, features] with timeout: 2m 0s
05-06 10:42:29 W/TestDevice: Feature: feature:com.google.android.tv.hardware.secondary_playback_480p60 is not available on SKBFXYWR0LWD
05-06 10:42:29 D/RunUtil: Running command [adb, -s, SKBFXYWR0LWD, shell, pm, list, features] with timeout: 2m 0s
05-06 10:42:29 W/TestDevice: Feature: feature:com.google.android.tv.hardware.secondary_playback_480p30 is not available on SKBFXYWR0LWD
05-06 10:42:29 D/com.google.android.tv.concurrent.TvConcurrentPlaybackHostTest: com.google.android.tv.hardware.secondary_playback_ not declared on device
05-06 10:42:29 D/NativeDevice: Using property ro.build.version.sdk=29 from cache.
05-06 10:42:29 W/TvConcurrentPlaybackHostTest: com.google.android.tv.concurrent.TvConcurrentPlaybackHostTest
05-06 10:42:29 D/NativeDevice: Using property ro.build.version.sdk=29 from cache.
05-06 10:42:29 D/NativeDevice: Using property ro.build.version.sdk=29 from cache.
05-06 10:42:29 D/PrettyTestEventLogger: 
==================== com.google.android.tv.concurrent.TvConcurrentPlaybackHostTest#testConcurrentBasicSecondaryPlayback_AVC_AVC_L3 ENDED: Wed May 06 10:42:29 KST 2026 ====================
05-06 10:42:29 I/ModuleListener: [16/730] SKBFXYWR0LWD com.google.android.tv.concurrent.TvConcurrentPlaybackHostTest#testConcurrentBasicSecondaryPlayback_AVC_AVC_L3 PASSED
05-06 10:42:29 D/NativeDevice: Using property ro.build.version.sdk=29 from cache.
05-06 10:42:29 D/DeviceHostUtils: apiLevel: 29
05-06 10:42:29 D/PrettyTestEventLogger: 
==================== com.google.android.tv.concurrent.TvConcurrentPlaybackHostTest#testConcurrentBasicSecondaryPlayback_VP9_AVC_L3 STARTED: Wed May 06 10:42:29 KST 2026 ====================
05-06 10:42:29 D/ModuleListener: ModuleListener.testStarted(com.google.android.tv.concurrent.TvConcurrentPlaybackHostTest#testConcurrentBasicSecondaryPlayback_VP9_AVC_L3) on SKBFXYWR0LWD
05-06 10:42:29 D/RunUtil: Running command [adb, -s, SKBFXYWR0LWD, shell, pm, list, features] with timeout: 2m 0s
05-06 10:42:29 W/TestDevice: Feature: feature:com.google.android.tv.hardware.multi_hdr_playback is not available on SKBFXYWR0LWD
05-06 10:42:29 D/NativeDevice: Using property ro.build.version.sdk=29 from cache.
05-06 10:42:29 D/DeviceHostUtils: apiLevel: 29
05-06 10:42:29 D/NativeDevice: Using property ro.build.version.sdk=29 from cache.
05-06 10:42:29 D/NativeDevice: Using property ro.build.version.sdk=29 from cache.
05-06 10:42:29 D/RunUtil: Running command [adb, -s, SKBFXYWR0LWD, shell, pm, list, features] with timeout: 2m 0s
05-06 10:42:29 W/TestDevice: Feature: feature:com.google.android.tv.hardware.secondary_playback_4k60 is not available on SKBFXYWR0LWD
05-06 10:42:29 D/RunUtil: Running command [adb, -s, SKBFXYWR0LWD, shell, pm, list, features] with timeout: 2m 0s
05-06 10:42:30 W/TestDevice: Feature: feature:com.google.android.tv.hardware.secondary_playback_4k30 is not available on SKBFXYWR0LWD
05-06 10:42:30 D/RunUtil: Running command [adb, -s, SKBFXYWR0LWD, shell, pm, list, features] with timeout: 2m 0s
05-06 10:42:30 W/TestDevice: Feature: feature:com.google.android.tv.hardware.secondary_playback_1080p60 is not available on SKBFXYWR0LWD
05-06 10:42:30 D/RunUtil: Running command [adb, -s, SKBFXYWR0LWD, shell, pm, list, features] with timeout: 2m 0s
05-06 10:42:30 W/TestDevice: Feature: feature:com.google.android.tv.hardware.secondary_playback_1080p30 is not available on SKBFXYWR0LWD
05-06 10:42:30 D/RunUtil: Running command [adb, -s, SKBFXYWR0LWD, shell, pm, list, features] with timeout: 2m 0s
05-06 10:42:30 W/TestDevice: Feature: feature:com.google.android.tv.hardware.secondary_playback_720p60 is not available on SKBFXYWR0LWD
05-06 10:42:30 D/RunUtil: Running command [adb, -s, SKBFXYWR0LWD, shell, pm, list, features] with timeout: 2m 0s
05-06 10:42:30 W/TestDevice: Feature: feature:com.google.android.tv.hardware.secondary_playback_720p30 is not available on SKBFXYWR0LWD
05-06 10:42:30 D/RunUtil: Running command [adb, -s, SKBFXYWR0LWD, shell, pm, list, features] with timeout: 2m 0s
05-06 10:42:30 W/TestDevice: Feature: feature:com.google.android.tv.hardware.secondary_playback_540p60 is not available on SKBFXYWR0LWD
05-06 10:42:30 D/RunUtil: Running command [adb, -s, SKBFXYWR0LWD, shell, pm, list, features] with timeout: 2m 0s
05-06 10:42:30 W/TestDevice: Feature: feature:com.google.android.tv.hardware.secondary_playback_540p30 is not available on SKBFXYWR0LWD
05-06 10:42:30 D/RunUtil: Running command [adb, -s, SKBFXYWR0LWD, shell, pm, list, features] with timeout: 2m 0s
05-06 10:42:30 W/TestDevice: Feature: feature:com.google.android.tv.hardware.secondary_playback_480p60 is not available on SKBFXYWR0LWD
05-06 10:42:30 D/RunUtil: Running command [adb, -s, SKBFXYWR0LWD, shell, pm, list, features] with timeout: 2m 0s
05-06 10:42:30 W/TestDevice: Feature: feature:com.google.android.tv.hardware.secondary_playback_480p30 is not available on SKBFXYWR0LWD
05-06 10:42:30 D/com.google.android.tv.concurrent.TvConcurrentPlaybackHostTest: com.google.android.tv.hardware.secondary_playback_ not declared on device
05-06 10:42:30 D/NativeDevice: Using property ro.build.version.sdk=29 from cache.
05-06 10:42:30 W/TvConcurrentPlaybackHostTest: com.google.android.tv.concurrent.TvConcurrentPlaybackHostTest
05-06 10:42:30 D/NativeDevice: Using property ro.build.version.sdk=29 from cache.
05-06 10:42:30 D/NativeDevice: Using property ro.build.version.sdk=29 from cache.
05-06 10:42:30 D/PrettyTestEventLogger: 
==================== com.google.android.tv.concurrent.TvConcurrentPlaybackHostTest#testConcurrentBasicSecondaryPlayback_VP9_AVC_L3 ENDED: Wed May 06 10:42:30 KST 2026 ====================
05-06 10:42:30 I/ModuleListener: [17/730] SKBFXYWR0LWD com.google.android.tv.concurrent.TvConcurrentPlaybackHostTest#testConcurrentBasicSecondaryPlayback_VP9_AVC_L3 PASSED
05-06 10:42:30 D/NativeDevice: Using property ro.build.version.sdk=29 from cache.
05-06 10:42:30 D/DeviceHostUtils: apiLevel: 29
05-06 10:42:30 D/PrettyTestEventLogger: 
==================== com.google.android.tv.concurrent.TvConcurrentPlaybackHostTest#testConcurrentBasicSecondaryPlayback_HEVC_AVC_L3 STARTED: Wed May 06 10:42:30 KST 2026 ====================
05-06 10:42:30 D/ModuleListener: ModuleListener.testStarted(com.google.android.tv.concurrent.TvConcurrentPlaybackHostTest#testConcurrentBasicSecondaryPlayback_HEVC_AVC_L3) on SKBFXYWR0LWD
05-06 10:42:30 D/RunUtil: Running command [adb, -s, SKBFXYWR0LWD, shell, pm, list, features] with timeout: 2m 0s
05-06 10:42:30 W/TestDevice: Feature: feature:com.google.android.tv.hardware.multi_hdr_playback is not available on SKBFXYWR0LWD
05-06 10:42:30 D/NativeDevice: Using property ro.build.version.sdk=29 from cache.
05-06 10:42:30 D/DeviceHostUtils: apiLevel: 29
05-06 10:42:30 D/NativeDevice: Using property ro.build.version.sdk=29 from cache.
05-06 10:42:31 D/NativeDevice: Using property ro.build.version.sdk=29 from cache.
05-06 10:42:31 D/RunUtil: Running command [adb, -s, SKBFXYWR0LWD, shell, pm, list, features] with timeout: 2m 0s
05-06 10:42:31 W/TestDevice: Feature: feature:com.google.android.tv.hardware.secondary_playback_4k60 is not available on SKBFXYWR0LWD
05-06 10:42:31 D/RunUtil: Running command [adb, -s, SKBFXYWR0LWD, shell, pm, list, features] with timeout: 2m 0s
05-06 10:42:31 W/TestDevice: Feature: feature:com.google.android.tv.hardware.secondary_playback_4k30 is not available on SKBFXYWR0LWD
05-06 10:42:31 D/RunUtil: Running command [adb, -s, SKBFXYWR0LWD, shell, pm, list, features] with timeout: 2m 0s
05-06 10:42:31 W/TestDevice: Feature: feature:com.google.android.tv.hardware.secondary_playback_1080p60 is not available on SKBFXYWR0LWD
05-06 10:42:31 D/RunUtil: Running command [adb, -s, SKBFXYWR0LWD, shell, pm, list, features] with timeout: 2m 0s
05-06 10:42:31 W/TestDevice: Feature: feature:com.google.android.tv.hardware.secondary_playback_1080p30 is not available on SKBFXYWR0LWD
05-06 10:42:31 D/RunUtil: Running command [adb, -s, SKBFXYWR0LWD, shell, pm, list, features] with timeout: 2m 0s
05-06 10:42:31 W/TestDevice: Feature: feature:com.google.android.tv.hardware.secondary_playback_720p60 is not available on SKBFXYWR0LWD
05-06 10:42:31 D/RunUtil: Running command [adb, -s, SKBFXYWR0LWD, shell, pm, list, features] with timeout: 2m 0s
05-06 10:42:31 W/TestDevice: Feature: feature:com.google.android.tv.hardware.secondary_playback_720p30 is not available on SKBFXYWR0LWD
05-06 10:42:31 D/RunUtil: Running command [adb, -s, SKBFXYWR0LWD, shell, pm, list, features] with timeout: 2m 0s
05-06 10:42:31 W/TestDevice: Feature: feature:com.google.android.tv.hardware.secondary_playback_540p60 is not available on SKBFXYWR0LWD
05-06 10:42:31 D/RunUtil: Running command [adb, -s, SKBFXYWR0LWD, shell, pm, list, features] with timeout: 2m 0s
05-06 10:42:31 W/TestDevice: Feature: feature:com.google.android.tv.hardware.secondary_playback_540p30 is not available on SKBFXYWR0LWD
05-06 10:42:31 D/RunUtil: Running command [adb, -s, SKBFXYWR0LWD, shell, pm, list, features] with timeout: 2m 0s
05-06 10:42:31 W/TestDevice: Feature: feature:com.google.android.tv.hardware.secondary_playback_480p60 is not available on SKBFXYWR0LWD
05-06 10:42:31 D/RunUtil: Running command [adb, -s, SKBFXYWR0LWD, shell, pm, list, features] with timeout: 2m 0s
05-06 10:42:31 W/TestDevice: Feature: feature:com.google.android.tv.hardware.secondary_playback_480p30 is not available on SKBFXYWR0LWD
05-06 10:42:31 D/com.google.android.tv.concurrent.TvConcurrentPlaybackHostTest: com.google.android.tv.hardware.secondary_playback_ not declared on device
05-06 10:42:31 D/NativeDevice: Using property ro.build.version.sdk=29 from cache.
05-06 10:42:31 W/TvConcurrentPlaybackHostTest: com.google.android.tv.concurrent.TvConcurrentPlaybackHostTest
05-06 10:42:31 D/NativeDevice: Using property ro.build.version.sdk=29 from cache.
05-06 10:42:31 D/NativeDevice: Using property ro.build.version.sdk=29 from cache.
05-06 10:42:32 D/PrettyTestEventLogger: 
==================== com.google.android.tv.concurrent.TvConcurrentPlaybackHostTest#testConcurrentBasicSecondaryPlayback_HEVC_AVC_L3 ENDED: Wed May 06 10:42:32 KST 2026 ====================
05-06 10:42:32 I/ModuleListener: [18/730] SKBFXYWR0LWD com.google.android.tv.concurrent.TvConcurrentPlaybackHostTest#testConcurrentBasicSecondaryPlayback_HEVC_AVC_L3 PASSED
05-06 10:42:32 D/NativeDevice: Using property ro.build.version.sdk=29 from cache.
05-06 10:42:32 D/DeviceHostUtils: apiLevel: 29
05-06 10:42:32 D/PrettyTestEventLogger: 
==================== com.google.android.tv.concurrent.TvConcurrentPlaybackHostTest#testConcurrentBasicSecondaryPlayback_AV1_AVC STARTED: Wed May 06 10:42:32 KST 2026 ====================
05-06 10:42:32 D/ModuleListener: ModuleListener.testStarted(com.google.android.tv.concurrent.TvConcurrentPlaybackHostTest#testConcurrentBasicSecondaryPlayback_AV1_AVC) on SKBFXYWR0LWD
05-06 10:42:32 D/RunUtil: Running command [adb, -s, SKBFXYWR0LWD, shell, pm, list, features] with timeout: 2m 0s
05-06 10:42:32 W/TestDevice: Feature: feature:com.google.android.tv.hardware.multi_hdr_playback is not available on SKBFXYWR0LWD
05-06 10:42:32 D/NativeDevice: Using property ro.build.version.sdk=29 from cache.
05-06 10:42:32 D/DeviceHostUtils: apiLevel: 29
05-06 10:42:32 D/NativeDevice: Using property ro.build.version.sdk=29 from cache.
05-06 10:42:32 D/NativeDevice: Using property ro.build.version.sdk=29 from cache.
05-06 10:42:32 D/RunUtil: Running command [adb, -s, SKBFXYWR0LWD, shell, pm, list, features] with timeout: 2m 0s
05-06 10:42:32 W/TestDevice: Feature: feature:com.google.android.tv.hardware.secondary_playback_4k60 is not available on SKBFXYWR0LWD
05-06 10:42:32 D/RunUtil: Running command [adb, -s, SKBFXYWR0LWD, shell, pm, list, features] with timeout: 2m 0s
05-06 10:42:32 W/TestDevice: Feature: feature:com.google.android.tv.hardware.secondary_playback_4k30 is not available on SKBFXYWR0LWD
05-06 10:42:32 D/RunUtil: Running command [adb, -s, SKBFXYWR0LWD, shell, pm, list, features] with timeout: 2m 0s
05-06 10:42:32 W/TestDevice: Feature: feature:com.google.android.tv.hardware.secondary_playback_1080p60 is not available on SKBFXYWR0LWD
05-06 10:42:32 D/RunUtil: Running command [adb, -s, SKBFXYWR0LWD, shell, pm, list, features] with timeout: 2m 0s
05-06 10:42:32 W/TestDevice: Feature: feature:com.google.android.tv.hardware.secondary_playback_1080p30 is not available on SKBFXYWR0LWD
05-06 10:42:32 D/RunUtil: Running command [adb, -s, SKBFXYWR0LWD, shell, pm, list, features] with timeout: 2m 0s
05-06 10:42:32 W/TestDevice: Feature: feature:com.google.android.tv.hardware.secondary_playback_720p60 is not available on SKBFXYWR0LWD
05-06 10:42:32 D/RunUtil: Running command [adb, -s, SKBFXYWR0LWD, shell, pm, list, features] with timeout: 2m 0s
05-06 10:42:32 W/TestDevice: Feature: feature:com.google.android.tv.hardware.secondary_playback_720p30 is not available on SKBFXYWR0LWD
05-06 10:42:32 D/RunUtil: Running command [adb, -s, SKBFXYWR0LWD, shell, pm, list, features] with timeout: 2m 0s
05-06 10:42:32 W/TestDevice: Feature: feature:com.google.android.tv.hardware.secondary_playback_540p60 is not available on SKBFXYWR0LWD
05-06 10:42:32 D/RunUtil: Running command [adb, -s, SKBFXYWR0LWD, shell, pm, list, features] with timeout: 2m 0s
05-06 10:42:32 W/TestDevice: Feature: feature:com.google.android.tv.hardware.secondary_playback_540p30 is not available on SKBFXYWR0LWD
05-06 10:42:32 D/RunUtil: Running command [adb, -s, SKBFXYWR0LWD, shell, pm, list, features] with timeout: 2m 0s
05-06 10:42:33 W/TestDevice: Feature: feature:com.google.android.tv.hardware.secondary_playback_480p60 is not available on SKBFXYWR0LWD
05-06 10:42:33 D/RunUtil: Running command [adb, -s, SKBFXYWR0LWD, shell, pm, list, features] with timeout: 2m 0s
05-06 10:42:33 W/TestDevice: Feature: feature:com.google.android.tv.hardware.secondary_playback_480p30 is not available on SKBFXYWR0LWD
05-06 10:42:33 D/com.google.android.tv.concurrent.TvConcurrentPlaybackHostTest: com.google.android.tv.hardware.secondary_playback_ not declared on device
05-06 10:42:33 D/NativeDevice: Using property ro.build.version.sdk=29 from cache.
05-06 10:42:33 W/TvConcurrentPlaybackHostTest: com.google.android.tv.concurrent.TvConcurrentPlaybackHostTest
05-06 10:42:33 D/NativeDevice: Using property ro.build.version.sdk=29 from cache.
05-06 10:42:33 D/NativeDevice: Using property ro.build.version.sdk=29 from cache.
05-06 10:42:33 D/PrettyTestEventLogger: 
==================== com.google.android.tv.concurrent.TvConcurrentPlaybackHostTest#testConcurrentBasicSecondaryPlayback_AV1_AVC ENDED: Wed May 06 10:42:33 KST 2026 ====================
05-06 10:42:33 I/ModuleListener: [19/730] SKBFXYWR0LWD com.google.android.tv.concurrent.TvConcurrentPlaybackHostTest#testConcurrentBasicSecondaryPlayback_AV1_AVC PASSED
05-06 10:42:33 D/NativeDevice: Using property ro.build.version.sdk=29 from cache.
05-06 10:42:33 D/DeviceHostUtils: apiLevel: 29
05-06 10:42:33 D/PrettyTestEventLogger: 
==================== com.google.android.tv.concurrent.TvConcurrentPlaybackHostTest#testConcurrentBasicSecondaryPlayback_AVC_AVC STARTED: Wed May 06 10:42:33 KST 2026 ====================
05-06 10:42:33 D/ModuleListener: ModuleListener.testStarted(com.google.android.tv.concurrent.TvConcurrentPlaybackHostTest#testConcurrentBasicSecondaryPlayback_AVC_AVC) on SKBFXYWR0LWD
05-06 10:42:33 D/RunUtil: Running command [adb, -s, SKBFXYWR0LWD, shell, pm, list, features] with timeout: 2m 0s
05-06 10:42:33 W/TestDevice: Feature: feature:com.google.android.tv.hardware.multi_hdr_playback is not available on SKBFXYWR0LWD
05-06 10:42:33 D/NativeDevice: Using property ro.build.version.sdk=29 from cache.
05-06 10:42:33 D/DeviceHostUtils: apiLevel: 29
05-06 10:42:33 D/NativeDevice: Using property ro.build.version.sdk=29 from cache.
05-06 10:42:33 D/NativeDevice: Using property ro.build.version.sdk=29 from cache.
05-06 10:42:33 D/RunUtil: Running command [adb, -s, SKBFXYWR0LWD, shell, pm, list, features] with timeout: 2m 0s
05-06 10:42:33 W/TestDevice: Feature: feature:com.google.android.tv.hardware.secondary_playback_4k60 is not available on SKBFXYWR0LWD
05-06 10:42:33 D/RunUtil: Running command [adb, -s, SKBFXYWR0LWD, shell, pm, list, features] with timeout: 2m 0s
05-06 10:42:33 W/TestDevice: Feature: feature:com.google.android.tv.hardware.secondary_playback_4k30 is not available on SKBFXYWR0LWD
05-06 10:42:33 D/RunUtil: Running command [adb, -s, SKBFXYWR0LWD, shell, pm, list, features] with timeout: 2m 0s
05-06 10:42:33 W/TestDevice: Feature: feature:com.google.android.tv.hardware.secondary_playback_1080p60 is not available on SKBFXYWR0LWD
05-06 10:42:33 D/RunUtil: Running command [adb, -s, SKBFXYWR0LWD, shell, pm, list, features] with timeout: 2m 0s
05-06 10:42:34 W/TestDevice: Feature: feature:com.google.android.tv.hardware.secondary_playback_1080p30 is not available on SKBFXYWR0LWD
05-06 10:42:34 D/RunUtil: Running command [adb, -s, SKBFXYWR0LWD, shell, pm, list, features] with timeout: 2m 0s
05-06 10:42:34 W/TestDevice: Feature: feature:com.google.android.tv.hardware.secondary_playback_720p60 is not available on SKBFXYWR0LWD
05-06 10:42:34 D/RunUtil: Running command [adb, -s, SKBFXYWR0LWD, shell, pm, list, features] with timeout: 2m 0s
05-06 10:42:34 W/TestDevice: Feature: feature:com.google.android.tv.hardware.secondary_playback_720p30 is not available on SKBFXYWR0LWD
05-06 10:42:34 D/RunUtil: Running command [adb, -s, SKBFXYWR0LWD, shell, pm, list, features] with timeout: 2m 0s
05-06 10:42:34 W/TestDevice: Feature: feature:com.google.android.tv.hardware.secondary_playback_540p60 is not available on SKBFXYWR0LWD
05-06 10:42:34 D/RunUtil: Running command [adb, -s, SKBFXYWR0LWD, shell, pm, list, features] with timeout: 2m 0s
05-06 10:42:34 W/TestDevice: Feature: feature:com.google.android.tv.hardware.secondary_playback_540p30 is not available on SKBFXYWR0LWD
05-06 10:42:34 D/RunUtil: Running command [adb, -s, SKBFXYWR0LWD, shell, pm, list, features] with timeout: 2m 0s
05-06 10:42:34 W/TestDevice: Feature: feature:com.google.android.tv.hardware.secondary_playback_480p60 is not available on SKBFXYWR0LWD
05-06 10:42:34 D/RunUtil: Running command [adb, -s, SKBFXYWR0LWD, shell, pm, list, features] with timeout: 2m 0s
05-06 10:42:34 W/TestDevice: Feature: feature:com.google.android.tv.hardware.secondary_playback_480p30 is not available on SKBFXYWR0LWD
05-06 10:42:34 D/com.google.android.tv.concurrent.TvConcurrentPlaybackHostTest: com.google.android.tv.hardware.secondary_playback_ not declared on device
05-06 10:42:34 D/NativeDevice: Using property ro.build.version.sdk=29 from cache.
05-06 10:42:34 W/TvConcurrentPlaybackHostTest: com.google.android.tv.concurrent.TvConcurrentPlaybackHostTest
05-06 10:42:34 D/NativeDevice: Using property ro.build.version.sdk=29 from cache.
05-06 10:42:34 D/NativeDevice: Using property ro.build.version.sdk=29 from cache.
05-06 10:42:34 D/PrettyTestEventLogger: 
==================== com.google.android.tv.concurrent.TvConcurrentPlaybackHostTest#testConcurrentBasicSecondaryPlayback_AVC_AVC ENDED: Wed May 06 10:42:34 KST 2026 ====================
05-06 10:42:34 I/ModuleListener: [20/730] SKBFXYWR0LWD com.google.android.tv.concurrent.TvConcurrentPlaybackHostTest#testConcurrentBasicSecondaryPlayback_AVC_AVC PASSED
05-06 10:42:34 D/NativeDevice: Using property ro.build.version.sdk=29 from cache.
05-06 10:42:34 D/DeviceHostUtils: apiLevel: 29
05-06 10:42:34 D/PrettyTestEventLogger: 
==================== com.google.android.tv.concurrent.TvConcurrentPlaybackHostTest#testConcurrentBasicSecondaryPlayback_VP9_AVC STARTED: Wed May 06 10:42:34 KST 2026 ====================
05-06 10:42:34 D/ModuleListener: ModuleListener.testStarted(com.google.android.tv.concurrent.TvConcurrentPlaybackHostTest#testConcurrentBasicSecondaryPlayback_VP9_AVC) on SKBFXYWR0LWD
05-06 10:42:34 D/RunUtil: Running command [adb, -s, SKBFXYWR0LWD, shell, pm, list, features] with timeout: 2m 0s
05-06 10:42:34 W/TestDevice: Feature: feature:com.google.android.tv.hardware.multi_hdr_playback is not available on SKBFXYWR0LWD
05-06 10:42:34 D/NativeDevice: Using property ro.build.version.sdk=29 from cache.
05-06 10:42:34 D/DeviceHostUtils: apiLevel: 29
05-06 10:42:34 D/NativeDevice: Using property ro.build.version.sdk=29 from cache.
05-06 10:42:34 D/NativeDevice: Using property ro.build.version.sdk=29 from cache.
05-06 10:42:35 D/RunUtil: Running command [adb, -s, SKBFXYWR0LWD, shell, pm, list, features] with timeout: 2m 0s
05-06 10:42:35 W/TestDevice: Feature: feature:com.google.android.tv.hardware.secondary_playback_4k60 is not available on SKBFXYWR0LWD
05-06 10:42:35 D/RunUtil: Running command [adb, -s, SKBFXYWR0LWD, shell, pm, list, features] with timeout: 2m 0s
05-06 10:42:35 W/TestDevice: Feature: feature:com.google.android.tv.hardware.secondary_playback_4k30 is not available on SKBFXYWR0LWD
05-06 10:42:35 D/RunUtil: Running command [adb, -s, SKBFXYWR0LWD, shell, pm, list, features] with timeout: 2m 0s
05-06 10:42:35 W/TestDevice: Feature: feature:com.google.android.tv.hardware.secondary_playback_1080p60 is not available on SKBFXYWR0LWD
05-06 10:42:35 D/RunUtil: Running command [adb, -s, SKBFXYWR0LWD, shell, pm, list, features] with timeout: 2m 0s
05-06 10:42:35 W/TestDevice: Feature: feature:com.google.android.tv.hardware.secondary_playback_1080p30 is not available on SKBFXYWR0LWD
05-06 10:42:35 D/RunUtil: Running command [adb, -s, SKBFXYWR0LWD, shell, pm, list, features] with timeout: 2m 0s
05-06 10:42:35 W/TestDevice: Feature: feature:com.google.android.tv.hardware.secondary_playback_720p60 is not available on SKBFXYWR0LWD
05-06 10:42:35 D/RunUtil: Running command [adb, -s, SKBFXYWR0LWD, shell, pm, list, features] with timeout: 2m 0s
05-06 10:42:35 W/TestDevice: Feature: feature:com.google.android.tv.hardware.secondary_playback_720p30 is not available on SKBFXYWR0LWD
05-06 10:42:35 D/RunUtil: Running command [adb, -s, SKBFXYWR0LWD, shell, pm, list, features] with timeout: 2m 0s
05-06 10:42:35 W/TestDevice: Feature: feature:com.google.android.tv.hardware.secondary_playback_540p60 is not available on SKBFXYWR0LWD
05-06 10:42:35 D/RunUtil: Running command [adb, -s, SKBFXYWR0LWD, shell, pm, list, features] with timeout: 2m 0s
05-06 10:42:35 W/TestDevice: Feature: feature:com.google.android.tv.hardware.secondary_playback_540p30 is not available on SKBFXYWR0LWD
05-06 10:42:35 D/RunUtil: Running command [adb, -s, SKBFXYWR0LWD, shell, pm, list, features] with timeout: 2m 0s
05-06 10:42:35 W/TestDevice: Feature: feature:com.google.android.tv.hardware.secondary_playback_480p60 is not available on SKBFXYWR0LWD
05-06 10:42:35 D/RunUtil: Running command [adb, -s, SKBFXYWR0LWD, shell, pm, list, features] with timeout: 2m 0s
05-06 10:42:35 W/TestDevice: Feature: feature:com.google.android.tv.hardware.secondary_playback_480p30 is not available on SKBFXYWR0LWD
05-06 10:42:35 D/com.google.android.tv.concurrent.TvConcurrentPlaybackHostTest: com.google.android.tv.hardware.secondary_playback_ not declared on device
05-06 10:42:35 D/NativeDevice: Using property ro.build.version.sdk=29 from cache.
05-06 10:42:35 W/TvConcurrentPlaybackHostTest: com.google.android.tv.concurrent.TvConcurrentPlaybackHostTest
05-06 10:42:35 D/NativeDevice: Using property ro.build.version.sdk=29 from cache.
05-06 10:42:35 D/NativeDevice: Using property ro.build.version.sdk=29 from cache.
05-06 10:42:35 D/PrettyTestEventLogger: 
==================== com.google.android.tv.concurrent.TvConcurrentPlaybackHostTest#testConcurrentBasicSecondaryPlayback_VP9_AVC ENDED: Wed May 06 10:42:35 KST 2026 ====================
05-06 10:42:35 I/ModuleListener: [21/730] SKBFXYWR0LWD com.google.android.tv.concurrent.TvConcurrentPlaybackHostTest#testConcurrentBasicSecondaryPlayback_VP9_AVC PASSED
05-06 10:42:35 D/NativeDevice: Using property ro.build.version.sdk=29 from cache.
05-06 10:42:35 D/DeviceHostUtils: apiLevel: 29
05-06 10:42:35 D/PrettyTestEventLogger: 
==================== com.google.android.tv.concurrent.TvConcurrentPlaybackHostTest#testConcurrentBasicSecondaryPlayback_HEVC_AVC STARTED: Wed May 06 10:42:35 KST 2026 ====================
05-06 10:42:35 D/ModuleListener: ModuleListener.testStarted(com.google.android.tv.concurrent.TvConcurrentPlaybackHostTest#testConcurrentBasicSecondaryPlayback_HEVC_AVC) on SKBFXYWR0LWD
05-06 10:42:35 D/RunUtil: Running command [adb, -s, SKBFXYWR0LWD, shell, pm, list, features] with timeout: 2m 0s
05-06 10:42:36 W/TestDevice: Feature: feature:com.google.android.tv.hardware.multi_hdr_playback is not available on SKBFXYWR0LWD
05-06 10:42:36 D/NativeDevice: Using property ro.build.version.sdk=29 from cache.
05-06 10:42:36 D/DeviceHostUtils: apiLevel: 29
05-06 10:42:36 D/NativeDevice: Using property ro.build.version.sdk=29 from cache.
05-06 10:42:36 D/NativeDevice: Using property ro.build.version.sdk=29 from cache.
05-06 10:42:36 D/RunUtil: Running command [adb, -s, SKBFXYWR0LWD, shell, pm, list, features] with timeout: 2m 0s
05-06 10:42:36 W/TestDevice: Feature: feature:com.google.android.tv.hardware.secondary_playback_4k60 is not available on SKBFXYWR0LWD
05-06 10:42:36 D/RunUtil: Running command [adb, -s, SKBFXYWR0LWD, shell, pm, list, features] with timeout: 2m 0s
05-06 10:42:36 W/TestDevice: Feature: feature:com.google.android.tv.hardware.secondary_playback_4k30 is not available on SKBFXYWR0LWD
05-06 10:42:36 D/RunUtil: Running command [adb, -s, SKBFXYWR0LWD, shell, pm, list, features] with timeout: 2m 0s
05-06 10:42:36 W/TestDevice: Feature: feature:com.google.android.tv.hardware.secondary_playback_1080p60 is not available on SKBFXYWR0LWD
05-06 10:42:36 D/RunUtil: Running command [adb, -s, SKBFXYWR0LWD, shell, pm, list, features] with timeout: 2m 0s
05-06 10:42:36 W/TestDevice: Feature: feature:com.google.android.tv.hardware.secondary_playback_1080p30 is not available on SKBFXYWR0LWD
05-06 10:42:36 D/RunUtil: Running command [adb, -s, SKBFXYWR0LWD, shell, pm, list, features] with timeout: 2m 0s
05-06 10:42:36 W/TestDevice: Feature: feature:com.google.android.tv.hardware.secondary_playback_720p60 is not available on SKBFXYWR0LWD
05-06 10:42:36 D/RunUtil: Running command [adb, -s, SKBFXYWR0LWD, shell, pm, list, features] with timeout: 2m 0s
05-06 10:42:36 W/TestDevice: Feature: feature:com.google.android.tv.hardware.secondary_playback_720p30 is not available on SKBFXYWR0LWD
05-06 10:42:36 D/RunUtil: Running command [adb, -s, SKBFXYWR0LWD, shell, pm, list, features] with timeout: 2m 0s
05-06 10:42:36 W/TestDevice: Feature: feature:com.google.android.tv.hardware.secondary_playback_540p60 is not available on SKBFXYWR0LWD
05-06 10:42:36 D/RunUtil: Running command [adb, -s, SKBFXYWR0LWD, shell, pm, list, features] with timeout: 2m 0s
05-06 10:42:36 W/TestDevice: Feature: feature:com.google.android.tv.hardware.secondary_playback_540p30 is not available on SKBFXYWR0LWD
05-06 10:42:36 D/RunUtil: Running command [adb, -s, SKBFXYWR0LWD, shell, pm, list, features] with timeout: 2m 0s
05-06 10:42:36 W/TestDevice: Feature: feature:com.google.android.tv.hardware.secondary_playback_480p60 is not available on SKBFXYWR0LWD
05-06 10:42:36 D/RunUtil: Running command [adb, -s, SKBFXYWR0LWD, shell, pm, list, features] with timeout: 2m 0s
05-06 10:42:37 W/TestDevice: Feature: feature:com.google.android.tv.hardware.secondary_playback_480p30 is not available on SKBFXYWR0LWD
05-06 10:42:37 D/com.google.android.tv.concurrent.TvConcurrentPlaybackHostTest: com.google.android.tv.hardware.secondary_playback_ not declared on device
05-06 10:42:37 D/NativeDevice: Using property ro.build.version.sdk=29 from cache.
05-06 10:42:37 W/TvConcurrentPlaybackHostTest: com.google.android.tv.concurrent.TvConcurrentPlaybackHostTest
05-06 10:42:37 D/NativeDevice: Using property ro.build.version.sdk=29 from cache.
05-06 10:42:37 D/NativeDevice: Using property ro.build.version.sdk=29 from cache.
05-06 10:42:37 D/PrettyTestEventLogger: 
==================== com.google.android.tv.concurrent.TvConcurrentPlaybackHostTest#testConcurrentBasicSecondaryPlayback_HEVC_AVC ENDED: Wed May 06 10:42:37 KST 2026 ====================
05-06 10:42:37 I/ModuleListener: [22/730] SKBFXYWR0LWD com.google.android.tv.concurrent.TvConcurrentPlaybackHostTest#testConcurrentBasicSecondaryPlayback_HEVC_AVC PASSED
05-06 10:42:37 D/RunUtil: Running command [adb, -s, SKBFXYWR0LWD, shell, pm, list, features] with timeout: 2m 0s
05-06 10:42:37 W/TestDevice: Feature: feature:com.google.android.tv.hardware.tunnel_secondary_playback_4k60 is not available on SKBFXYWR0LWD
05-06 10:42:37 D/RunUtil: Running command [adb, -s, SKBFXYWR0LWD, shell, pm, list, features] with timeout: 2m 0s
05-06 10:42:37 W/TestDevice: Feature: feature:com.google.android.tv.hardware.tunnel_secondary_playback_4k30 is not available on SKBFXYWR0LWD
05-06 10:42:37 D/RunUtil: Running command [adb, -s, SKBFXYWR0LWD, shell, pm, list, features] with timeout: 2m 0s
05-06 10:42:37 W/TestDevice: Feature: feature:com.google.android.tv.hardware.tunnel_secondary_playback_1080p60 is not available on SKBFXYWR0LWD
05-06 10:42:37 D/RunUtil: Running command [adb, -s, SKBFXYWR0LWD, shell, pm, list, features] with timeout: 2m 0s
05-06 10:42:37 W/TestDevice: Feature: feature:com.google.android.tv.hardware.tunnel_secondary_playback_1080p30 is not available on SKBFXYWR0LWD
05-06 10:42:37 D/RunUtil: Running command [adb, -s, SKBFXYWR0LWD, shell, pm, list, features] with timeout: 2m 0s
05-06 10:42:37 W/TestDevice: Feature: feature:com.google.android.tv.hardware.tunnel_secondary_playback_720p60 is not available on SKBFXYWR0LWD
05-06 10:42:37 D/RunUtil: Running command [adb, -s, SKBFXYWR0LWD, shell, pm, list, features] with timeout: 2m 0s
05-06 10:42:37 W/TestDevice: Feature: feature:com.google.android.tv.hardware.tunnel_secondary_playback_720p30 is not available on SKBFXYWR0LWD
05-06 10:42:37 D/RunUtil: Running command [adb, -s, SKBFXYWR0LWD, shell, pm, list, features] with timeout: 2m 0s
05-06 10:42:37 W/TestDevice: Feature: feature:com.google.android.tv.hardware.tunnel_secondary_playback_540p60 is not available on SKBFXYWR0LWD
05-06 10:42:37 D/RunUtil: Running command [adb, -s, SKBFXYWR0LWD, shell, pm, list, features] with timeout: 2m 0s
05-06 10:42:37 W/TestDevice: Feature: feature:com.google.android.tv.hardware.tunnel_secondary_playback_540p30 is not available on SKBFXYWR0LWD
05-06 10:42:37 D/RunUtil: Running command [adb, -s, SKBFXYWR0LWD, shell, pm, list, features] with timeout: 2m 0s
05-06 10:42:37 W/TestDevice: Feature: feature:com.google.android.tv.hardware.tunnel_secondary_playback_480p60 is not available on SKBFXYWR0LWD
05-06 10:42:37 D/RunUtil: Running command [adb, -s, SKBFXYWR0LWD, shell, pm, list, features] with timeout: 2m 0s
05-06 10:42:37 W/TestDevice: Feature: feature:com.google.android.tv.hardware.tunnel_secondary_playback_480p30 is not available on SKBFXYWR0LWD
05-06 10:42:37 D/com.google.android.tv.concurrent.TvConcurrentPlaybackHostTest: com.google.android.tv.hardware.tunnel_secondary_playback_ not declared on device
05-06 10:42:37 D/PrettyTestEventLogger: 
==================== com.google.android.tv.concurrent.TvConcurrentPlaybackHostTest#testConcurrentSecondaryTunnelPlayback STARTED: Wed May 06 10:42:37 KST 2026 ====================
05-06 10:42:37 D/ModuleListener: ModuleListener.testStarted(com.google.android.tv.concurrent.TvConcurrentPlaybackHostTest#testConcurrentSecondaryTunnelPlayback) on SKBFXYWR0LWD
05-06 10:42:37 D/PrettyTestEventLogger: 
==================== com.google.android.tv.concurrent.TvConcurrentPlaybackHostTest#testConcurrentSecondaryTunnelPlayback ENDED: Wed May 06 10:42:37 KST 2026 ====================
05-06 10:42:37 I/ModuleListener: [23/730] SKBFXYWR0LWD com.google.android.tv.concurrent.TvConcurrentPlaybackHostTest#testConcurrentSecondaryTunnelPlayback ASSUMPTION_FAILURE: org.junit.AssumptionViolatedException: Missing capability for: com.google.android.tv.hardware.tunnel_secondary_playback_
	at com.google.android.tv.concurrent.TvConcurrentRunner.runChild(TvConcurrentRunner.java:64)
	at com.google.android.tv.concurrent.TvConcurrentRunner.runChild(TvConcurrentRunner.java:46)
	at org.junit.runners.ParentRunner$4.run(ParentRunner.java:331)
	at org.junit.runners.ParentRunner$1.schedule(ParentRunner.java:79)
	at org.junit.runners.ParentRunner.runChildren(ParentRunner.java:329)
	at org.junit.runners.ParentRunner$2.evaluate(ParentRunner.java:293)
	at org.junit.runners.ParentRunner$3.evaluate(ParentRunner.java:306)
	at org.junit.runners.ParentRunner.run(ParentRunner.java:413)
	at com.android.tradefed.testtype.junit4.ExceptionThrowingRunnerWrapper.run(ExceptionThrowingRunnerWrapper.java:43)
	at org.junit.runner.JUnitCore.run(JUnitCore.java:137)
	at com.android.tradefed.testtype.HostTest.runJUnit4Tests(HostTest.java:780)
	at com.android.tradefed.testtype.HostTest.runTestClasses(HostTest.java:660)
	at com.android.tradefed.testtype.HostTest.run(HostTest.java:608)
	at com.android.tradefed.testtype.suite.GranularRetriableTestWrapper.intraModuleRun(GranularRetriableTestWrapper.java:464)
	at com.android.tradefed.testtype.suite.GranularRetriableTestWrapper.run(GranularRetriableTestWrapper.java:353)
	at com.android.tradefed.testtype.suite.ModuleDefinition.run(ModuleDefinition.java:701)
	at com.android.tradefed.testtype.suite.ITestSuite.runSingleModule(ITestSuite.java:1522)
	at com.android.tradefed.testtype.suite.ITestSuite.run(ITestSuite.java:1130)
	at com.android.tradefed.invoker.InvocationExecution.runTest(InvocationExecution.java:1561)
	at com.android.tradefed.invoker.InvocationExecution.runTests(InvocationExecution.java:1324)
	at com.android.tradefed.invoker.TestInvocation.prepareAndRun(TestInvocation.java:696)
	at com.android.tradefed.invoker.TestInvocation.performInvocation(TestInvocation.java:310)
	at com.android.tradefed.invoker.TestInvocation.invoke(TestInvocation.java:1558)
	at com.android.tradefed.command.CommandScheduler$InvocationThread.run(CommandScheduler.java:723)

05-06 10:42:37 D/RunUtil: Running command [adb, -s, SKBFXYWR0LWD, shell, pm, list, features] with timeout: 2m 0s
05-06 10:42:37 W/TestDevice: Feature: feature:com.google.android.tv.hardware.picture_in_picture is not available on SKBFXYWR0LWD
05-06 10:42:37 D/PrettyTestEventLogger: 
==================== com.google.android.tv.concurrent.TvConcurrentPlaybackHostTest#testConcurrentDualTunnelPlaybackPip STARTED: Wed May 06 10:42:37 KST 2026 ====================
05-06 10:42:37 D/ModuleListener: ModuleListener.testStarted(com.google.android.tv.concurrent.TvConcurrentPlaybackHostTest#testConcurrentDualTunnelPlaybackPip) on SKBFXYWR0LWD
05-06 10:42:37 D/PrettyTestEventLogger: 
==================== com.google.android.tv.concurrent.TvConcurrentPlaybackHostTest#testConcurrentDualTunnelPlaybackPip ENDED: Wed May 06 10:42:37 KST 2026 ====================
05-06 10:42:37 I/ModuleListener: [24/730] SKBFXYWR0LWD com.google.android.tv.concurrent.TvConcurrentPlaybackHostTest#testConcurrentDualTunnelPlaybackPip ASSUMPTION_FAILURE: org.junit.AssumptionViolatedException: Missing feature: com.google.android.tv.hardware.picture_in_picture
	at com.google.android.tv.concurrent.TvConcurrentRunner.runChild(TvConcurrentRunner.java:64)
	at com.google.android.tv.concurrent.TvConcurrentRunner.runChild(TvConcurrentRunner.java:46)
	at org.junit.runners.ParentRunner$4.run(ParentRunner.java:331)
	at org.junit.runners.ParentRunner$1.schedule(ParentRunner.java:79)
	at org.junit.runners.ParentRunner.runChildren(ParentRunner.java:329)
	at org.junit.runners.ParentRunner$2.evaluate(ParentRunner.java:293)
	at org.junit.runners.ParentRunner$3.evaluate(ParentRunner.java:306)
	at org.junit.runners.ParentRunner.run(ParentRunner.java:413)
	at com.android.tradefed.testtype.junit4.ExceptionThrowingRunnerWrapper.run(ExceptionThrowingRunnerWrapper.java:43)
	at org.junit.runner.JUnitCore.run(JUnitCore.java:137)
	at com.android.tradefed.testtype.HostTest.runJUnit4Tests(HostTest.java:780)
	at com.android.tradefed.testtype.HostTest.runTestClasses(HostTest.java:660)
	at com.android.tradefed.testtype.HostTest.run(HostTest.java:608)
	at com.android.tradefed.testtype.suite.GranularRetriableTestWrapper.intraModuleRun(GranularRetriableTestWrapper.java:464)
	at com.android.tradefed.testtype.suite.GranularRetriableTestWrapper.run(GranularRetriableTestWrapper.java:353)
	at com.android.tradefed.testtype.suite.ModuleDefinition.run(ModuleDefinition.java:701)
	at com.android.tradefed.testtype.suite.ITestSuite.runSingleModule(ITestSuite.java:1522)
	at com.android.tradefed.testtype.suite.ITestSuite.run(ITestSuite.java:1130)
	at com.android.tradefed.invoker.InvocationExecution.runTest(InvocationExecution.java:1561)
	at com.android.tradefed.invoker.InvocationExecution.runTests(InvocationExecution.java:1324)
	at com.android.tradefed.invoker.TestInvocation.prepareAndRun(TestInvocation.java:696)
	at com.android.tradefed.invoker.TestInvocation.performInvocation(TestInvocation.java:310)
	at com.android.tradefed.invoker.TestInvocation.invoke(TestInvocation.java:1558)
	at com.android.tradefed.command.CommandScheduler$InvocationThread.run(CommandScheduler.java:723)

05-06 10:42:37 D/RunUtil: Running command [adb, -s, SKBFXYWR0LWD, shell, pm, list, features] with timeout: 2m 0s
05-06 10:42:37 W/TestDevice: Feature: feature:com.google.android.tv.hardware.picture_in_picture is not available on SKBFXYWR0LWD
05-06 10:42:37 D/PrettyTestEventLogger: 
==================== com.google.android.tv.concurrent.TvConcurrentPlaybackHostTest#testConcurrentBasicSecondaryTunnelPlaybackPip STARTED: Wed May 06 10:42:37 KST 2026 ====================
05-06 10:42:38 D/ModuleListener: ModuleListener.testStarted(com.google.android.tv.concurrent.TvConcurrentPlaybackHostTest#testConcurrentBasicSecondaryTunnelPlaybackPip) on SKBFXYWR0LWD
05-06 10:42:38 D/PrettyTestEventLogger: 
==================== com.google.android.tv.concurrent.TvConcurrentPlaybackHostTest#testConcurrentBasicSecondaryTunnelPlaybackPip ENDED: Wed May 06 10:42:38 KST 2026 ====================
05-06 10:42:38 I/ModuleListener: [25/730] SKBFXYWR0LWD com.google.android.tv.concurrent.TvConcurrentPlaybackHostTest#testConcurrentBasicSecondaryTunnelPlaybackPip ASSUMPTION_FAILURE: org.junit.AssumptionViolatedException: Missing feature: com.google.android.tv.hardware.picture_in_picture
	at com.google.android.tv.concurrent.TvConcurrentRunner.runChild(TvConcurrentRunner.java:64)
	at com.google.android.tv.concurrent.TvConcurrentRunner.runChild(TvConcurrentRunner.java:46)
	at org.junit.runners.ParentRunner$4.run(ParentRunner.java:331)
	at org.junit.runners.ParentRunner$1.schedule(ParentRunner.java:79)
	at org.junit.runners.ParentRunner.runChildren(ParentRunner.java:329)
	at org.junit.runners.ParentRunner$2.evaluate(ParentRunner.java:293)
	at org.junit.runners.ParentRunner$3.evaluate(ParentRunner.java:306)
	at org.junit.runners.ParentRunner.run(ParentRunner.java:413)
	at com.android.tradefed.testtype.junit4.ExceptionThrowingRunnerWrapper.run(ExceptionThrowingRunnerWrapper.java:43)
	at org.junit.runner.JUnitCore.run(JUnitCore.java:137)
	at com.android.tradefed.testtype.HostTest.runJUnit4Tests(HostTest.java:780)
	at com.android.tradefed.testtype.HostTest.runTestClasses(HostTest.java:660)
	at com.android.tradefed.testtype.HostTest.run(HostTest.java:608)
	at com.android.tradefed.testtype.suite.GranularRetriableTestWrapper.intraModuleRun(GranularRetriableTestWrapper.java:464)
	at com.android.tradefed.testtype.suite.GranularRetriableTestWrapper.run(GranularRetriableTestWrapper.java:353)
	at com.android.tradefed.testtype.suite.ModuleDefinition.run(ModuleDefinition.java:701)
	at com.android.tradefed.testtype.suite.ITestSuite.runSingleModule(ITestSuite.java:1522)
	at com.android.tradefed.testtype.suite.ITestSuite.run(ITestSuite.java:1130)
	at com.android.tradefed.invoker.InvocationExecution.runTest(InvocationExecution.java:1561)
	at com.android.tradefed.invoker.InvocationExecution.runTests(InvocationExecution.java:1324)
	at com.android.tradefed.invoker.TestInvocation.prepareAndRun(TestInvocation.java:696)
	at com.android.tradefed.invoker.TestInvocation.performInvocation(TestInvocation.java:310)
	at com.android.tradefed.invoker.TestInvocation.invoke(TestInvocation.java:1558)
	at com.android.tradefed.command.CommandScheduler$InvocationThread.run(CommandScheduler.java:723)

05-06 10:42:38 D/RunUtil: Running command [adb, -s, SKBFXYWR0LWD, shell, pm, list, features] with timeout: 2m 0s
05-06 10:42:38 W/TestDevice: Feature: feature:com.google.android.tv.hardware.picture_in_picture is not available on SKBFXYWR0LWD
05-06 10:42:38 D/PrettyTestEventLogger: 
==================== com.google.android.tv.concurrent.TvConcurrentPlaybackHostTest#testConcurrentBasicSecondaryPlaybackPip STARTED: Wed May 06 10:42:38 KST 2026 ====================
05-06 10:42:38 D/ModuleListener: ModuleListener.testStarted(com.google.android.tv.concurrent.TvConcurrentPlaybackHostTest#testConcurrentBasicSecondaryPlaybackPip) on SKBFXYWR0LWD
05-06 10:42:38 D/PrettyTestEventLogger: 
==================== com.google.android.tv.concurrent.TvConcurrentPlaybackHostTest#testConcurrentBasicSecondaryPlaybackPip ENDED: Wed May 06 10:42:38 KST 2026 ====================
05-06 10:42:38 I/ModuleListener: [26/730] SKBFXYWR0LWD com.google.android.tv.concurrent.TvConcurrentPlaybackHostTest#testConcurrentBasicSecondaryPlaybackPip ASSUMPTION_FAILURE: org.junit.AssumptionViolatedException: Missing feature: com.google.android.tv.hardware.picture_in_picture
	at com.google.android.tv.concurrent.TvConcurrentRunner.runChild(TvConcurrentRunner.java:64)
	at com.google.android.tv.concurrent.TvConcurrentRunner.runChild(TvConcurrentRunner.java:46)
	at org.junit.runners.ParentRunner$4.run(ParentRunner.java:331)
	at org.junit.runners.ParentRunner$1.schedule(ParentRunner.java:79)
	at org.junit.runners.ParentRunner.runChildren(ParentRunner.java:329)
	at org.junit.runners.ParentRunner$2.evaluate(ParentRunner.java:293)
	at org.junit.runners.ParentRunner$3.evaluate(ParentRunner.java:306)
	at org.junit.runners.ParentRunner.run(ParentRunner.java:413)
	at com.android.tradefed.testtype.junit4.ExceptionThrowingRunnerWrapper.run(ExceptionThrowingRunnerWrapper.java:43)
	at org.junit.runner.JUnitCore.run(JUnitCore.java:137)
	at com.android.tradefed.testtype.HostTest.runJUnit4Tests(HostTest.java:780)
	at com.android.tradefed.testtype.HostTest.runTestClasses(HostTest.java:660)
	at com.android.tradefed.testtype.HostTest.run(HostTest.java:608)
	at com.android.tradefed.testtype.suite.GranularRetriableTestWrapper.intraModuleRun(GranularRetriableTestWrapper.java:464)
	at com.android.tradefed.testtype.suite.GranularRetriableTestWrapper.run(GranularRetriableTestWrapper.java:353)
	at com.android.tradefed.testtype.suite.ModuleDefinition.run(ModuleDefinition.java:701)
	at com.android.tradefed.testtype.suite.ITestSuite.runSingleModule(ITestSuite.java:1522)
	at com.android.tradefed.testtype.suite.ITestSuite.run(ITestSuite.java:1130)
	at com.android.tradefed.invoker.InvocationExecution.runTest(InvocationExecution.java:1561)
	at com.android.tradefed.invoker.InvocationExecution.runTests(InvocationExecution.java:1324)
	at com.android.tradefed.invoker.TestInvocation.prepareAndRun(TestInvocation.java:696)
	at com.android.tradefed.invoker.TestInvocation.performInvocation(TestInvocation.java:310)
	at com.android.tradefed.invoker.TestInvocation.invoke(TestInvocation.java:1558)
	at com.android.tradefed.command.CommandScheduler$InvocationThread.run(CommandScheduler.java:723)

05-06 10:42:38 D/RunUtil: Running command [adb, -s, SKBFXYWR0LWD, shell, pm, list, features] with timeout: 2m 0s
05-06 10:42:38 W/TestDevice: Feature: feature:com.google.android.tv.hardware.picture_in_picture is not available on SKBFXYWR0LWD
05-06 10:42:38 D/PrettyTestEventLogger: 
==================== com.google.android.tv.concurrent.TvConcurrentPlaybackHostTest#testConcurrentDualPlaybackPip STARTED: Wed May 06 10:42:38 KST 2026 ====================
05-06 10:42:38 D/ModuleListener: ModuleListener.testStarted(com.google.android.tv.concurrent.TvConcurrentPlaybackHostTest#testConcurrentDualPlaybackPip) on SKBFXYWR0LWD
05-06 10:42:38 D/PrettyTestEventLogger: 
==================== com.google.android.tv.concurrent.TvConcurrentPlaybackHostTest#testConcurrentDualPlaybackPip ENDED: Wed May 06 10:42:38 KST 2026 ====================
05-06 10:42:38 I/ModuleListener: [27/730] SKBFXYWR0LWD com.google.android.tv.concurrent.TvConcurrentPlaybackHostTest#testConcurrentDualPlaybackPip ASSUMPTION_FAILURE: org.junit.AssumptionViolatedException: Missing feature: com.google.android.tv.hardware.picture_in_picture
	at com.google.android.tv.concurrent.TvConcurrentRunner.runChild(TvConcurrentRunner.java:64)
	at com.google.android.tv.concurrent.TvConcurrentRunner.runChild(TvConcurrentRunner.java:46)
	at org.junit.runners.ParentRunner$4.run(ParentRunner.java:331)
	at org.junit.runners.ParentRunner$1.schedule(ParentRunner.java:79)
	at org.junit.runners.ParentRunner.runChildren(ParentRunner.java:329)
	at org.junit.runners.ParentRunner$2.evaluate(ParentRunner.java:293)
	at org.junit.runners.ParentRunner$3.evaluate(ParentRunner.java:306)
	at org.junit.runners.ParentRunner.run(ParentRunner.java:413)
	at com.android.tradefed.testtype.junit4.ExceptionThrowingRunnerWrapper.run(ExceptionThrowingRunnerWrapper.java:43)
	at org.junit.runner.JUnitCore.run(JUnitCore.java:137)
	at com.android.tradefed.testtype.HostTest.runJUnit4Tests(HostTest.java:780)
	at com.android.tradefed.testtype.HostTest.runTestClasses(HostTest.java:660)
	at com.android.tradefed.testtype.HostTest.run(HostTest.java:608)
	at com.android.tradefed.testtype.suite.GranularRetriableTestWrapper.intraModuleRun(GranularRetriableTestWrapper.java:464)
	at com.android.tradefed.testtype.suite.GranularRetriableTestWrapper.run(GranularRetriableTestWrapper.java:353)
	at com.android.tradefed.testtype.suite.ModuleDefinition.run(ModuleDefinition.java:701)
	at com.android.tradefed.testtype.suite.ITestSuite.runSingleModule(ITestSuite.java:1522)
	at com.android.tradefed.testtype.suite.ITestSuite.run(ITestSuite.java:1130)
	at com.android.tradefed.invoker.InvocationExecution.runTest(InvocationExecution.java:1561)
	at com.android.tradefed.invoker.InvocationExecution.runTests(InvocationExecution.java:1324)
	at com.android.tradefed.invoker.TestInvocation.prepareAndRun(TestInvocation.java:696)
	at com.android.tradefed.invoker.TestInvocation.performInvocation(TestInvocation.java:310)
	at com.android.tradefed.invoker.TestInvocation.invoke(TestInvocation.java:1558)
	at com.android.tradefed.command.CommandScheduler$InvocationThread.run(CommandScheduler.java:723)

05-06 10:42:38 D/PrettyTestEventLogger: 
==================== RUN ENDED: Wed May 06 10:42:38 KST 2026 ====================
05-06 10:42:38 D/ModuleListener: ModuleListener.testRunEnded(89739) on SKBFXYWR0LWD
05-06 10:42:38 D/RunUtil: Running command [adb, -s, SKBFXYWR0LWD, uninstall, android.tvconcurrent.tvts] with timeout: 2m 0s
05-06 10:42:38 D/NativeDevice: Using property ro.build.version.sdk=29 from cache.
05-06 10:42:39 I/NativeDeviceStateMonitor: Device SKBFXYWR0LWD is already ONLINE
05-06 10:42:39 I/NativeDeviceStateMonitor: Waiting 360000 ms for device SKBFXYWR0LWD boot complete
05-06 10:42:39 D/RunUtil: Running command [adb, -s, SKBFXYWR0LWD, shell, getprop dev.bootcomplete] without timeout.
05-06 10:42:39 I/DeviceStateMonitor: Waiting 359938 ms for device SKBFXYWR0LWD package manager
05-06 10:42:39 D/RunUtil: Running command [adb, -s, SKBFXYWR0LWD, shell, pm path android] without timeout.
05-06 10:42:39 I/NativeDeviceStateMonitor: Waiting 359870 ms for device SKBFXYWR0LWD external store
05-06 10:42:39 D/RunUtil: Running command [adb, -s, SKBFXYWR0LWD, shell, stat -f -c "%t" /sdcard] without timeout.
05-06 10:42:39 D/RunUtil: Running command [adb, -s, SKBFXYWR0LWD, shell, echo 'number 1778031759211 one' > '/sdcard/1778031759211'] without timeout.
05-06 10:42:39 D/RunUtil: Running command [adb, -s, SKBFXYWR0LWD, shell, cat '/sdcard/1778031759211'] without timeout.
05-06 10:42:39 D/RunUtil: Running command [adb, -s, SKBFXYWR0LWD, shell, rm '/sdcard/1778031759211'] without timeout.
05-06 10:42:39 I/ConsoleReporter: [SKBFXYWR0LWD] Starting armeabi-v7a TvConcurrentMediaPlaybackHostTestCases with 730 tests
05-06 10:42:39 I/ConsoleReporter: [1/730 armeabi-v7a TvConcurrentMediaPlaybackHostTestCases SKBFXYWR0LWD] com.google.android.tv.concurrent.TvConcurrentPlaybackHostTest#testConcurrentQuadTunnelPlaybackPip assumption failure
05-06 10:42:39 I/ConsoleReporter: [2/730 armeabi-v7a TvConcurrentMediaPlaybackHostTestCases SKBFXYWR0LWD] com.google.android.tv.concurrent.TvConcurrentPlaybackHostTest#testConcurrentSecondaryTunnelPlaybackPip assumption failure
05-06 10:42:39 I/ConsoleReporter: [3/730 armeabi-v7a TvConcurrentMediaPlaybackHostTestCases SKBFXYWR0LWD] com.google.android.tv.concurrent.TvConcurrentPlaybackHostTest#testConcurrentQuadPlayback assumption failure
05-06 10:42:39 I/ConsoleReporter: [4/730 armeabi-v7a TvConcurrentMediaPlaybackHostTestCases SKBFXYWR0LWD] com.google.android.tv.concurrent.TvConcurrentPlaybackHostTest#testConcurrentSecondaryPlayback assumption failure
05-06 10:42:39 I/ConsoleReporter: [5/730 armeabi-v7a TvConcurrentMediaPlaybackHostTestCases SKBFXYWR0LWD] com.google.android.tv.concurrent.TvConcurrentPlaybackHostTest#testConcurrentBasicSecondaryTunnelPlayback assumption failure
05-06 10:42:39 I/ConsoleReporter: [6/730 armeabi-v7a TvConcurrentMediaPlaybackHostTestCases SKBFXYWR0LWD] com.google.android.tv.concurrent.TvConcurrentPlaybackHostTest#testConcurrentQuadPlaybackPip assumption failure
05-06 10:42:39 I/ConsoleReporter: [7/730 armeabi-v7a TvConcurrentMediaPlaybackHostTestCases SKBFXYWR0LWD] com.google.android.tv.concurrent.TvConcurrentPlaybackHostTest#testConcurrentDualTunnelPlayback assumption failure
05-06 10:42:39 I/ConsoleReporter: [8/730 armeabi-v7a TvConcurrentMediaPlaybackHostTestCases SKBFXYWR0LWD] com.google.android.tv.concurrent.TvConcurrentPlaybackHostTest#testConcurrentSecondaryPlaybackPip assumption failure
05-06 10:42:39 I/ConsoleReporter: [9/730 armeabi-v7a TvConcurrentMediaPlaybackHostTestCases SKBFXYWR0LWD] com.google.android.tv.concurrent.TvConcurrentPlaybackHostTest#testConcurrentDualPlayback assumption failure
05-06 10:42:39 I/ConsoleReporter: [10/730 armeabi-v7a TvConcurrentMediaPlaybackHostTestCases SKBFXYWR0LWD] com.google.android.tv.concurrent.TvConcurrentPlaybackHostTest#testConcurrentQuadTunnelPlayback assumption failure
05-06 10:42:39 I/ConsoleReporter: [11/730 armeabi-v7a TvConcurrentMediaPlaybackHostTestCases SKBFXYWR0LWD] com.google.android.tv.concurrent.TvConcurrentPlaybackHostTest#testConcurrentBasicSecondaryPlayback_AV1_AVC pass
05-06 10:42:39 I/ConsoleReporter: [12/730 armeabi-v7a TvConcurrentMediaPlaybackHostTestCases SKBFXYWR0LWD] com.google.android.tv.concurrent.TvConcurrentPlaybackHostTest#testConcurrentBasicSecondaryPlayback_AVC_AVC pass
05-06 10:42:39 I/ConsoleReporter: [13/730 armeabi-v7a TvConcurrentMediaPlaybackHostTestCases SKBFXYWR0LWD] com.google.android.tv.concurrent.TvConcurrentPlaybackHostTest#testConcurrentBasicSecondaryPlayback_VP9_AVC pass
05-06 10:42:39 I/ConsoleReporter: [14/730 armeabi-v7a TvConcurrentMediaPlaybackHostTestCases SKBFXYWR0LWD] com.google.android.tv.concurrent.TvConcurrentPlaybackHostTest#testConcurrentBasicSecondaryPlayback_HEVC_AVC pass
05-06 10:42:39 I/ConsoleReporter: [15/730 armeabi-v7a TvConcurrentMediaPlaybackHostTestCases SKBFXYWR0LWD] com.google.android.tv.concurrent.TvConcurrentPlaybackHostTest#testConcurrentBasicSecondaryPlayback_AV1_AVC_L3 pass
05-06 10:42:39 I/ConsoleReporter: [16/730 armeabi-v7a TvConcurrentMediaPlaybackHostTestCases SKBFXYWR0LWD] com.google.android.tv.concurrent.TvConcurrentPlaybackHostTest#testConcurrentBasicSecondaryPlayback_AVC_AVC_L3 pass
05-06 10:42:39 I/ConsoleReporter: [17/730 armeabi-v7a TvConcurrentMediaPlaybackHostTestCases SKBFXYWR0LWD] com.google.android.tv.concurrent.TvConcurrentPlaybackHostTest#testConcurrentBasicSecondaryPlayback_VP9_AVC_L3 pass
05-06 10:42:39 I/ConsoleReporter: [18/730 armeabi-v7a TvConcurrentMediaPlaybackHostTestCases SKBFXYWR0LWD] com.google.android.tv.concurrent.TvConcurrentPlaybackHostTest#testConcurrentBasicSecondaryPlayback_HEVC_AVC_L3 pass
05-06 10:42:39 I/ConsoleReporter: [19/730 armeabi-v7a TvConcurrentMediaPlaybackHostTestCases SKBFXYWR0LWD] com.google.android.tv.concurrent.TvConcurrentPlaybackHostTest#testConcurrentSecondaryTunnelPlayback assumption failure
05-06 10:42:39 I/ConsoleReporter: [20/730 armeabi-v7a TvConcurrentMediaPlaybackHostTestCases SKBFXYWR0LWD] com.google.android.tv.concurrent.TvConcurrentPlaybackHostTest#testConcurrentDualTunnelPlaybackPip assumption failure
05-06 10:42:39 I/ConsoleReporter: [21/730 armeabi-v7a TvConcurrentMediaPlaybackHostTestCases SKBFXYWR0LWD] com.google.android.tv.concurrent.TvConcurrentPlaybackHostTest#testConcurrentBasicSecondaryTunnelPlaybackPip assumption failure
05-06 10:42:39 I/ConsoleReporter: [22/730 armeabi-v7a TvConcurrentMediaPlaybackHostTestCases SKBFXYWR0LWD] com.google.android.tv.concurrent.TvConcurrentPlaybackHostTest#testConcurrentBasicSecondaryPlaybackPip assumption failure
05-06 10:42:39 I/ConsoleReporter: [23/730 armeabi-v7a TvConcurrentMediaPlaybackHostTestCases SKBFXYWR0LWD] com.google.android.tv.concurrent.TvConcurrentPlaybackHostTest#testConcurrentDualPlaybackPip assumption failure
05-06 10:42:39 E/ModuleDefinition: Module armeabi-v7a TvConcurrentMediaPlaybackHostTestCases only ran 23 out of 730 expected tests.
05-06 10:42:39 I/ConsoleReporter: [SKBFXYWR0LWD] Module armeabi-v7a TvConcurrentMediaPlaybackHostTestCases only ran 23 out of 730 expected tests.
05-06 10:42:39 I/ConsoleReporter: [SKBFXYWR0LWD] armeabi-v7a TvConcurrentMediaPlaybackHostTestCases failed in 1m 31s. 8 passed, 0 failed, 707 not executed
05-06 10:42:39 D/FileUtil: Creating temp file at /home/dev2-google04/android-tvts/android-tvts-2.17r1-arm-15298624/android-tvts/tools/./../../android-tvts/results/2026.05.06_10.40.21/proto with prefix "tmp-proto" suffix ""
05-06 10:42:39 D/PrettyPrintDelimiter: 
=============================
===== TEST PHASE ENDING =====
=============================
05-06 10:42:39 D/LogFileSaver: Log data for device_logcat_test_SKBFXYWR0LWD is already compressed, skipping compression
05-06 10:42:39 D/FileUtil: Creating temp file at /home/dev2-google04/android-tvts/android-tvts-2.17r1-arm-15298624/android-tvts/tools/./../../android-tvts/logs/2026.05.06_10.40.21/inv_12800172045122819424 with prefix "device_logcat_test_SKBFXYWR0LWD_" suffix ".txt"
05-06 10:42:39 I/LogFileSaver: Saved log file /home/dev2-google04/android-tvts/android-tvts-2.17r1-arm-15298624/android-tvts/tools/./../../android-tvts/logs/2026.05.06_10.40.21/inv_12800172045122819424/device_logcat_test_SKBFXYWR0LWD_11580027256000807629.txt. [size=575748, elapsed=3ms]
05-06 10:42:39 D/CertificationSuiteResultReporter: Saved logs for device_logcat_test_SKBFXYWR0LWD in /home/dev2-google04/android-tvts/android-tvts-2.17r1-arm-15298624/android-tvts/tools/./../../android-tvts/logs/2026.05.06_10.40.21/inv_12800172045122819424/device_logcat_test_SKBFXYWR0LWD_11580027256000807629.txt
05-06 10:42:39 D/LogFileSaver: Log data for device_logcat_test_SKBFXYWR0LWD is already compressed, skipping compression
05-06 10:42:39 D/FileUtil: Creating temp file at /tmp/15298624/tvts/inv_4989505209976318543/inv_2312744551929213141 with prefix "device_logcat_test_SKBFXYWR0LWD_" suffix ".txt"
05-06 10:42:39 I/LogFileSaver: Saved log file /tmp/15298624/tvts/inv_4989505209976318543/inv_2312744551929213141/device_logcat_test_SKBFXYWR0LWD_9199695785510140746.txt. [size=575748, elapsed=2ms]
05-06 10:42:39 I/CommandInterrupter: Interrupt blocked
05-06 10:42:39 D/TestInvocation: Testing minimum responsiveness.
05-06 10:42:39 I/NativeDeviceStateMonitor: Device SKBFXYWR0LWD is already ONLINE
05-06 10:42:39 D/RunUtil: Running command [adb, -s, SKBFXYWR0LWD, shell, getprop, ro.build.version.sdk] with timeout: 45s
05-06 10:42:39 D/FileUtil: Creating temp file at /home/dev2-google04/android-tvts/android-tvts-2.17r1-arm-15298624/android-tvts/tools/./../../android-tvts/logs/2026.05.06_10.40.21/inv_12800172045122819424 with prefix "executeShellCommandLog_SKBFXYWR0LWD_" suffix ".txt.gz"
05-06 10:42:39 I/LogFileSaver: Saved gzip log file /home/dev2-google04/android-tvts/android-tvts-2.17r1-arm-15298624/android-tvts/tools/./../../android-tvts/logs/2026.05.06_10.40.21/inv_12800172045122819424/executeShellCommandLog_SKBFXYWR0LWD_350748552826011169.txt.gz. [size=10, elapsed=1ms]
05-06 10:42:39 D/CertificationSuiteResultReporter: Saved logs for executeShellCommandLog_SKBFXYWR0LWD in /home/dev2-google04/android-tvts/android-tvts-2.17r1-arm-15298624/android-tvts/tools/./../../android-tvts/logs/2026.05.06_10.40.21/inv_12800172045122819424/executeShellCommandLog_SKBFXYWR0LWD_350748552826011169.txt.gz
05-06 10:42:39 D/FileUtil: Creating temp file at /tmp/15298624/tvts/inv_4989505209976318543/inv_2312744551929213141 with prefix "executeShellCommandLog_SKBFXYWR0LWD_" suffix ".txt.gz"
05-06 10:42:39 I/LogFileSaver: Saved gzip log file /tmp/15298624/tvts/inv_4989505209976318543/inv_2312744551929213141/executeShellCommandLog_SKBFXYWR0LWD_3795025227927678661.txt.gz. [size=10, elapsed=0ms]
05-06 10:42:39 D/TestInvocation: Checking that devices are online.
05-06 10:42:39 I/NativeDeviceStateMonitor: Device SKBFXYWR0LWD is already ONLINE
05-06 10:42:39 I/NativeDeviceStateMonitor: Waiting 179999 ms for device SKBFXYWR0LWD boot complete
05-06 10:42:39 D/RunUtil: Running command [adb, -s, SKBFXYWR0LWD, shell, getprop dev.bootcomplete] without timeout.
05-06 10:42:39 I/DeviceStateMonitor: Waiting 179965 ms for device SKBFXYWR0LWD package manager
05-06 10:42:39 D/RunUtil: Running command [adb, -s, SKBFXYWR0LWD, shell, pm path android] without timeout.
05-06 10:42:39 I/NativeDeviceStateMonitor: Waiting 179904 ms for device SKBFXYWR0LWD external store
05-06 10:42:39 D/RunUtil: Running command [adb, -s, SKBFXYWR0LWD, shell, echo, $EXTERNAL_STORAGE] with timeout: 2m 0s
05-06 10:42:39 D/RunUtil: Running command [adb, -s, SKBFXYWR0LWD, shell, stat -f -c "%t" /sdcard] without timeout.
05-06 10:42:39 D/RunUtil: Running command [adb, -s, SKBFXYWR0LWD, shell, echo 'number 1778031759597 one' > '/sdcard/1778031759597'] without timeout.
05-06 10:42:39 D/RunUtil: Running command [adb, -s, SKBFXYWR0LWD, shell, cat '/sdcard/1778031759597'] without timeout.
05-06 10:42:39 D/RunUtil: Running command [adb, -s, SKBFXYWR0LWD, shell, rm '/sdcard/1778031759597'] without timeout.
05-06 10:42:39 D/InvocationExecution: starting tearDown 'com.google.android.perfverify.tvts.prep.ApkChecker@5795d909' on device: 'SKBFXYWR0LWD'
05-06 10:42:39 D/InvocationExecution: done with tearDown 'com.google.android.perfverify.tvts.prep.ApkChecker@5795d909' on device: 'SKBFXYWR0LWD' in 0 ms
05-06 10:42:39 D/InvocationExecution: starting tearDown 'com.google.android.perfverify.tvts.prep.ApkChecker@38b814e6' on device: 'SKBFXYWR0LWD'
05-06 10:42:39 D/InvocationExecution: done with tearDown 'com.google.android.perfverify.tvts.prep.ApkChecker@38b814e6' on device: 'SKBFXYWR0LWD' in 0 ms
05-06 10:42:39 D/InvocationExecution: starting tearDown 'com.google.android.perfverify.tvts.prep.ApkChecker@5197cdaa' on device: 'SKBFXYWR0LWD'
05-06 10:42:39 D/InvocationExecution: done with tearDown 'com.google.android.perfverify.tvts.prep.ApkChecker@5197cdaa' on device: 'SKBFXYWR0LWD' in 1 ms
05-06 10:42:39 D/InvocationExecution: starting tearDown 'com.google.android.perfverify.tvts.prep.ApkChecker@54d54fc9' on device: 'SKBFXYWR0LWD'
05-06 10:42:39 D/InvocationExecution: done with tearDown 'com.google.android.perfverify.tvts.prep.ApkChecker@54d54fc9' on device: 'SKBFXYWR0LWD' in 0 ms
05-06 10:42:39 D/InvocationExecution: starting tearDown 'com.google.android.perfverify.tvts.prep.ApkChecker@67010870' on device: 'SKBFXYWR0LWD'
05-06 10:42:39 D/InvocationExecution: done with tearDown 'com.google.android.perfverify.tvts.prep.ApkChecker@67010870' on device: 'SKBFXYWR0LWD' in 0 ms
05-06 10:42:39 D/InvocationExecution: starting tearDown 'com.google.android.perfverify.tvts.prep.ApkChecker@72ddd7b' on device: 'SKBFXYWR0LWD'
05-06 10:42:39 D/InvocationExecution: done with tearDown 'com.google.android.perfverify.tvts.prep.ApkChecker@72ddd7b' on device: 'SKBFXYWR0LWD' in 0 ms
05-06 10:42:39 D/InvocationExecution: starting tearDown 'com.google.android.perfverify.tvts.prep.ApkChecker@723eef26' on device: 'SKBFXYWR0LWD'
05-06 10:42:39 D/InvocationExecution: done with tearDown 'com.google.android.perfverify.tvts.prep.ApkChecker@723eef26' on device: 'SKBFXYWR0LWD' in 0 ms
05-06 10:42:39 D/InvocationExecution: starting tearDown 'com.google.android.perfverify.tvts.prep.ApkChecker@17448475' on device: 'SKBFXYWR0LWD'
05-06 10:42:39 D/InvocationExecution: done with tearDown 'com.google.android.perfverify.tvts.prep.ApkChecker@17448475' on device: 'SKBFXYWR0LWD' in 1 ms
05-06 10:42:39 D/InvocationExecution: starting tearDown 'com.google.android.perfverify.tvts.prep.ApkChecker@794331e7' on device: 'SKBFXYWR0LWD'
05-06 10:42:39 D/InvocationExecution: done with tearDown 'com.google.android.perfverify.tvts.prep.ApkChecker@794331e7' on device: 'SKBFXYWR0LWD' in 0 ms
05-06 10:42:39 D/InvocationExecution: starting tearDown 'com.google.android.perfverify.tvts.prep.ApkChecker@5334ca50' on device: 'SKBFXYWR0LWD'
05-06 10:42:39 D/InvocationExecution: done with tearDown 'com.google.android.perfverify.tvts.prep.ApkChecker@5334ca50' on device: 'SKBFXYWR0LWD' in 0 ms
05-06 10:42:39 D/InvocationExecution: starting tearDown 'com.google.android.perfverify.tvts.prep.ApkChecker@29698edd' on device: 'SKBFXYWR0LWD'
05-06 10:42:39 D/InvocationExecution: done with tearDown 'com.google.android.perfverify.tvts.prep.ApkChecker@29698edd' on device: 'SKBFXYWR0LWD' in 1 ms
05-06 10:42:39 D/InvocationExecution: starting tearDown 'com.google.android.perfverify.tvts.prep.ApkChecker@7e320b79' on device: 'SKBFXYWR0LWD'
05-06 10:42:39 D/InvocationExecution: done with tearDown 'com.google.android.perfverify.tvts.prep.ApkChecker@7e320b79' on device: 'SKBFXYWR0LWD' in 0 ms
05-06 10:42:39 D/InvocationExecution: starting tearDown 'com.google.android.perfverify.tvts.prep.ApkChecker@5cfed46d' on device: 'SKBFXYWR0LWD'
05-06 10:42:39 D/InvocationExecution: done with tearDown 'com.google.android.perfverify.tvts.prep.ApkChecker@5cfed46d' on device: 'SKBFXYWR0LWD' in 0 ms
05-06 10:42:39 D/InvocationExecution: starting tearDown 'com.google.android.perfverify.tvts.TvtsSetupAndTearDown@63bd7bc2' on device: 'SKBFXYWR0LWD'
05-06 10:42:39 D/NativeDevice: Using property ro.build.version.sdk=29 from cache.
05-06 10:42:39 D/NativeDevice: Using 'ls' to check doesFileExist(/storage/emulated/0/Download/failure-screenshots)
05-06 10:42:39 D/RunUtil: Running command [adb, -s, SKBFXYWR0LWD, shell, ls, '/storage/emulated/0/Download/failure-screenshots'] with timeout: 2m 0s
05-06 10:42:39 W/NativeDevice: Adb Shell Command : adb -s SKBFXYWR0LWD shell ls '/storage/emulated/0/Download/failure-screenshots'
05-06 10:42:39 W/NativeDevice: Adb Shell Command exited with status: FAILED
05-06 10:42:39 W/NativeDevice: Adb Shell Command shell stdout:


05-06 10:42:39 W/NativeDevice: Adb Shell Command shell stderr:
ls: /storage/emulated/0/Download/failure-screenshots: No such file or directory


05-06 10:42:39 D/NativeDevice: File /storage/emulated/0/Download/failure-screenshots does not exist.
stdout: 
stderr: ls: /storage/emulated/0/Download/failure-screenshots: No such file or directory

05-06 10:42:39 E/NativeDevice: Device path /storage/emulated/0/Download/failure-screenshots does not exist to be pulled.
05-06 10:42:39 D/NativeDevice: Using 'ls' to check doesFileExist(/data/local/tmp/files)
05-06 10:42:39 D/RunUtil: Running command [adb, -s, SKBFXYWR0LWD, shell, ls, '/data/local/tmp/files'] with timeout: 2m 0s
05-06 10:42:39 D/RunUtil: Running command [adb, -s, SKBFXYWR0LWD, shell, ls, -l, /\/data\/local\/tmp\/files/] with timeout: 2m 0s
05-06 10:42:40 I/NativeDevice: Device path is empty, nothing to do.
05-06 10:42:40 D/NativeDevice: Using property ro.build.version.sdk=29 from cache.
05-06 10:42:40 D/InvocationExecution: done with tearDown 'com.google.android.perfverify.tvts.TvtsSetupAndTearDown@63bd7bc2' on device: 'SKBFXYWR0LWD' in 330 ms
05-06 10:42:40 D/InvocationExecution: starting tearDown 'com.android.tradefed.targetprep.suite.SuiteApkInstaller@7023b5a8' on device: 'SKBFXYWR0LWD'
05-06 10:42:40 D/RunUtil: Running command [adb, -s, SKBFXYWR0LWD, uninstall, com.google.android.resolution.tvts] with timeout: 2m 0s
05-06 10:42:40 D/InvocationExecution: done with tearDown 'com.android.tradefed.targetprep.suite.SuiteApkInstaller@7023b5a8' on device: 'SKBFXYWR0LWD' in 405 ms
05-06 10:42:40 D/InvocationExecution: starting tearDown 'com.android.compatibility.common.tradefed.targetprep.PropertyCheck@523ca434' on device: 'SKBFXYWR0LWD'
05-06 10:42:40 D/InvocationExecution: done with tearDown 'com.android.compatibility.common.tradefed.targetprep.PropertyCheck@523ca434' on device: 'SKBFXYWR0LWD' in 0 ms
05-06 10:42:40 D/InvocationExecution: starting tearDown 'com.android.compatibility.common.tradefed.targetprep.PropertyCheck@78ad3738' on device: 'SKBFXYWR0LWD'
05-06 10:42:40 D/InvocationExecution: done with tearDown 'com.android.compatibility.common.tradefed.targetprep.PropertyCheck@78ad3738' on device: 'SKBFXYWR0LWD' in 0 ms
05-06 10:42:40 D/InvocationExecution: starting tearDown 'com.android.tradefed.targetprep.RunCommandTargetPreparer@74f04553' on device: 'SKBFXYWR0LWD'
05-06 10:42:40 D/InvocationExecution: done with tearDown 'com.android.tradefed.targetprep.RunCommandTargetPreparer@74f04553' on device: 'SKBFXYWR0LWD' in 0 ms
05-06 10:42:40 D/InvocationExecution: starting tearDown 'com.android.compatibility.common.tradefed.targetprep.FilePusher@60196068' on device: 'SKBFXYWR0LWD'
05-06 10:42:40 D/InvocationExecution: done with tearDown 'com.android.compatibility.common.tradefed.targetprep.FilePusher@60196068' on device: 'SKBFXYWR0LWD' in 426 ms
05-06 10:42:40 D/InvocationExecution: starting tearDown 'com.android.tradefed.targetprep.RunCommandTargetPreparer@461e83d4' on device: 'SKBFXYWR0LWD'
05-06 10:42:40 D/InvocationExecution: done with tearDown 'com.android.tradefed.targetprep.RunCommandTargetPreparer@461e83d4' on device: 'SKBFXYWR0LWD' in 0 ms
05-06 10:42:40 D/InvocationExecution: starting tearDown 'com.android.compatibility.common.tradefed.targetprep.ReportLogCollector@3fcafad9' on device: 'SKBFXYWR0LWD'
05-06 10:42:40 D/NativeDevice: Using property ro.build.version.sdk=29 from cache.
05-06 10:42:41 D/NativeDevice: Using 'ls' to check doesFileExist(/storage/emulated/0/report-log-files/)
05-06 10:42:41 D/RunUtil: Running command [adb, -s, SKBFXYWR0LWD, shell, ls, '/storage/emulated/0/report-log-files/'] with timeout: 2m 0s
05-06 10:42:41 W/NativeDevice: Adb Shell Command : adb -s SKBFXYWR0LWD shell ls '/storage/emulated/0/report-log-files/'
05-06 10:42:41 W/NativeDevice: Adb Shell Command exited with status: FAILED
05-06 10:42:41 W/NativeDevice: Adb Shell Command shell stdout:


05-06 10:42:41 W/NativeDevice: Adb Shell Command shell stderr:
ls: /storage/emulated/0/report-log-files/: No such file or directory


05-06 10:42:41 D/NativeDevice: File /storage/emulated/0/report-log-files/ does not exist.
stdout: 
stderr: ls: /storage/emulated/0/report-log-files/: No such file or directory

05-06 10:42:41 E/NativeDevice: Device path /sdcard/report-log-files/ does not exist to be pulled.
05-06 10:42:41 D/InvocationExecution: done with tearDown 'com.android.compatibility.common.tradefed.targetprep.ReportLogCollector@3fcafad9' on device: 'SKBFXYWR0LWD' in 152 ms
05-06 10:42:41 D/InvocationExecution: starting tearDown 'com.google.android.perfverify.tvts.prep.DeviceReliabilityVerifier@1d7034b5' on device: 'SKBFXYWR0LWD'
05-06 10:42:41 D/InvocationExecution: done with tearDown 'com.google.android.perfverify.tvts.prep.DeviceReliabilityVerifier@1d7034b5' on device: 'SKBFXYWR0LWD' in 0 ms
05-06 10:42:41 D/InvocationExecution: starting tearDown 'com.android.compatibility.common.tradefed.targetprep.DeviceInfoCollector@258d0fdc' on device: 'SKBFXYWR0LWD'
05-06 10:42:41 D/InvocationExecution: done with tearDown 'com.android.compatibility.common.tradefed.targetprep.DeviceInfoCollector@258d0fdc' on device: 'SKBFXYWR0LWD' in 2 ms
05-06 10:42:41 D/InvocationExecution: starting tearDown 'com.android.tradefed.targetprep.RunCommandTargetPreparer@691f9ac7' on device: 'SKBFXYWR0LWD'
05-06 10:42:41 D/InvocationExecution: done with tearDown 'com.android.tradefed.targetprep.RunCommandTargetPreparer@691f9ac7' on device: 'SKBFXYWR0LWD' in 0 ms
05-06 10:42:41 D/RunUtil: Running command [adb, -s, SKBFXYWR0LWD, uninstall, android.tradefed.contentprovider] with timeout: 2m 0s
05-06 10:42:41 D/RunUtil: Running command [id, -u, dev2-google04] with timeout: 1m 0s
05-06 10:42:41 D/RunUtil: Running command [tail, -c, 10MB, /tmp/adb.1000.log] with timeout: 1m 0s
05-06 10:42:41 D/LogFileSaver: Log data for host_adb_log is already compressed, skipping compression
05-06 10:42:41 D/FileUtil: Creating temp file at /home/dev2-google04/android-tvts/android-tvts-2.17r1-arm-15298624/android-tvts/tools/./../../android-tvts/logs/2026.05.06_10.40.21/inv_12800172045122819424 with prefix "host_adb_log_" suffix ".txt"
05-06 10:42:41 I/LogFileSaver: Saved log file /home/dev2-google04/android-tvts/android-tvts-2.17r1-arm-15298624/android-tvts/tools/./../../android-tvts/logs/2026.05.06_10.40.21/inv_12800172045122819424/host_adb_log_5523095306274828771.txt. [size=82747, elapsed=1ms]
05-06 10:42:41 D/CertificationSuiteResultReporter: Saved logs for host_adb_log in /home/dev2-google04/android-tvts/android-tvts-2.17r1-arm-15298624/android-tvts/tools/./../../android-tvts/logs/2026.05.06_10.40.21/inv_12800172045122819424/host_adb_log_5523095306274828771.txt
05-06 10:42:41 D/LogFileSaver: Log data for host_adb_log is already compressed, skipping compression
05-06 10:42:41 D/FileUtil: Creating temp file at /tmp/15298624/tvts/inv_4989505209976318543/inv_2312744551929213141 with prefix "host_adb_log_" suffix ".txt"
05-06 10:42:41 I/LogFileSaver: Saved log file /tmp/15298624/tvts/inv_4989505209976318543/inv_2312744551929213141/host_adb_log_7345436689174166438.txt. [size=82747, elapsed=1ms]
05-06 10:42:41 D/LogFileSaver: Log data for device_logcat_teardown_SKBFXYWR0LWD is already compressed, skipping compression
05-06 10:42:41 D/FileUtil: Creating temp file at /home/dev2-google04/android-tvts/android-tvts-2.17r1-arm-15298624/android-tvts/tools/./../../android-tvts/logs/2026.05.06_10.40.21/inv_12800172045122819424 with prefix "device_logcat_teardown_SKBFXYWR0LWD_" suffix ".txt"
05-06 10:42:41 I/LogFileSaver: Saved log file /home/dev2-google04/android-tvts/android-tvts-2.17r1-arm-15298624/android-tvts/tools/./../../android-tvts/logs/2026.05.06_10.40.21/inv_12800172045122819424/device_logcat_teardown_SKBFXYWR0LWD_16378543142616979973.txt. [size=46280, elapsed=1ms]
05-06 10:42:41 D/CertificationSuiteResultReporter: Saved logs for device_logcat_teardown_SKBFXYWR0LWD in /home/dev2-google04/android-tvts/android-tvts-2.17r1-arm-15298624/android-tvts/tools/./../../android-tvts/logs/2026.05.06_10.40.21/inv_12800172045122819424/device_logcat_teardown_SKBFXYWR0LWD_16378543142616979973.txt
05-06 10:42:41 D/LogFileSaver: Log data for device_logcat_teardown_SKBFXYWR0LWD is already compressed, skipping compression
05-06 10:42:41 D/FileUtil: Creating temp file at /tmp/15298624/tvts/inv_4989505209976318543/inv_2312744551929213141 with prefix "device_logcat_teardown_SKBFXYWR0LWD_" suffix ".txt"
05-06 10:42:41 I/LogFileSaver: Saved log file /tmp/15298624/tvts/inv_4989505209976318543/inv_2312744551929213141/device_logcat_teardown_SKBFXYWR0LWD_2808590870356199490.txt. [size=46280, elapsed=1ms]
05-06 10:42:41 I/TestInvocation: Done stopping logcat for SKBFXYWR0LWD
05-06 10:42:41 D/BackgroundDeviceAction: com.android.ddmlib.TimeoutException while running logcat on SKBFXYWR0LWD. May see duplicated content in log.
05-06 10:42:41 D/BackgroundDeviceAction: Waiting for device SKBFXYWR0LWD online before starting.
05-06 10:42:41 D/CommandScheduler: TestDeviceState for releasing 'SKBFXYWR0LWD(class com.android.tradefed.device.TestDevice)' is 'ONLINE'
05-06 10:42:41 I/NativeDeviceStateMonitor: Waiting 30000 ms for device SKBFXYWR0LWD shell to be responsive
05-06 10:42:41 D/RunUtil: Running command [adb, -s, SKBFXYWR0LWD, features] with timeout: 2m 0s
05-06 10:42:41 D/RunUtil: Running command [adb, -s, SKBFXYWR0LWD, shell, id] without timeout.
05-06 10:42:41 I/NativeDeviceStateMonitor: shell ready. id output: uid=2000(shell) gid=2000(shell) groups=2000(shell),1004(input),1007(log),1011(adb),1015(sdcard_rw),1028(sdcard_r),3001(net_bt_admin),3002(net_bt),3003(inet),3006(net_bw_stats),3009(readproc),3011(uhid) context=u:r:shell:s0

05-06 10:42:41 D/CommandScheduler: Release map of the devices: {com.android.tradefed.device.TestDevice@3959308b=AVAILABLE}
05-06 10:42:41 W/NativeDevice: Attempting to stop logcat when not capturing for SKBFXYWR0LWD
05-06 10:42:41 D/TestDevice: No snapuserd notification in progress for BLOCK_BEFORE_RELEASING
