05-06 10:26:23 D/Configuration: Resolve and download remote files from @Option
05-06 10:26:23 I/TestInvocation: Invocation was started with cmd: tvts-maint-cert -m TvConcurrentMediaPlaybackHostTestCases
05-06 10:26:23 D/InvocationExecution: Skip linking external directory as FileProperty was set.
05-06 10:26:23 D/RunUtil: Running command [adb, version] with timeout: 2m 0s
05-06 10:26:23 D/TestInvocation: Fetch build duration: 13 ms
05-06 10:26:23 D/ArtifactsAnalyzer: Build analysis report: BuildAnalysis [mDeviceImageChanged=true, mHasTestsArtifacts=true, mHasChangesInTests=false, imageDigests={}, artifactDigests={}]
05-06 10:26:23 D/ArtifactsAnalyzer: Analysis report after test analysis: BuildAnalysis [mDeviceImageChanged=true, mHasTestsArtifacts=true, mHasChangesInTests=true, imageDigests={}, artifactDigests={testsdir=null}]
05-06 10:26:23 D/RunUtil: Running command [adb, -s, SKBFXYWR0LWD, shell, getprop, ro.build.version.sdk] with timeout: 45s
05-06 10:26:23 D/GlobalTestFilter: Setting up global filters
05-06 10:26:23 D/InvocationExecution: IShardHelper selected: com.android.tradefed.invoker.shard.StrictShardHelper@4182c4d1
05-06 10:26:23 D/BackgroundDeviceAction: Waiting for device SKBFXYWR0LWD online before starting.
05-06 10:26:23 D/BackgroundDeviceAction: Device SKBFXYWR0LWD now online.
05-06 10:26:23 D/BackgroundDeviceAction: Starting logcat for SKBFXYWR0LWD.
05-06 10:26:23 I/TestInvocation: Starting invocation for 'tvts' with '[ DeviceBuildInfo{bid=13641659, serial=SKBFXYWR0LWD} on device 'SKBFXYWR0LWD'] 
05-06 10:26:23 D/RunUtil: Running command [chmod, ug+rwx, /tmp/13641659] with timeout: 10s
05-06 10:26:23 D/RunUtil: Running command [chmod, ug+rwx, /tmp/13641659/tvts] with timeout: 10s
05-06 10:26:23 D/FileUtil: Creating temp directory at /tmp/13641659/tvts with prefix "inv_"
05-06 10:26:23 D/RunUtil: Running command [chmod, ug+rwx, /tmp/13641659/tvts/inv_14923917419519687788] with timeout: 10s
05-06 10:26:23 D/FileSystemLogSaver: Using log file directory /tmp/13641659/tvts/inv_14923917419519687788
05-06 10:26:23 D/FileUtil: Creating temp directory at /tmp/13641659/tvts/inv_14923917419519687788 with prefix "inv_"
05-06 10:26:23 I/LogFileSaver: Using log file directory /tmp/13641659/tvts/inv_14923917419519687788/inv_9146255718902668723
05-06 10:26:23 D/CertificationSuiteResultReporter: Initializing result directory
05-06 10:26:23 D/CertificationSuiteResultReporter: Results Directory: /home/dev2-google04/android-tvts/arm_android-tvts-2.14_r1/android-tvts/tools/./../../android-tvts/results/2026.05.06_10.26.23
05-06 10:26:23 D/CertificationSuiteResultReporter: Created log dir /home/dev2-google04/android-tvts/arm_android-tvts-2.14_r1/android-tvts/tools/./../../android-tvts/logs/2026.05.06_10.26.23
05-06 10:26:23 D/FileUtil: Creating temp directory at /home/dev2-google04/android-tvts/arm_android-tvts-2.14_r1/android-tvts/tools/./../../android-tvts/logs/2026.05.06_10.26.23 with prefix "inv_"
05-06 10:26:23 I/LogFileSaver: Using log file directory /home/dev2-google04/android-tvts/arm_android-tvts-2.14_r1/android-tvts/tools/./../../android-tvts/logs/2026.05.06_10.26.23/inv_8236708342172730979
05-06 10:26:23 D/CompatibilityProtoResultReporter: Proto Results Directory: /home/dev2-google04/android-tvts/arm_android-tvts-2.14_r1/android-tvts/tools/./../../android-tvts/results/2026.05.06_10.26.23/proto
05-06 10:26:23 D/FileUtil: Creating temp file at /home/dev2-google04/android-tvts/arm_android-tvts-2.14_r1/android-tvts/tools/./../../android-tvts/results/2026.05.06_10.26.23/proto with prefix "tmp-proto" suffix ""
05-06 10:26:23 D/CompatibilityProtoResultReporter: Proto Results Directory: /home/dev2-google04/android-tvts/arm_android-tvts-2.14_r1/android-tvts/tools/./../../android-tvts/results/2026.05.06_10.26.23/proto
05-06 10:26:23 D/TvtsReporterBase: build id: 13641659
05-06 10:26:23 D/TvtsReporterBase: Initializing result directory
05-06 10:26:23 D/RunUtil: Running command [adb, -s, SKBFXYWR0LWD, shell, getprop, ro.build.fingerprint] with timeout: 45s
05-06 10:26:23 D/TvtsReporterBase: build id: 13641659
05-06 10:26:23 D/TvtsReporterBase: Initializing result directory
05-06 10:26:23 D/NativeDevice: Using property ro.build.fingerprint=SKB/BFX_UA300/BFX-UA300:10/QT/19.561.113-20260424:user/release-keys from cache.
05-06 10:26:23 D/TvtsReporterBase: build id: 13641659
05-06 10:26:23 D/TvtsReporterBase: Initializing result directory
05-06 10:26:23 D/NativeDevice: Using property ro.build.fingerprint=SKB/BFX_UA300/BFX-UA300:10/QT/19.561.113-20260424:user/release-keys from cache.
05-06 10:26:23 D/LogFileSaver: Log data for tradefed-expanded-config is already compressed, skipping compression
05-06 10:26:23 D/FileUtil: Creating temp file at /home/dev2-google04/android-tvts/arm_android-tvts-2.14_r1/android-tvts/tools/./../../android-tvts/logs/2026.05.06_10.26.23/inv_8236708342172730979 with prefix "tradefed-expanded-config_" suffix ".xml"
05-06 10:26:23 I/LogFileSaver: Saved log file /home/dev2-google04/android-tvts/arm_android-tvts-2.14_r1/android-tvts/tools/./../../android-tvts/logs/2026.05.06_10.26.23/inv_8236708342172730979/tradefed-expanded-config_2530336806675263057.xml. [size=13468, elapsed=1ms]
05-06 10:26:23 D/CertificationSuiteResultReporter: Saved logs for tradefed-expanded-config in /home/dev2-google04/android-tvts/arm_android-tvts-2.14_r1/android-tvts/tools/./../../android-tvts/logs/2026.05.06_10.26.23/inv_8236708342172730979/tradefed-expanded-config_2530336806675263057.xml
05-06 10:26:23 D/LogFileSaver: Log data for tradefed-expanded-config is already compressed, skipping compression
05-06 10:26:23 D/FileUtil: Creating temp file at /tmp/13641659/tvts/inv_14923917419519687788/inv_9146255718902668723 with prefix "tradefed-expanded-config_" suffix ".xml"
05-06 10:26:23 I/LogFileSaver: Saved log file /tmp/13641659/tvts/inv_14923917419519687788/inv_9146255718902668723/tradefed-expanded-config_9284137449968908489.xml. [size=13468, elapsed=1ms]
05-06 10:26:23 D/InvocationExecution: Starting device pre invocation setup for : 'SKBFXYWR0LWD'
05-06 10:26:23 D/DefaultConnection: Instance type for connection: GCE
05-06 10:26:23 D/DefaultConnection: Instance type for connection: GCE. Evaluating for connection type.
05-06 10:26:23 D/NativeDevice: Using connection: com.android.tradefed.device.connection.DefaultConnection@5af1c3da (SKBFXYWR0LWD)
05-06 10:26:23 I/CommandInterrupter: Interrupt allowed
05-06 10:26:23 D/InvocationExecution: Starting setup for device: 'SKBFXYWR0LWD'
05-06 10:26:23 D/InvocationExecution: starting preparer 'com.android.tradefed.targetprep.RunCommandTargetPreparer@49bb078e' on device: 'SKBFXYWR0LWD'
05-06 10:26:23 D/RunUtil: Running command [adb, -s, SKBFXYWR0LWD, shell, rm, -rf, /sdcard/device-info-files] with timeout: 2m 0s
05-06 10:26:23 D/RunUtil: Running command [adb, -s, SKBFXYWR0LWD, shell, rm, -rf, /sdcard/report-log-files] with timeout: 2m 0s
05-06 10:26:23 D/RunUtil: Running command [adb, -s, SKBFXYWR0LWD, shell, rm, -rf, /storage/emulated/0/Download/failure-screenshots] with timeout: 2m 0s
05-06 10:26:23 D/RunUtil: Running command [adb, -s, SKBFXYWR0LWD, shell, rm, -rf, /sdcard/perfetto-traces] with timeout: 2m 0s
05-06 10:26:23 D/RunUtil: Running command [adb, -s, SKBFXYWR0LWD, shell, rm, -rf, /data/local/tmp/files/audio] with timeout: 2m 0s
05-06 10:26:23 D/InvocationExecution: done with preparer 'com.android.tradefed.targetprep.RunCommandTargetPreparer@49bb078e' on device: 'SKBFXYWR0LWD' in 208 ms
05-06 10:26:23 D/InvocationExecution: starting preparer 'com.android.compatibility.common.tradefed.targetprep.DeviceInfoCollector@88f6b3a' on device: 'SKBFXYWR0LWD'
05-06 10:26:23 D/RunUtil: Running command [adb, -s, SKBFXYWR0LWD, shell, getprop, ro.product.model] with timeout: 45s
05-06 10:26:23 D/RunUtil: Running command [adb, -s, SKBFXYWR0LWD, shell, getprop, ro.product.device] with timeout: 45s
05-06 10:26:24 D/RunUtil: Running command [adb, -s, SKBFXYWR0LWD, shell, getprop, ro.build.id] with timeout: 45s
05-06 10:26:24 D/RunUtil: Running command [adb, -s, SKBFXYWR0LWD, shell, getprop, ro.bootimage.build.fingerprint] with timeout: 45s
05-06 10:26:24 D/NativeDevice: Using property ro.build.version.sdk=29 from cache.
05-06 10:26:24 D/RunUtil: Running command [adb, -s, SKBFXYWR0LWD, shell, getprop, ro.product.manufacturer] with timeout: 45s
05-06 10:26:24 D/RunUtil: Running command [adb, -s, SKBFXYWR0LWD, shell, getprop, ro.serialno] with timeout: 45s
05-06 10:26:24 D/RunUtil: Running command [adb, -s, SKBFXYWR0LWD, shell, getprop, ro.build.version.security_patch] with timeout: 45s
05-06 10:26:24 D/RunUtil: Running command [adb, -s, SKBFXYWR0LWD, shell, getprop, ro.product.cpu.abilist32] with timeout: 45s
05-06 10:26:24 D/RunUtil: Running command [adb, -s, SKBFXYWR0LWD, shell, getprop, ro.build.reference.fingerprint] with timeout: 45s
05-06 10:26:24 D/RunUtil: Running command [adb, -s, SKBFXYWR0LWD, shell, getprop, ro.product.cpu.abi] with timeout: 45s
05-06 10:26:24 D/RunUtil: Running command [adb, -s, SKBFXYWR0LWD, shell, getprop, ro.product.cpu.abilist64] with timeout: 45s
05-06 10:26:24 D/RunUtil: Running command [adb, -s, SKBFXYWR0LWD, shell, getprop, ro.product.name] with timeout: 45s
05-06 10:26:24 D/RunUtil: Running command [adb, -s, SKBFXYWR0LWD, shell, getprop, ro.build.tags] with timeout: 45s
05-06 10:26:24 D/RunUtil: Running command [adb, -s, SKBFXYWR0LWD, shell, getprop, ro.build.version.incremental] with timeout: 45s
05-06 10:26:24 D/RunUtil: Running command [adb, -s, SKBFXYWR0LWD, shell, getprop, ro.product.brand] with timeout: 45s
05-06 10:26:24 D/NativeDevice: Using property ro.build.fingerprint=SKB/BFX_UA300/BFX-UA300:10/QT/19.561.113-20260424:user/release-keys from cache.
05-06 10:26:24 D/RunUtil: Running command [adb, -s, SKBFXYWR0LWD, shell, getprop, ro.vendor.build.fingerprint] with timeout: 45s
05-06 10:26:24 D/RunUtil: Running command [adb, -s, SKBFXYWR0LWD, shell, getprop, ro.build.version.base_os] with timeout: 45s
05-06 10:26:24 D/RunUtil: Running command [adb, -s, SKBFXYWR0LWD, shell, getprop, ro.product.cpu.abilist] with timeout: 45s
05-06 10:26:24 D/RunUtil: Running command [adb, -s, SKBFXYWR0LWD, shell, getprop, ro.product.board] with timeout: 45s
05-06 10:26:24 D/RunUtil: Running command [adb, -s, SKBFXYWR0LWD, shell, getprop, ro.build.type] with timeout: 45s
05-06 10:26:24 D/RunUtil: Running command [adb, -s, SKBFXYWR0LWD, shell, getprop, ro.build.version.release] with timeout: 45s
05-06 10:26:24 D/RunUtil: Running command [adb, -s, SKBFXYWR0LWD, shell, getprop, ro.product.cpu.abi2] with timeout: 45s
05-06 10:26:24 D/SearchArtifactUtil: Searching for file TvtsDeviceInfo.apk. Search directories: [./../../android-tvts/testcases, /tmp/tf-workfolder7217006897044893041]
05-06 10:26:24 D/SearchArtifactUtil: Found file /home/dev2-google04/android-tvts/arm_android-tvts-2.14_r1/android-tvts/tools/./../../android-tvts/testcases/TvtsDeviceInfo.apk in search directory /home/dev2-google04/android-tvts/arm_android-tvts-2.14_r1/android-tvts/tools/./../../android-tvts/testcases.
05-06 10:26:24 I/NativeDeviceStateMonitor: Device SKBFXYWR0LWD is already ONLINE
05-06 10:26:24 I/NativeDeviceStateMonitor: Waiting 360000 ms for device SKBFXYWR0LWD boot complete
05-06 10:26:24 I/DeviceStateMonitor: Waiting 359961 ms for device SKBFXYWR0LWD package manager
05-06 10:26:24 I/NativeDeviceStateMonitor: Waiting 359898 ms for device SKBFXYWR0LWD external store
05-06 10:26:25 I/ApkInstrumentationPreparer: Instrumenting package: com.android.compatibility.common.deviceinfo
05-06 10:26:25 D/NativeDevice: Using property ro.build.version.sdk=29 from cache.
05-06 10:26:25 D/RunUtil: Running command [adb, -s, SKBFXYWR0LWD, shell, getprop, ro.build.version.codename] with timeout: 45s
05-06 10:26:25 D/NativeDevice: Using property ro.build.version.sdk=29 from cache.
05-06 10:26:25 D/NativeDevice: Using property ro.build.version.codename=REL from cache.
05-06 10:26:25 D/AndroidJUnitTest: Disabled test storage as it's not supported on that branch.
05-06 10:26:25 D/NativeDevice: Using property ro.build.version.sdk=29 from cache.
05-06 10:26:25 D/NativeDevice: Using property ro.build.version.codename=REL from cache.
05-06 10:26:25 D/NativeDevice: Using property ro.build.version.sdk=29 from cache.
05-06 10:26:25 D/TvtsDeviceInfo.apk: Uploading TvtsDeviceInfo.apk onto device 'SKBFXYWR0LWD'
05-06 10:26:25 D/DeviceImpl: Uploading file onto device 'SKBFXYWR0LWD'
05-06 10:26:25 D/FilePermissionUtil: Reading file permission of /home/dev2-google04/android-tvts/arm_android-tvts-2.14_r1/android-tvts/tools/./../../android-tvts/testcases/TvtsDeviceInfo.apk as: rw-r--r--
05-06 10:26:29 D/RunUtil: Running command [aapt, dump, badging, /home/dev2-google04/android-tvts/arm_android-tvts-2.14_r1/android-tvts/tools/./../../android-tvts/testcases/TvtsDeviceInfo.apk] with timeout: 1m 0s
05-06 10:26:29 D/RunUtil: Running command [aapt, dump, xmltree, /home/dev2-google04/android-tvts/arm_android-tvts-2.14_r1/android-tvts/tools/./../../android-tvts/testcases/TvtsDeviceInfo.apk, AndroidManifest.xml] with timeout: 1m 0s
05-06 10:26:29 D/RunUtil: Running command [adb, -s, SKBFXYWR0LWD, shell, appops, write-settings] with timeout: 2m 0s
05-06 10:26:29 D/ListInstrumentationParser: instrumentation:com.android.compatibility.common.deviceinfo/androidx.test.runner.AndroidJUnitRunner (target=com.android.compatibility.common.deviceinfo)
05-06 10:26:29 D/ListInstrumentationParser: 
05-06 10:26:29 I/InstrumentationTest: No runner name specified. Using: androidx.test.runner.AndroidJUnitRunner.
05-06 10:26:29 D/NativeDevice: Using property ro.build.version.sdk=29 from cache.
05-06 10:26:29 D/NativeDevice: Using property ro.build.version.codename=REL from cache.
05-06 10:26:29 D/NativeDevice: Using property ro.build.version.sdk=29 from cache.
05-06 10:26:29 D/NativeDevice: Using property ro.build.version.codename=REL from cache.
05-06 10:26:29 D/InstrumentationTest: Initializing com.android.tradefed.device.metric.CountTestCasesCollector for instrumentation.
05-06 10:26:29 I/RemoteAndroidTestRunner: Running am instrument -w -r --no-isolated-storage  -e newRunListenerMode true -e timeout_msec 300000 com.android.compatibility.common.deviceinfo/androidx.test.runner.AndroidJUnitRunner on foxconn-bfx_ua300-SKBFXYWR0LWD
05-06 10:26:57 D/TestDevice: Uninstalling com.android.compatibility.common.deviceinfo with extra args 
05-06 10:26:58 W/ApkInstrumentationPreparer: Target preparation step com.android.compatibility.common.deviceinfo.KeystoreAttestationDeviceInfo#testCollectDeviceInfo failed.
java.lang.NoSuchMethodError: No virtual method setDevicePropertiesAttestationIncluded(Z)Landroid/security/keystore/KeyGenParameterSpec$Builder; in class Landroid/security/keystore/KeyGenParameterSpec$Builder; or its super classes (declaration of 'android.security.keystore.KeyGenParameterSpec$Builder' appears in /system/framework/framework.jar!classes2.dex)
	at com.android.compatibility.common.deviceinfo.KeystoreAttestationDeviceInfo.collectAttestation(KeystoreAttestationDeviceInfo.java:90)
	at com.android.compatibility.common.deviceinfo.KeystoreAttestationDeviceInfo.collectDeviceInfo(KeystoreAttestationDeviceInfo.java:58)
	at com.android.compatibility.common.deviceinfo.DeviceInfo.testCollectDeviceInfo(DeviceInfo.java:96)
	at java.lang.reflect.Method.invoke(Native Method)
	at android.test.InstrumentationTestCase.runMethod(InstrumentationTestCase.java:220)
	at android.test.InstrumentationTestCase.runTest(InstrumentationTestCase.java:205)

05-06 10:26:58 D/NativeDevice: Using property ro.build.version.sdk=29 from cache.
05-06 10:26:58 D/NativeDevice: Using 'ls' to check doesFileExist(/storage/emulated/0/device-info-files/)
05-06 10:26:58 D/RunUtil: Running command [adb, -s, SKBFXYWR0LWD, shell, ls, '/storage/emulated/0/device-info-files/'] with timeout: 2m 0s
05-06 10:26:59 D/FileUtil: Creating temp file at /tmp/13641659/tvts/inv_14923917419519687788/inv_9146255718902668723 with prefix "CpuDeviceInfo.deviceinfo.json_" suffix ".txt.gz"
05-06 10:26:59 I/LogFileSaver: Saved gzip log file /tmp/13641659/tvts/inv_14923917419519687788/inv_9146255718902668723/CpuDeviceInfo.deviceinfo.json_7531871662392137639.txt.gz. [size=10, elapsed=2ms]
05-06 10:26:59 D/FileUtil: Creating temp file at /tmp/13641659/tvts/inv_14923917419519687788/inv_9146255718902668723 with prefix "InputDeviceInfo.deviceinfo.json_" suffix ".txt.gz"
05-06 10:26:59 I/LogFileSaver: Saved gzip log file /tmp/13641659/tvts/inv_14923917419519687788/inv_9146255718902668723/InputDeviceInfo.deviceinfo.json_6291118659335846575.txt.gz. [size=10, elapsed=0ms]
05-06 10:26:59 D/FileUtil: Creating temp file at /tmp/13641659/tvts/inv_14923917419519687788/inv_9146255718902668723 with prefix "ClientIdDeviceInfo.deviceinfo.json_" suffix ".txt.gz"
05-06 10:26:59 I/LogFileSaver: Saved gzip log file /tmp/13641659/tvts/inv_14923917419519687788/inv_9146255718902668723/ClientIdDeviceInfo.deviceinfo.json_5005408062778831550.txt.gz. [size=10, elapsed=0ms]
05-06 10:26:59 D/FileUtil: Creating temp file at /tmp/13641659/tvts/inv_14923917419519687788/inv_9146255718902668723 with prefix "UserDeviceInfo.deviceinfo.json_" suffix ".txt.gz"
05-06 10:26:59 I/LogFileSaver: Saved gzip log file /tmp/13641659/tvts/inv_14923917419519687788/inv_9146255718902668723/UserDeviceInfo.deviceinfo.json_10451685464836208274.txt.gz. [size=10, elapsed=1ms]
05-06 10:26:59 D/FileUtil: Creating temp file at /tmp/13641659/tvts/inv_14923917419519687788/inv_9146255718902668723 with prefix "LocaleDeviceInfo.deviceinfo.json_" suffix ".txt.gz"
05-06 10:26:59 I/LogFileSaver: Saved gzip log file /tmp/13641659/tvts/inv_14923917419519687788/inv_9146255718902668723/LocaleDeviceInfo.deviceinfo.json_13486377065630688569.txt.gz. [size=10, elapsed=0ms]
05-06 10:26:59 D/FileUtil: Creating temp file at /tmp/13641659/tvts/inv_14923917419519687788/inv_9146255718902668723 with prefix "MediaDeviceInfo.deviceinfo.json_" suffix ".txt.gz"
05-06 10:26:59 I/LogFileSaver: Saved gzip log file /tmp/13641659/tvts/inv_14923917419519687788/inv_9146255718902668723/MediaDeviceInfo.deviceinfo.json_15196317427477162405.txt.gz. [size=10, elapsed=1ms]
05-06 10:26:59 D/FileUtil: Creating temp file at /tmp/13641659/tvts/inv_14923917419519687788/inv_9146255718902668723 with prefix "MemoryDeviceInfo.deviceinfo.json_" suffix ".txt.gz"
05-06 10:26:59 I/LogFileSaver: Saved gzip log file /tmp/13641659/tvts/inv_14923917419519687788/inv_9146255718902668723/MemoryDeviceInfo.deviceinfo.json_15702480194371288672.txt.gz. [size=10, elapsed=1ms]
05-06 10:26:59 D/FileUtil: Creating temp file at /tmp/13641659/tvts/inv_14923917419519687788/inv_9146255718902668723 with prefix "GnssDeviceInfo.deviceinfo.json_" suffix ".txt.gz"
05-06 10:26:59 I/LogFileSaver: Saved gzip log file /tmp/13641659/tvts/inv_14923917419519687788/inv_9146255718902668723/GnssDeviceInfo.deviceinfo.json_11082538358420104910.txt.gz. [size=10, elapsed=0ms]
05-06 10:26:59 D/FileUtil: Creating temp file at /tmp/13641659/tvts/inv_14923917419519687788/inv_9146255718902668723 with prefix "ConnectivityDeviceInfo.deviceinfo.json_" suffix ".txt.gz"
05-06 10:26:59 I/LogFileSaver: Saved gzip log file /tmp/13641659/tvts/inv_14923917419519687788/inv_9146255718902668723/ConnectivityDeviceInfo.deviceinfo.json_8566705055316354350.txt.gz. [size=10, elapsed=1ms]
05-06 10:26:59 D/FileUtil: Creating temp file at /tmp/13641659/tvts/inv_14923917419519687788/inv_9146255718902668723 with prefix "VintfDeviceInfo.deviceinfo.json_" suffix ".txt.gz"
05-06 10:26:59 I/LogFileSaver: Saved gzip log file /tmp/13641659/tvts/inv_14923917419519687788/inv_9146255718902668723/VintfDeviceInfo.deviceinfo.json_11169737717849539001.txt.gz. [size=10, elapsed=0ms]
05-06 10:26:59 D/FileUtil: Creating temp file at /tmp/13641659/tvts/inv_14923917419519687788/inv_9146255718902668723 with prefix "DefaultAppDeviceInfo.deviceinfo.json_" suffix ".txt.gz"
05-06 10:26:59 I/LogFileSaver: Saved gzip log file /tmp/13641659/tvts/inv_14923917419519687788/inv_9146255718902668723/DefaultAppDeviceInfo.deviceinfo.json_2830337499484379294.txt.gz. [size=10, elapsed=1ms]
05-06 10:26:59 D/FileUtil: Creating temp file at /tmp/13641659/tvts/inv_14923917419519687788/inv_9146255718902668723 with prefix "PackageDeviceInfo.deviceinfo.json_" suffix ".txt.gz"
05-06 10:26:59 I/LogFileSaver: Saved gzip log file /tmp/13641659/tvts/inv_14923917419519687788/inv_9146255718902668723/PackageDeviceInfo.deviceinfo.json_14487806622106979393.txt.gz. [size=22483, elapsed=12ms]
05-06 10:26:59 D/FileUtil: Creating temp file at /home/dev2-google04/android-tvts/arm_android-tvts-2.14_r1/android-tvts/tools/./../../android-tvts/logs/2026.05.06_10.26.23/inv_8236708342172730979 with prefix "device_manifest.xml_" suffix ".txt.gz"
05-06 10:26:59 I/LogFileSaver: Saved gzip log file /home/dev2-google04/android-tvts/arm_android-tvts-2.14_r1/android-tvts/tools/./../../android-tvts/logs/2026.05.06_10.26.23/inv_8236708342172730979/device_manifest.xml_4273592970348903229.txt.gz. [size=10, elapsed=0ms]
05-06 10:26:59 D/CertificationSuiteResultReporter: Saved logs for device_manifest.xml in /home/dev2-google04/android-tvts/arm_android-tvts-2.14_r1/android-tvts/tools/./../../android-tvts/logs/2026.05.06_10.26.23/inv_8236708342172730979/device_manifest.xml_4273592970348903229.txt.gz
05-06 10:26:59 D/FileUtil: Creating temp file at /tmp/13641659/tvts/inv_14923917419519687788/inv_9146255718902668723 with prefix "device_manifest.xml_" suffix ".txt.gz"
05-06 10:26:59 I/LogFileSaver: Saved gzip log file /tmp/13641659/tvts/inv_14923917419519687788/inv_9146255718902668723/device_manifest.xml_11523848494920088077.txt.gz. [size=10, elapsed=1ms]
05-06 10:26:59 D/FileUtil: Creating temp file at /home/dev2-google04/android-tvts/arm_android-tvts-2.14_r1/android-tvts/tools/./../../android-tvts/logs/2026.05.06_10.26.23/inv_8236708342172730979 with prefix "framework_compatibility_matrix.xml_" suffix ".txt.gz"
05-06 10:26:59 I/LogFileSaver: Saved gzip log file /home/dev2-google04/android-tvts/arm_android-tvts-2.14_r1/android-tvts/tools/./../../android-tvts/logs/2026.05.06_10.26.23/inv_8236708342172730979/framework_compatibility_matrix.xml_1638164694346230815.txt.gz. [size=10, elapsed=1ms]
05-06 10:26:59 D/CertificationSuiteResultReporter: Saved logs for framework_compatibility_matrix.xml in /home/dev2-google04/android-tvts/arm_android-tvts-2.14_r1/android-tvts/tools/./../../android-tvts/logs/2026.05.06_10.26.23/inv_8236708342172730979/framework_compatibility_matrix.xml_1638164694346230815.txt.gz
05-06 10:26:59 D/FileUtil: Creating temp file at /tmp/13641659/tvts/inv_14923917419519687788/inv_9146255718902668723 with prefix "framework_compatibility_matrix.xml_" suffix ".txt.gz"
05-06 10:26:59 I/LogFileSaver: Saved gzip log file /tmp/13641659/tvts/inv_14923917419519687788/inv_9146255718902668723/framework_compatibility_matrix.xml_6772705726734238454.txt.gz. [size=10, elapsed=2ms]
05-06 10:26:59 D/FileUtil: Creating temp file at /tmp/13641659/tvts/inv_14923917419519687788/inv_9146255718902668723 with prefix "GraphicsDeviceInfo.deviceinfo.json_" suffix ".txt.gz"
05-06 10:26:59 I/LogFileSaver: Saved gzip log file /tmp/13641659/tvts/inv_14923917419519687788/inv_9146255718902668723/GraphicsDeviceInfo.deviceinfo.json_17519314113185650844.txt.gz. [size=10, elapsed=0ms]
05-06 10:26:59 D/FileUtil: Creating temp file at /tmp/13641659/tvts/inv_14923917419519687788/inv_9146255718902668723 with prefix "BiometricsDeviceInfo.deviceinfo.json_" suffix ".txt.gz"
05-06 10:26:59 I/LogFileSaver: Saved gzip log file /tmp/13641659/tvts/inv_14923917419519687788/inv_9146255718902668723/BiometricsDeviceInfo.deviceinfo.json_13120743267874829235.txt.gz. [size=10, elapsed=1ms]
05-06 10:26:59 D/FileUtil: Creating temp file at /tmp/13641659/tvts/inv_14923917419519687788/inv_9146255718902668723 with prefix "KeystoreAttestationDeviceInfo.deviceinfo.json_" suffix ".txt.gz"
05-06 10:26:59 I/LogFileSaver: Saved gzip log file /tmp/13641659/tvts/inv_14923917419519687788/inv_9146255718902668723/KeystoreAttestationDeviceInfo.deviceinfo.json_10458991669339201828.txt.gz. [size=10, elapsed=0ms]
05-06 10:26:59 D/FileUtil: Creating temp file at /tmp/13641659/tvts/inv_14923917419519687788/inv_9146255718902668723 with prefix "MediaOutputDeviceInfo.deviceinfo.json_" suffix ".txt.gz"
05-06 10:26:59 I/LogFileSaver: Saved gzip log file /tmp/13641659/tvts/inv_14923917419519687788/inv_9146255718902668723/MediaOutputDeviceInfo.deviceinfo.json_6211620899262174466.txt.gz. [size=10, elapsed=0ms]
05-06 10:26:59 D/FileUtil: Creating temp file at /tmp/13641659/tvts/inv_14923917419519687788/inv_9146255718902668723 with prefix "StorageDeviceInfo.deviceinfo.json_" suffix ".txt.gz"
05-06 10:26:59 I/LogFileSaver: Saved gzip log file /tmp/13641659/tvts/inv_14923917419519687788/inv_9146255718902668723/StorageDeviceInfo.deviceinfo.json_7446836992933279756.txt.gz. [size=10, elapsed=1ms]
05-06 10:26:59 D/FileUtil: Creating temp file at /tmp/13641659/tvts/inv_14923917419519687788/inv_9146255718902668723 with prefix "GenericDeviceInfo.deviceinfo.json_" suffix ".txt.gz"
05-06 10:26:59 I/LogFileSaver: Saved gzip log file /tmp/13641659/tvts/inv_14923917419519687788/inv_9146255718902668723/GenericDeviceInfo.deviceinfo.json_15510514619704656854.txt.gz. [size=10, elapsed=0ms]
05-06 10:26:59 D/FileUtil: Creating temp file at /home/dev2-google04/android-tvts/arm_android-tvts-2.14_r1/android-tvts/tools/./../../android-tvts/logs/2026.05.06_10.26.23/inv_8236708342172730979 with prefix "framework_manifest.xml_" suffix ".txt.gz"
05-06 10:26:59 I/LogFileSaver: Saved gzip log file /home/dev2-google04/android-tvts/arm_android-tvts-2.14_r1/android-tvts/tools/./../../android-tvts/logs/2026.05.06_10.26.23/inv_8236708342172730979/framework_manifest.xml_6262682758882360603.txt.gz. [size=10, elapsed=0ms]
05-06 10:26:59 D/CertificationSuiteResultReporter: Saved logs for framework_manifest.xml in /home/dev2-google04/android-tvts/arm_android-tvts-2.14_r1/android-tvts/tools/./../../android-tvts/logs/2026.05.06_10.26.23/inv_8236708342172730979/framework_manifest.xml_6262682758882360603.txt.gz
05-06 10:26:59 D/FileUtil: Creating temp file at /tmp/13641659/tvts/inv_14923917419519687788/inv_9146255718902668723 with prefix "framework_manifest.xml_" suffix ".txt.gz"
05-06 10:26:59 I/LogFileSaver: Saved gzip log file /tmp/13641659/tvts/inv_14923917419519687788/inv_9146255718902668723/framework_manifest.xml_8161793882288391952.txt.gz. [size=10, elapsed=0ms]
05-06 10:26:59 D/FileUtil: Creating temp file at /tmp/13641659/tvts/inv_14923917419519687788/inv_9146255718902668723 with prefix "HapticsDeviceInfo.deviceinfo.json_" suffix ".txt.gz"
05-06 10:26:59 I/LogFileSaver: Saved gzip log file /tmp/13641659/tvts/inv_14923917419519687788/inv_9146255718902668723/HapticsDeviceInfo.deviceinfo.json_502229626134170632.txt.gz. [size=10, elapsed=0ms]
05-06 10:26:59 D/FileUtil: Creating temp file at /tmp/13641659/tvts/inv_14923917419519687788/inv_9146255718902668723 with prefix "AppStandbyDeviceInfo.deviceinfo.json_" suffix ".txt.gz"
05-06 10:26:59 I/LogFileSaver: Saved gzip log file /tmp/13641659/tvts/inv_14923917419519687788/inv_9146255718902668723/AppStandbyDeviceInfo.deviceinfo.json_16274699515937148397.txt.gz. [size=10, elapsed=0ms]
05-06 10:26:59 D/FileUtil: Creating temp file at /tmp/13641659/tvts/inv_14923917419519687788/inv_9146255718902668723 with prefix "DeviceIdleDeviceInfo.deviceinfo.json_" suffix ".txt.gz"
05-06 10:26:59 I/LogFileSaver: Saved gzip log file /tmp/13641659/tvts/inv_14923917419519687788/inv_9146255718902668723/DeviceIdleDeviceInfo.deviceinfo.json_11059332694808970988.txt.gz. [size=10, elapsed=0ms]
05-06 10:26:59 D/FileUtil: Creating temp file at /tmp/13641659/tvts/inv_14923917419519687788/inv_9146255718902668723 with prefix "FeatureDeviceInfo.deviceinfo.json_" suffix ".txt.gz"
05-06 10:26:59 I/LogFileSaver: Saved gzip log file /tmp/13641659/tvts/inv_14923917419519687788/inv_9146255718902668723/FeatureDeviceInfo.deviceinfo.json_13275544783547456619.txt.gz. [size=10, elapsed=0ms]
05-06 10:26:59 D/FileUtil: Creating temp file at /tmp/13641659/tvts/inv_14923917419519687788/inv_9146255718902668723 with prefix "ConfigurationDeviceInfo.deviceinfo.json_" suffix ".txt.gz"
05-06 10:26:59 I/LogFileSaver: Saved gzip log file /tmp/13641659/tvts/inv_14923917419519687788/inv_9146255718902668723/ConfigurationDeviceInfo.deviceinfo.json_8550965010263805585.txt.gz. [size=10, elapsed=0ms]
05-06 10:26:59 D/FileUtil: Creating temp file at /home/dev2-google04/android-tvts/arm_android-tvts-2.14_r1/android-tvts/tools/./../../android-tvts/logs/2026.05.06_10.26.23/inv_8236708342172730979 with prefix "device_compatibility_matrix.xml_" suffix ".txt.gz"
05-06 10:26:59 I/LogFileSaver: Saved gzip log file /home/dev2-google04/android-tvts/arm_android-tvts-2.14_r1/android-tvts/tools/./../../android-tvts/logs/2026.05.06_10.26.23/inv_8236708342172730979/device_compatibility_matrix.xml_9578775000745081101.txt.gz. [size=10, elapsed=1ms]
05-06 10:26:59 D/CertificationSuiteResultReporter: Saved logs for device_compatibility_matrix.xml in /home/dev2-google04/android-tvts/arm_android-tvts-2.14_r1/android-tvts/tools/./../../android-tvts/logs/2026.05.06_10.26.23/inv_8236708342172730979/device_compatibility_matrix.xml_9578775000745081101.txt.gz
05-06 10:26:59 D/FileUtil: Creating temp file at /tmp/13641659/tvts/inv_14923917419519687788/inv_9146255718902668723 with prefix "device_compatibility_matrix.xml_" suffix ".txt.gz"
05-06 10:26:59 I/LogFileSaver: Saved gzip log file /tmp/13641659/tvts/inv_14923917419519687788/inv_9146255718902668723/device_compatibility_matrix.xml_15504347496304421732.txt.gz. [size=10, elapsed=0ms]
05-06 10:26:59 D/InvocationExecution: done with preparer 'com.android.compatibility.common.tradefed.targetprep.DeviceInfoCollector@88f6b3a' on device: 'SKBFXYWR0LWD' in 35s
05-06 10:26:59 D/InvocationExecution: starting preparer 'com.google.android.perfverify.tvts.prep.DeviceReliabilityVerifier@77c1070c' on device: 'SKBFXYWR0LWD'
05-06 10:26:59 D/InvocationExecution: done with preparer 'com.google.android.perfverify.tvts.prep.DeviceReliabilityVerifier@77c1070c' on device: 'SKBFXYWR0LWD' in 207 ms
05-06 10:26:59 D/InvocationExecution: starting preparer 'com.android.compatibility.common.tradefed.targetprep.ReportLogCollector@4bb387cd' on device: 'SKBFXYWR0LWD'
05-06 10:26:59 D/InvocationExecution: done with preparer 'com.android.compatibility.common.tradefed.targetprep.ReportLogCollector@4bb387cd' on device: 'SKBFXYWR0LWD' in 1 ms
05-06 10:26:59 D/InvocationExecution: starting preparer 'com.android.tradefed.targetprep.RunCommandTargetPreparer@27d48e1d' on device: 'SKBFXYWR0LWD'
05-06 10:26:59 D/RunUtil: Running command [adb, -s, SKBFXYWR0LWD, shell, pkill, memhog] with timeout: 2m 0s
05-06 10:26:59 D/RunCommandTargetPreparer: cmd: 'pkill memhog' failed, returned:
stdout:
stderr:
05-06 10:26:59 D/RunUtil: Running command [adb, -s, SKBFXYWR0LWD, shell, pkill, cpuhog] with timeout: 2m 0s
05-06 10:26:59 D/RunCommandTargetPreparer: cmd: 'pkill cpuhog' failed, returned:
stdout:
stderr:
05-06 10:26:59 D/RunUtil: Running command [adb, -s, SKBFXYWR0LWD, shell, pkill, adb_marker] with timeout: 2m 0s
05-06 10:26:59 D/RunCommandTargetPreparer: cmd: 'pkill adb_marker' failed, returned:
stdout:
stderr:
05-06 10:26:59 D/InvocationExecution: done with preparer 'com.android.tradefed.targetprep.RunCommandTargetPreparer@27d48e1d' on device: 'SKBFXYWR0LWD' in 215 ms
05-06 10:26:59 D/InvocationExecution: starting preparer 'com.android.compatibility.common.tradefed.targetprep.FilePusher@3cbb32c5' on device: 'SKBFXYWR0LWD'
05-06 10:26:59 D/PushFilePreparer: Trying to push local 'memhog' to remote '/data/local/tmp/memhog'
05-06 10:26:59 D/SearchArtifactUtil: Searching for file memhog. Search directories: [./../../android-tvts/testcases, /tmp/tf-workfolder7217006897044893041]
05-06 10:26:59 D/SearchArtifactUtil: Found file /home/dev2-google04/android-tvts/arm_android-tvts-2.14_r1/android-tvts/tools/./../../android-tvts/testcases/memhog in search directory /home/dev2-google04/android-tvts/arm_android-tvts-2.14_r1/android-tvts/tools/./../../android-tvts/testcases.
05-06 10:26:59 D/FilePermissionUtil: Reading file permission of /home/dev2-google04/android-tvts/arm_android-tvts-2.14_r1/android-tvts/tools/./../../android-tvts/testcases/memhog as: rwxr-xr-x
05-06 10:27:00 D/NativeDevice: pushed /home/dev2-google04/android-tvts/arm_android-tvts-2.14_r1/android-tvts/tools/./../../android-tvts/testcases/memhog to /data/local/tmp/memhog
05-06 10:27:00 D/PushFilePreparer: Trying to push local 'cpuhog' to remote '/data/local/tmp/cpuhog'
05-06 10:27:00 D/SearchArtifactUtil: Searching for file cpuhog. Search directories: [./../../android-tvts/testcases, /tmp/tf-workfolder7217006897044893041]
05-06 10:27:00 D/SearchArtifactUtil: Found file /home/dev2-google04/android-tvts/arm_android-tvts-2.14_r1/android-tvts/tools/./../../android-tvts/testcases/cpuhog in search directory /home/dev2-google04/android-tvts/arm_android-tvts-2.14_r1/android-tvts/tools/./../../android-tvts/testcases.
05-06 10:27:00 D/FilePermissionUtil: Reading file permission of /home/dev2-google04/android-tvts/arm_android-tvts-2.14_r1/android-tvts/tools/./../../android-tvts/testcases/cpuhog as: rwxr-xr-x
05-06 10:27:00 D/NativeDevice: pushed /home/dev2-google04/android-tvts/arm_android-tvts-2.14_r1/android-tvts/tools/./../../android-tvts/testcases/cpuhog to /data/local/tmp/cpuhog
05-06 10:27:00 D/PushFilePreparer: Trying to push local 'adb_marker' to remote '/data/local/tmp/adb_marker'
05-06 10:27:00 D/SearchArtifactUtil: Searching for file adb_marker. Search directories: [./../../android-tvts/testcases, /tmp/tf-workfolder7217006897044893041]
05-06 10:27:00 D/SearchArtifactUtil: Found file /home/dev2-google04/android-tvts/arm_android-tvts-2.14_r1/android-tvts/tools/./../../android-tvts/testcases/adb_marker in search directory /home/dev2-google04/android-tvts/arm_android-tvts-2.14_r1/android-tvts/tools/./../../android-tvts/testcases.
05-06 10:27:00 D/FilePermissionUtil: Reading file permission of /home/dev2-google04/android-tvts/arm_android-tvts-2.14_r1/android-tvts/tools/./../../android-tvts/testcases/adb_marker as: rwxr-xr-x
05-06 10:27:00 D/NativeDevice: pushed /home/dev2-google04/android-tvts/arm_android-tvts-2.14_r1/android-tvts/tools/./../../android-tvts/testcases/adb_marker to /data/local/tmp/adb_marker
05-06 10:27:00 D/InvocationExecution: done with preparer 'com.android.compatibility.common.tradefed.targetprep.FilePusher@3cbb32c5' on device: 'SKBFXYWR0LWD' in 195 ms
05-06 10:27:00 D/InvocationExecution: starting preparer 'com.android.tradefed.targetprep.RunCommandTargetPreparer@6db66e3a' on device: 'SKBFXYWR0LWD'
05-06 10:27:00 D/RunUtil: Running command [adb, -s, SKBFXYWR0LWD, shell, chmod, +x, /data/local/tmp/memhog] with timeout: 2m 0s
05-06 10:27:00 D/RunUtil: Running command [adb, -s, SKBFXYWR0LWD, shell, chmod, +x, /data/local/tmp/cpuhog] with timeout: 2m 0s
05-06 10:27:00 D/RunUtil: Running command [adb, -s, SKBFXYWR0LWD, shell, chmod, +x, /data/local/tmp/adb_marker] with timeout: 2m 0s
05-06 10:27:00 D/InvocationExecution: done with preparer 'com.android.tradefed.targetprep.RunCommandTargetPreparer@6db66e3a' on device: 'SKBFXYWR0LWD' in 131 ms
05-06 10:27:00 D/InvocationExecution: starting preparer 'com.android.compatibility.common.tradefed.targetprep.PropertyCheck@5c827850' on device: 'SKBFXYWR0LWD'
05-06 10:27:00 D/RunUtil: Running command [adb, -s, SKBFXYWR0LWD, shell, getprop, persist.sys.locale] with timeout: 45s
05-06 10:27:00 D/InvocationExecution: done with preparer 'com.android.compatibility.common.tradefed.targetprep.PropertyCheck@5c827850' on device: 'SKBFXYWR0LWD' in 36 ms
05-06 10:27:00 D/InvocationExecution: starting preparer 'com.android.compatibility.common.tradefed.targetprep.PropertyCheck@cefe483' on device: 'SKBFXYWR0LWD'
05-06 10:27:00 D/NativeDevice: Using property ro.build.type=user from cache.
05-06 10:27:00 D/InvocationExecution: done with preparer 'com.android.compatibility.common.tradefed.targetprep.PropertyCheck@cefe483' on device: 'SKBFXYWR0LWD' in 1 ms
05-06 10:27:00 D/InvocationExecution: starting preparer 'com.android.tradefed.targetprep.suite.SuiteApkInstaller@231dc906' on device: 'SKBFXYWR0LWD'
05-06 10:27:00 D/NativeDevice: Using property ro.build.version.sdk=29 from cache.
05-06 10:27:00 D/NativeDevice: Using property ro.build.version.codename=REL from cache.
05-06 10:27:00 D/NativeDevice: Using property ro.build.version.sdk=29 from cache.
05-06 10:27:00 D/NativeDevice: Using property ro.build.version.codename=REL from cache.
05-06 10:27:00 D/NativeDevice: Using property ro.build.version.sdk=29 from cache.
05-06 10:27:00 D/NativeDevice: Using property ro.build.version.codename=REL from cache.
05-06 10:27:00 D/SearchArtifactUtil: Searching for file TvtsDeviceInformationTests.apk. Search directories: [./../../android-tvts/testcases, /tmp/tf-workfolder7217006897044893041]
05-06 10:27:00 D/SearchArtifactUtil: Found file /home/dev2-google04/android-tvts/arm_android-tvts-2.14_r1/android-tvts/tools/./../../android-tvts/testcases/TvtsDeviceInformationTests.apk in search directory /home/dev2-google04/android-tvts/arm_android-tvts-2.14_r1/android-tvts/tools/./../../android-tvts/testcases.
05-06 10:27:00 D/RunUtil: Running command [aapt2, dump, badging, /home/dev2-google04/android-tvts/arm_android-tvts-2.14_r1/android-tvts/tools/./../../android-tvts/testcases/TvtsDeviceInformationTests.apk] with timeout: 1m 0s
05-06 10:27:00 D/RunUtil: Running command [aapt2, dump, xmltree, /home/dev2-google04/android-tvts/arm_android-tvts-2.14_r1/android-tvts/tools/./../../android-tvts/testcases/TvtsDeviceInformationTests.apk, --file, AndroidManifest.xml] with timeout: 1m 0s
05-06 10:27:00 D/TestAppInstallSetup: Installing apk com.google.android.resolution.tvts with [/home/dev2-google04/android-tvts/arm_android-tvts-2.14_r1/android-tvts/tools/./../../android-tvts/testcases/TvtsDeviceInformationTests.apk] ...
05-06 10:27:00 D/NativeDevice: Using property ro.build.version.sdk=29 from cache.
05-06 10:27:00 D/TvtsDeviceInformationTests.apk: Uploading TvtsDeviceInformationTests.apk onto device 'SKBFXYWR0LWD'
05-06 10:27:00 D/DeviceImpl: Uploading file onto device 'SKBFXYWR0LWD'
05-06 10:27:00 D/FilePermissionUtil: Reading file permission of /home/dev2-google04/android-tvts/arm_android-tvts-2.14_r1/android-tvts/tools/./../../android-tvts/testcases/TvtsDeviceInformationTests.apk as: rw-r--r--
05-06 10:27:01 D/RunUtil: Running command [aapt, dump, badging, /home/dev2-google04/android-tvts/arm_android-tvts-2.14_r1/android-tvts/tools/./../../android-tvts/testcases/TvtsDeviceInformationTests.apk] with timeout: 1m 0s
05-06 10:27:01 D/RunUtil: Running command [aapt, dump, xmltree, /home/dev2-google04/android-tvts/arm_android-tvts-2.14_r1/android-tvts/tools/./../../android-tvts/testcases/TvtsDeviceInformationTests.apk, AndroidManifest.xml] with timeout: 1m 0s
05-06 10:27:01 D/RunUtil: Running command [adb, -s, SKBFXYWR0LWD, shell, appops, write-settings] with timeout: 2m 0s
05-06 10:27:01 D/InvocationExecution: done with preparer 'com.android.tradefed.targetprep.suite.SuiteApkInstaller@231dc906' on device: 'SKBFXYWR0LWD' in 871 ms
05-06 10:27:01 D/InvocationExecution: starting preparer 'com.google.android.perfverify.tvts.TvtsSetupAndTearDown@22797fba' on device: 'SKBFXYWR0LWD'
05-06 10:27:01 D/InvocationExecution: done with preparer 'com.google.android.perfverify.tvts.TvtsSetupAndTearDown@22797fba' on device: 'SKBFXYWR0LWD' in 6 ms
05-06 10:27:01 D/InvocationExecution: starting preparer 'com.google.android.perfverify.tvts.prep.ApkChecker@67feb63c' on device: 'SKBFXYWR0LWD'
05-06 10:27:01 D/NativeDevice: Using property ro.build.version.sdk=29 from cache.
05-06 10:27:01 W/ApkChecker: Default min apk version: 530301320; Min apk version for Android API Level 29: null; Min APK version for this device: 530301320
05-06 10:27:01 D/RunUtil: Running command [adb, -s, SKBFXYWR0LWD, shell, dumpsys, package, com.google.android.youtube.tv|, grep, versionCode] with timeout: 2m 0s
05-06 10:27:01 W/ApkChecker: The newest VersionCode found for the Package com.google.android.youtube.tv:  530320320
05-06 10:27:01 D/InvocationExecution: done with preparer 'com.google.android.perfverify.tvts.prep.ApkChecker@67feb63c' on device: 'SKBFXYWR0LWD' in 84 ms
05-06 10:27:01 D/InvocationExecution: starting preparer 'com.google.android.perfverify.tvts.prep.ApkChecker@23d785dc' on device: 'SKBFXYWR0LWD'
05-06 10:27:01 D/NativeDevice: Using property ro.build.version.sdk=29 from cache.
05-06 10:27:01 W/ApkChecker: Default min apk version: 15005843; Min apk version for Android API Level 29: null; Min APK version for this device: 15005843
05-06 10:27:01 D/RunUtil: Running command [adb, -s, SKBFXYWR0LWD, shell, dumpsys, package, com.google.android.katniss|, grep, versionCode] with timeout: 2m 0s
05-06 10:27:01 W/ApkChecker: The newest VersionCode found for the Package com.google.android.katniss:  15032599
05-06 10:27:01 D/InvocationExecution: done with preparer 'com.google.android.perfverify.tvts.prep.ApkChecker@23d785dc' on device: 'SKBFXYWR0LWD' in 58 ms
05-06 10:27:01 D/InvocationExecution: starting preparer 'com.google.android.perfverify.tvts.prep.ApkChecker@7cf339cd' on device: 'SKBFXYWR0LWD'
05-06 10:27:01 D/NativeDevice: Using property ro.build.version.sdk=29 from cache.
05-06 10:27:01 W/ApkChecker: Default min apk version: 551074470; Min apk version for Android API Level 29: 517321270; Min APK version for this device: 517321270
05-06 10:27:01 D/RunUtil: Running command [adb, -s, SKBFXYWR0LWD, shell, dumpsys, package, com.google.android.play.games|, grep, versionCode] with timeout: 2m 0s
05-06 10:27:01 W/ApkChecker: The newest VersionCode found for the Package com.google.android.play.games:  624523470
05-06 10:27:01 D/InvocationExecution: done with preparer 'com.google.android.perfverify.tvts.prep.ApkChecker@7cf339cd' on device: 'SKBFXYWR0LWD' in 65 ms
05-06 10:27:01 D/InvocationExecution: starting preparer 'com.google.android.perfverify.tvts.prep.ApkChecker@6e1586fc' on device: 'SKBFXYWR0LWD'
05-06 10:27:01 D/NativeDevice: Using property ro.build.version.sdk=29 from cache.
05-06 10:27:01 W/ApkChecker: Default min apk version: 1010927817; Min apk version for Android API Level 29: null; Min APK version for this device: 1010927817
05-06 10:27:01 D/RunUtil: Running command [adb, -s, SKBFXYWR0LWD, shell, dumpsys, package, com.google.android.tvlauncher|, grep, versionCode] with timeout: 2m 0s
05-06 10:27:01 W/ApkChecker: Property "com.google.android.tvlauncher" not found on device, cannot verify value "1010927817" 
05-06 10:27:01 D/InvocationExecution: done with preparer 'com.google.android.perfverify.tvts.prep.ApkChecker@6e1586fc' on device: 'SKBFXYWR0LWD' in 52 ms
05-06 10:27:01 D/InvocationExecution: starting preparer 'com.google.android.perfverify.tvts.prep.ApkChecker@7cc88254' on device: 'SKBFXYWR0LWD'
05-06 10:27:01 D/NativeDevice: Using property ro.build.version.sdk=29 from cache.
05-06 10:27:01 W/ApkChecker: Default min apk version: 1010918449; Min apk version for Android API Level 29: null; Min APK version for this device: 1010918449
05-06 10:27:01 D/RunUtil: Running command [adb, -s, SKBFXYWR0LWD, shell, dumpsys, package, com.google.android.tvrecommendations|, grep, versionCode] with timeout: 2m 0s
05-06 10:27:01 W/ApkChecker: The newest VersionCode found for the Package com.google.android.tvrecommendations:  1010926449
05-06 10:27:01 D/InvocationExecution: done with preparer 'com.google.android.perfverify.tvts.prep.ApkChecker@7cc88254' on device: 'SKBFXYWR0LWD' in 57 ms
05-06 10:27:01 D/InvocationExecution: starting preparer 'com.google.android.perfverify.tvts.prep.ApkChecker@632e1174' on device: 'SKBFXYWR0LWD'
05-06 10:27:01 D/NativeDevice: Using property ro.build.version.sdk=29 from cache.
05-06 10:27:01 W/ApkChecker: Default min apk version: 1007000; Min apk version for Android API Level 29: null; Min APK version for this device: 1007000
05-06 10:27:01 D/RunUtil: Running command [adb, -s, SKBFXYWR0LWD, shell, dumpsys, package, com.google.android.backdrop|, grep, versionCode] with timeout: 2m 0s
05-06 10:27:01 W/ApkChecker: The newest VersionCode found for the Package com.google.android.backdrop:  1008002
05-06 10:27:01 D/InvocationExecution: done with preparer 'com.google.android.perfverify.tvts.prep.ApkChecker@632e1174' on device: 'SKBFXYWR0LWD' in 57 ms
05-06 10:27:01 D/InvocationExecution: starting preparer 'com.google.android.perfverify.tvts.prep.ApkChecker@676718d' on device: 'SKBFXYWR0LWD'
05-06 10:27:01 D/NativeDevice: Using property ro.build.version.sdk=29 from cache.
05-06 10:27:01 W/ApkChecker: Default min apk version: 148255165; Min apk version for Android API Level 29: null; Min APK version for this device: 148255165
05-06 10:27:01 D/RunUtil: Running command [adb, -s, SKBFXYWR0LWD, shell, dumpsys, package, com.google.android.inputmethod.latin|, grep, versionCode] with timeout: 2m 0s
05-06 10:27:01 W/ApkChecker: Property "com.google.android.inputmethod.latin" not found on device, cannot verify value "148255165" 
05-06 10:27:01 D/InvocationExecution: done with preparer 'com.google.android.perfverify.tvts.prep.ApkChecker@676718d' on device: 'SKBFXYWR0LWD' in 51 ms
05-06 10:27:01 D/InvocationExecution: starting preparer 'com.google.android.perfverify.tvts.prep.ApkChecker@441635d9' on device: 'SKBFXYWR0LWD'
05-06 10:27:01 D/NativeDevice: Using property ro.build.version.sdk=29 from cache.
05-06 10:27:01 W/ApkChecker: Default min apk version: 694312130; Min apk version for Android API Level 29: null; Min APK version for this device: 694312130
05-06 10:27:01 D/RunUtil: Running command [adb, -s, SKBFXYWR0LWD, shell, dumpsys, package, com.google.android.webview|, grep, versionCode] with timeout: 2m 0s
05-06 10:27:01 W/ApkChecker: The newest VersionCode found for the Package com.google.android.webview:  772711100
05-06 10:27:01 D/InvocationExecution: done with preparer 'com.google.android.perfverify.tvts.prep.ApkChecker@441635d9' on device: 'SKBFXYWR0LWD' in 56 ms
05-06 10:27:01 D/InvocationExecution: starting preparer 'com.google.android.perfverify.tvts.prep.ApkChecker@7cf4c52d' on device: 'SKBFXYWR0LWD'
05-06 10:27:01 D/NativeDevice: Using property ro.build.version.sdk=29 from cache.
05-06 10:27:01 W/ApkChecker: Default min apk version: 245034118; Min apk version for Android API Level 29: 242632116; Min APK version for this device: 242632116
05-06 10:27:01 D/RunUtil: Running command [adb, -s, SKBFXYWR0LWD, shell, dumpsys, package, com.google.android.gms|, grep, versionCode] with timeout: 2m 0s
05-06 10:27:01 W/ApkChecker: The newest VersionCode found for the Package com.google.android.gms:  261631115
05-06 10:27:01 D/InvocationExecution: done with preparer 'com.google.android.perfverify.tvts.prep.ApkChecker@7cf4c52d' on device: 'SKBFXYWR0LWD' in 135 ms
05-06 10:27:01 D/InvocationExecution: starting preparer 'com.google.android.perfverify.tvts.prep.ApkChecker@6f42de76' on device: 'SKBFXYWR0LWD'
05-06 10:27:01 D/NativeDevice: Using property ro.build.version.sdk=29 from cache.
05-06 10:27:01 W/ApkChecker: Default min apk version: 84541718; Min apk version for Android API Level 29: 84541708; Min APK version for this device: 84541708
05-06 10:27:01 D/RunUtil: Running command [adb, -s, SKBFXYWR0LWD, shell, dumpsys, package, com.android.vending|, grep, versionCode] with timeout: 2m 0s
05-06 10:27:01 W/ApkChecker: The newest VersionCode found for the Package com.android.vending:  85101708
05-06 10:27:01 D/InvocationExecution: done with preparer 'com.google.android.perfverify.tvts.prep.ApkChecker@6f42de76' on device: 'SKBFXYWR0LWD' in 67 ms
05-06 10:27:01 D/InvocationExecution: starting preparer 'com.google.android.perfverify.tvts.prep.ApkChecker@5a0d300a' on device: 'SKBFXYWR0LWD'
05-06 10:27:01 D/NativeDevice: Using property ro.build.version.sdk=29 from cache.
05-06 10:27:01 W/ApkChecker: Default min apk version: 2018117052; Min apk version for Android API Level 29: null; Min APK version for this device: 2018117052
05-06 10:27:01 D/RunUtil: Running command [adb, -s, SKBFXYWR0LWD, shell, dumpsys, package, com.google.android.tungsten.setupwraith|, grep, versionCode] with timeout: 2m 0s
05-06 10:27:01 W/ApkChecker: The newest VersionCode found for the Package com.google.android.tungsten.setupwraith:  2018122044
05-06 10:27:01 D/InvocationExecution: done with preparer 'com.google.android.perfverify.tvts.prep.ApkChecker@5a0d300a' on device: 'SKBFXYWR0LWD' in 62 ms
05-06 10:27:01 D/InvocationExecution: starting preparer 'com.google.android.perfverify.tvts.prep.ApkChecker@2f406e6f' on device: 'SKBFXYWR0LWD'
05-06 10:27:01 D/NativeDevice: Using property ro.build.version.sdk=29 from cache.
05-06 10:27:01 W/ApkChecker: Default min apk version: 626417; Min apk version for Android API Level 29: null; Min APK version for this device: 626417
05-06 10:27:01 D/RunUtil: Running command [adb, -s, SKBFXYWR0LWD, shell, dumpsys, package, com.google.android.apps.tv.launcherx|, grep, versionCode] with timeout: 2m 0s
05-06 10:27:01 W/ApkChecker: Property "com.google.android.apps.tv.launcherx" not found on device, cannot verify value "626417" 
05-06 10:27:01 D/InvocationExecution: done with preparer 'com.google.android.perfverify.tvts.prep.ApkChecker@2f406e6f' on device: 'SKBFXYWR0LWD' in 53 ms
05-06 10:27:01 D/InvocationExecution: starting preparer 'com.google.android.perfverify.tvts.prep.ApkChecker@75471b07' on device: 'SKBFXYWR0LWD'
05-06 10:27:01 D/NativeDevice: Using property ro.build.version.sdk=29 from cache.
05-06 10:27:01 W/ApkChecker: Default min apk version: 95855494; Min apk version for Android API Level 29: null; Min APK version for this device: 95855494
05-06 10:27:01 D/RunUtil: Running command [adb, -s, SKBFXYWR0LWD, shell, dumpsys, package, com.google.android.tv.remote.service|, grep, versionCode] with timeout: 2m 0s
05-06 10:27:02 W/ApkChecker: The newest VersionCode found for the Package com.google.android.tv.remote.service:  95855530
05-06 10:27:02 D/InvocationExecution: done with preparer 'com.google.android.perfverify.tvts.prep.ApkChecker@75471b07' on device: 'SKBFXYWR0LWD' in 58 ms
05-06 10:27:02 D/InvocationExecution: Done with setup of device: 'SKBFXYWR0LWD'
05-06 10:27:02 D/RunUtil: Running command [adb, -s, SKBFXYWR0LWD, shell, uname, -a] with timeout: 2m 0s
05-06 10:27:02 I/InvocationExecution: Device SKBFXYWR0LWD kernel information: 'Linux localhost 4.9.178 #1 SMP PREEMPT Fri Apr 24 16:08:38 KST 2026 armv8l'
05-06 10:27:02 D/RunUtil: Running command [adb, -s, SKBFXYWR0LWD, shell, getprop, ro.system.build.fingerprint] with timeout: 45s
05-06 10:27:02 I/InvocationExecution: Device SKBFXYWR0LWD system image build information: 'SKB/BFX_UA300/BFX-UA300:10/QT/19.561.113-20260424:user/release-keys'
05-06 10:27:02 D/NativeDevice: Using property ro.vendor.build.fingerprint=SKB/BFX_UA300/BFX-UA300:10/QT/19.561.113-20260424:user/release-keys from cache.
05-06 10:27:02 I/InvocationExecution: Device SKBFXYWR0LWD vendor image build information: 'SKB/BFX_UA300/BFX-UA300:10/QT/19.561.113-20260424:user/release-keys'
05-06 10:27:02 D/InvocationExecution: Total setup duration: 38s'
05-06 10:27:02 D/LogFileSaver: Log data for device_logcat_setup_SKBFXYWR0LWD is already compressed, skipping compression
05-06 10:27:02 D/FileUtil: Creating temp file at /home/dev2-google04/android-tvts/arm_android-tvts-2.14_r1/android-tvts/tools/./../../android-tvts/logs/2026.05.06_10.26.23/inv_8236708342172730979 with prefix "device_logcat_setup_SKBFXYWR0LWD_" suffix ".txt"
05-06 10:27:02 I/LogFileSaver: Saved log file /home/dev2-google04/android-tvts/arm_android-tvts-2.14_r1/android-tvts/tools/./../../android-tvts/logs/2026.05.06_10.26.23/inv_8236708342172730979/device_logcat_setup_SKBFXYWR0LWD_12970773267488671447.txt. [size=1690464, elapsed=7ms]
05-06 10:27:02 D/CertificationSuiteResultReporter: Saved logs for device_logcat_setup_SKBFXYWR0LWD in /home/dev2-google04/android-tvts/arm_android-tvts-2.14_r1/android-tvts/tools/./../../android-tvts/logs/2026.05.06_10.26.23/inv_8236708342172730979/device_logcat_setup_SKBFXYWR0LWD_12970773267488671447.txt
05-06 10:27:02 D/LogFileSaver: Log data for device_logcat_setup_SKBFXYWR0LWD is already compressed, skipping compression
05-06 10:27:02 D/FileUtil: Creating temp file at /tmp/13641659/tvts/inv_14923917419519687788/inv_9146255718902668723 with prefix "device_logcat_setup_SKBFXYWR0LWD_" suffix ".txt"
05-06 10:27:02 I/LogFileSaver: Saved log file /tmp/13641659/tvts/inv_14923917419519687788/inv_9146255718902668723/device_logcat_setup_SKBFXYWR0LWD_16008897557715041134.txt. [size=1690464, elapsed=8ms]
05-06 10:27:02 D/PrettyPrintDelimiter: 
===============================
===== TEST PHASE STARTING =====
===============================
05-06 10:27:02 D/TestDevice: No snapuserd notification in progress for BLOCK_BEFORE_TEST
05-06 10:27:02 D/RunUtil: Running command [adb, -s, SKBFXYWR0LWD, shell, cmd, device_state, print-states] with timeout: 2m 0s
05-06 10:27:02 D/NativeDevice: Using property ro.product.cpu.abi=armeabi-v7a from cache.
05-06 10:27:02 D/BaseTestSuite: Initializing ModuleRepo
ABIs:[{armeabi-v7a, bitness=32}]
Test Args:[com.android.tradefed.testtype.AndroidJUnitTest:rerun-from-file:true, com.android.tradefed.testtype.AndroidJUnitTest:fallback-to-serial-rerun:false, com.android.compatibility.testtype.LibcoreTest:rerun-from-file:true, com.android.compatibility.testtype.LibcoreTest:fallback-to-serial-rerun:false]
Module Args:[TvtsBootToBootCompletedHostTestCases:set-option:measure-launcher-cold-start:true]
Includes: {armeabi-v7a TvConcurrentMediaPlaybackHostTestCases=[TvConcurrentMediaPlaybackHostTestCases]}

05-06 10:27:02 D/BaseTestSuite: Loading tests from [/home/dev2-google04/android-tvts/arm_android-tvts-2.14_r1/android-tvts/tools/./../../android-tvts/testcases]
05-06 10:27:02 D/ITestSuite: No remote build info, skipping stageTestArtifacts
05-06 10:27:02 D/ITestSuite: Resource not found for allowed preparers: /suite/google-allowed-preparers.txt
05-06 10:27:02 D/ITestSuite: [Total Unique Modules = 1]
05-06 10:27:02 I/ITestSuite: SKBFXYWR0LWD running 1 modules: [armeabi-v7a TvConcurrentMediaPlaybackHostTestCases]
05-06 10:27:02 D/TradefedFeatureClient: invoking feature 'skipFeature'
05-06 10:27:02 D/TradefedFeatureClient: Using reference id from metrics.
05-06 10:27:02 D/TradefedFeatureClient: name: "skipFeature"
reference_id: "cf153537-b38f-4730-9db4-f390443d0f63"

05-06 10:27:03 D/TradefedFeatureServer: Executing com.android.tradefed.result.skipped.SkipFeature@3d97cf8 with [name: "skipFeature"
reference_id: "cf153537-b38f-4730-9db4-f390443d0f63"
]
05-06 10:27:03 D/TradefedFeatureClient: Feature name: skipFeature. response: multi_part_response {
  response_part {
    key: "delimiter"
    value: "\\+,"
  }
  response_part {
    key: "presubmit"
    value: "false"
  }
  response_part {
    key: "skipModules"
  }
  response_part {
    key: "imageDigests"
  }
}

05-06 10:27:03 D/BaseTestSuite: Filters for 'armeabi-v7a TvConcurrentMediaPlaybackHostTestCases': []
05-06 10:27:03 D/ITestSuite: com.google.android.perfverify.tvts.collectors.DebugHostLogCollector@14730fd9 isn't applicable at module level. Skipping.
05-06 10:27:03 D/FileUtil: Creating temp file at /tmp/tf-workfolder7217006897044893041 with prefix "TvConcurrentMediaPlaybackHostTestCases" suffix ".xml"
05-06 10:27:03 D/LogFileSaver: Log data for module-configuration is already compressed, skipping compression
05-06 10:27:03 D/FileUtil: Creating temp file at /home/dev2-google04/android-tvts/arm_android-tvts-2.14_r1/android-tvts/tools/./../../android-tvts/logs/2026.05.06_10.26.23/inv_8236708342172730979 with prefix "module-configuration_" suffix ".xml"
05-06 10:27:03 I/LogFileSaver: Saved log file /home/dev2-google04/android-tvts/arm_android-tvts-2.14_r1/android-tvts/tools/./../../android-tvts/logs/2026.05.06_10.26.23/inv_8236708342172730979/module-configuration_10280974152901473852.xml. [size=2062, elapsed=1ms]
05-06 10:27:03 D/CertificationSuiteResultReporter: Saved logs for module-configuration in /home/dev2-google04/android-tvts/arm_android-tvts-2.14_r1/android-tvts/tools/./../../android-tvts/logs/2026.05.06_10.26.23/inv_8236708342172730979/module-configuration_10280974152901473852.xml
05-06 10:27:03 D/LogFileSaver: Log data for module-configuration is already compressed, skipping compression
05-06 10:27:03 D/FileUtil: Creating temp file at /tmp/13641659/tvts/inv_14923917419519687788/inv_9146255718902668723 with prefix "module-configuration_" suffix ".xml"
05-06 10:27:03 I/LogFileSaver: Saved log file /tmp/13641659/tvts/inv_14923917419519687788/inv_9146255718902668723/module-configuration_2815757090807335219.xml (type:HARNESS_CONFIG). [size=2062, elapsed=0ms]
05-06 10:27:03 D/ModuleDefinition: Running module armeabi-v7a TvConcurrentMediaPlaybackHostTestCases
05-06 10:27:03 D/ModuleDefinition: Running setup preparer: DynamicConfigPusher
05-06 10:27:03 I/UrlReplacement: UrlReplacement file [/home/dev2-google04/android-tvts/arm_android-tvts-2.14_r1/android-tvts/tools/UrlReplacement.xml] does not exist
05-06 10:27:03 D/SearchArtifactUtil: Searching for file CtsTVConcurrentPlaybackTestCases.dynamic. Search directories: [/home/dev2-google04/android-tvts/arm_android-tvts-2.14_r1/android-tvts/tools/./../../android-tvts/testcases, ./../../android-tvts/testcases, /tmp/tf-workfolder7217006897044893041]
05-06 10:27:03 W/SearchArtifactUtil: we have a module name: TvConcurrentMediaPlaybackHostTestCases but no directory found in /home/dev2-google04/android-tvts/arm_android-tvts-2.14_r1/android-tvts/tools/./../../android-tvts/testcases.
05-06 10:27:03 D/SearchArtifactUtil: Found file /home/dev2-google04/android-tvts/arm_android-tvts-2.14_r1/android-tvts/tools/./../../android-tvts/testcases/CtsTVConcurrentPlaybackTestCases.dynamic in search directory /home/dev2-google04/android-tvts/arm_android-tvts-2.14_r1/android-tvts/tools/./../../android-tvts/testcases.
05-06 10:27:03 I/DynamicConfigPusher: Replacing {suite-name} placeholder with CTS from test suite tags in dynamic config url.
05-06 10:27:03 D/ModuleDefinition: Running setup preparer: DynamicConfigPusher
05-06 10:27:03 D/SearchArtifactUtil: Searching for file CtsTVConcurrentPlaybackTestCases.dynamic. Search directories: [/home/dev2-google04/android-tvts/arm_android-tvts-2.14_r1/android-tvts/tools/./../../android-tvts/testcases, ./../../android-tvts/testcases, /tmp/tf-workfolder7217006897044893041]
05-06 10:27:03 W/SearchArtifactUtil: we have a module name: TvConcurrentMediaPlaybackHostTestCases but no directory found in /home/dev2-google04/android-tvts/arm_android-tvts-2.14_r1/android-tvts/tools/./../../android-tvts/testcases.
05-06 10:27:03 D/SearchArtifactUtil: Found file /home/dev2-google04/android-tvts/arm_android-tvts-2.14_r1/android-tvts/tools/./../../android-tvts/testcases/CtsTVConcurrentPlaybackTestCases.dynamic in search directory /home/dev2-google04/android-tvts/arm_android-tvts-2.14_r1/android-tvts/tools/./../../android-tvts/testcases.
05-06 10:27:03 I/DynamicConfigPusher: Replacing {suite-name} placeholder with CTS from test suite tags in dynamic config url.
05-06 10:27:03 D/NativeDevice: Using property ro.build.version.sdk=29 from cache.
05-06 10:27:03 D/FilePermissionUtil: Reading file permission of /tmp/CtsTVConcurrentPlaybackTestCases2171007756334488178.dynamic as: rw-rw-r--
05-06 10:27:03 D/NativeDevice: pushed /tmp/CtsTVConcurrentPlaybackTestCases2171007756334488178.dynamic to /sdcard/dynamic-config-files/CtsTVConcurrentPlaybackTestCases.dynamic
05-06 10:27:03 D/NativeDevice: Using property ro.build.version.sdk=29 from cache.
05-06 10:27:03 D/NativeDevice: Using property ro.build.version.sdk=29 from cache.
05-06 10:27:03 D/NativeDevice: Using property ro.build.version.sdk=29 from cache.
05-06 10:27:03 D/TradefedContentProvider.apk6615771151432548271.apk: Uploading TradefedContentProvider.apk6615771151432548271.apk onto device 'SKBFXYWR0LWD'
05-06 10:27:03 D/DeviceImpl: Uploading file onto device 'SKBFXYWR0LWD'
05-06 10:27:03 D/FilePermissionUtil: Reading file permission of /tmp/TradefedContentProvider.apk6615771151432548271.apk as: rw-rw-r--
05-06 10:27:04 D/RunUtil: Running command [aapt, dump, badging, /tmp/TradefedContentProvider.apk6615771151432548271.apk] with timeout: 1m 0s
05-06 10:27:04 D/RunUtil: Running command [aapt, dump, xmltree, /tmp/TradefedContentProvider.apk6615771151432548271.apk, AndroidManifest.xml] with timeout: 1m 0s
05-06 10:27:04 D/RunUtil: Running command [adb, -s, SKBFXYWR0LWD, shell, appops, write-settings] with timeout: 2m 0s
05-06 10:27:04 D/RunUtil: Running command [adb, -s, SKBFXYWR0LWD, shell, cmd, appops, set, android.tradefed.contentprovider, android:legacy_storage, allow] with timeout: 2m 0s
05-06 10:27:04 D/RunUtil: Running command [adb, -s, SKBFXYWR0LWD, shell, cmd, appops, get, android.tradefed.contentprovider] with timeout: 2m 0s
05-06 10:27:04 D/ModuleDefinition: Running setup preparer: MediaPreparer
05-06 10:27:04 D/NativeDevice: Using property ro.build.version.sdk=29 from cache.
05-06 10:27:05 I/MediaPreparer: host downloads to: /tmp/CtsTVConcurrentPlaybackTestCases-1.7
05-06 10:27:05 I/MediaPreparer: Downloading media files from https://storage.googleapis.com/android_media/misc/tvconcurrent/CtsTVConcurrentPlaybackTestCases-1.7.zip
05-06 10:28:03 I/MediaPreparer: Unzipping media files
05-06 10:28:05 I/MediaPreparer: Generating cache TOC
05-06 10:28:05 I/MediaPreparer: Media files located on host at: /tmp/CtsTVConcurrentPlaybackTestCases-1.7/CtsTVConcurrentPlaybackTestCases-1.7
05-06 10:28:05 D/ModuleDefinition: Running setup preparer: SuiteApkInstaller
05-06 10:28:05 D/TestAppInstallSetup: Using abi armeabi-v7a from abi option.
05-06 10:28:05 D/NativeDevice: Using property ro.build.version.sdk=29 from cache.
05-06 10:28:05 D/NativeDevice: Using property ro.build.version.sdk=29 from cache.
05-06 10:28:05 D/NativeDevice: Using property ro.build.version.codename=REL from cache.
05-06 10:28:05 D/NativeDevice: Using property ro.build.version.sdk=29 from cache.
05-06 10:28:05 D/NativeDevice: Using property ro.build.version.codename=REL from cache.
05-06 10:28:05 D/NativeDevice: Using property ro.build.version.sdk=29 from cache.
05-06 10:28:05 D/NativeDevice: Using property ro.build.version.codename=REL from cache.
05-06 10:28:05 D/SearchArtifactUtil: Searching for file CtsTVConcurrentPlaybackTestCases.apk. Search directories: [/home/dev2-google04/android-tvts/arm_android-tvts-2.14_r1/android-tvts/tools/./../../android-tvts/testcases, ./../../android-tvts/testcases, /tmp/tf-workfolder7217006897044893041]
05-06 10:28:05 W/SearchArtifactUtil: we have a module name: TvConcurrentMediaPlaybackHostTestCases but no directory found in /home/dev2-google04/android-tvts/arm_android-tvts-2.14_r1/android-tvts/tools/./../../android-tvts/testcases.
05-06 10:28:05 D/SearchArtifactUtil: Found file /home/dev2-google04/android-tvts/arm_android-tvts-2.14_r1/android-tvts/tools/./../../android-tvts/testcases/CtsTVConcurrentPlaybackTestCases.apk in search directory /home/dev2-google04/android-tvts/arm_android-tvts-2.14_r1/android-tvts/tools/./../../android-tvts/testcases.
05-06 10:28:05 D/RunUtil: Running command [aapt2, dump, badging, /home/dev2-google04/android-tvts/arm_android-tvts-2.14_r1/android-tvts/tools/./../../android-tvts/testcases/CtsTVConcurrentPlaybackTestCases.apk] with timeout: 1m 0s
05-06 10:28:05 D/RunUtil: Running command [aapt2, dump, xmltree, /home/dev2-google04/android-tvts/arm_android-tvts-2.14_r1/android-tvts/tools/./../../android-tvts/testcases/CtsTVConcurrentPlaybackTestCases.apk, --file, AndroidManifest.xml] with timeout: 1m 0s
05-06 10:28:05 D/TestAppInstallSetup: Installing apk android.tvconcurrent.tvts with [/home/dev2-google04/android-tvts/arm_android-tvts-2.14_r1/android-tvts/tools/./../../android-tvts/testcases/CtsTVConcurrentPlaybackTestCases.apk] ...
05-06 10:28:05 D/NativeDevice: Using property ro.build.version.sdk=29 from cache.
05-06 10:28:05 D/CtsTVConcurrentPlaybackTestCases.apk: Uploading CtsTVConcurrentPlaybackTestCases.apk onto device 'SKBFXYWR0LWD'
05-06 10:28:05 D/DeviceImpl: Uploading file onto device 'SKBFXYWR0LWD'
05-06 10:28:05 D/FilePermissionUtil: Reading file permission of /home/dev2-google04/android-tvts/arm_android-tvts-2.14_r1/android-tvts/tools/./../../android-tvts/testcases/CtsTVConcurrentPlaybackTestCases.apk as: rw-r--r--
05-06 10:28:09 D/RunUtil: Running command [aapt, dump, badging, /home/dev2-google04/android-tvts/arm_android-tvts-2.14_r1/android-tvts/tools/./../../android-tvts/testcases/CtsTVConcurrentPlaybackTestCases.apk] with timeout: 1m 0s
05-06 10:28:09 D/RunUtil: Running command [aapt, dump, xmltree, /home/dev2-google04/android-tvts/arm_android-tvts-2.14_r1/android-tvts/tools/./../../android-tvts/testcases/CtsTVConcurrentPlaybackTestCases.apk, AndroidManifest.xml] with timeout: 1m 0s
05-06 10:28:09 D/NativeDevice: Using property ro.build.version.sdk=29 from cache.
05-06 10:28:09 D/RunUtil: Running command [adb, -s, SKBFXYWR0LWD, shell, appops, set, --user, 0, --uid, android.tvconcurrent.tvts, MANAGE_EXTERNAL_STORAGE, 0] with timeout: 2m 0s
05-06 10:28:09 E/TestDevice: Failed to set MANAGE_EXTERNAL_STORAGE App Op to allow legacy external storage for: android.tvconcurrent.tvts ; stderr: Error: Unknown operation string: MANAGE_EXTERNAL_STORAGE

05-06 10:28:09 D/RunUtil: Running command [adb, -s, SKBFXYWR0LWD, shell, appops, write-settings] with timeout: 2m 0s
05-06 10:28:09 D/PrettyTestEventLogger: 
==================== com.google.android.tv.concurrent.TvConcurrentPlaybackHostTest RUN STARTED: Wed May 06 10:28:09 KST 2026 ====================
05-06 10:28:09 I/ConsoleReporter: [SKBFXYWR0LWD] Starting armeabi-v7a TvConcurrentMediaPlaybackHostTestCases with 9 tests
05-06 10:28:09 D/ModuleListener: ModuleListener.testRunStarted(com.google.android.tv.concurrent.TvConcurrentPlaybackHostTest, 9, 0) on SKBFXYWR0LWD
05-06 10:28:09 D/PrettyTestEventLogger: 
==================== com.google.android.tv.concurrent.TvConcurrentPlaybackHostTest#testConcurrentQuadPlayback[0_CpuHog_false_MemHog_false] STARTED: Wed May 06 10:28:09 KST 2026 ====================
05-06 10:28:09 D/ModuleListener: ModuleListener.testStarted(com.google.android.tv.concurrent.TvConcurrentPlaybackHostTest#testConcurrentQuadPlayback[0_CpuHog_false_MemHog_false]) on SKBFXYWR0LWD
05-06 10:28:09 D/NativeDevice: Using property ro.build.version.sdk=29 from cache.
05-06 10:28:09 D/DeviceHostUtils: apiLevel: 29
05-06 10:28:09 D/ListInstrumentationParser: instrumentation:android.tvconcurrent.tvts/androidx.test.runner.AndroidJUnitRunner (target=android.tvconcurrent.tvts)
05-06 10:28:09 D/ListInstrumentationParser: instrumentation:com.google.android.resolution.tvts/androidx.test.runner.AndroidJUnitRunner (target=com.google.android.resolution.tvts)
05-06 10:28:09 D/ListInstrumentationParser: 
05-06 10:28:09 I/RemoteAndroidTestRunner: Running am instrument -w -r --abi armeabi-v7a  -e timeout_msec 600000 -e class 'com.google.android.resolution.tvts.DeviceResolutionTest#testMimeTypeVp9Uhd' com.google.android.resolution.tvts/androidx.test.runner.AndroidJUnitRunner on foxconn-bfx_ua300-SKBFXYWR0LWD
05-06 10:28:11 I/BaseHostJUnit4Test: Test com.google.android.resolution.tvts.DeviceResolutionTest#testMimeTypeVp9Uhd: PASSED
05-06 10:28:12 D/ListInstrumentationParser: instrumentation:android.tvconcurrent.tvts/androidx.test.runner.AndroidJUnitRunner (target=android.tvconcurrent.tvts)
05-06 10:28:12 D/ListInstrumentationParser: instrumentation:com.google.android.resolution.tvts/androidx.test.runner.AndroidJUnitRunner (target=com.google.android.resolution.tvts)
05-06 10:28:12 D/ListInstrumentationParser: 
05-06 10:28:12 I/RemoteAndroidTestRunner: Running am instrument -w -r --abi armeabi-v7a  -e timeout_msec 600000 -e class 'com.google.android.resolution.tvts.DeviceResolutionTest#testMimeTypeVp9Wqhd' com.google.android.resolution.tvts/androidx.test.runner.AndroidJUnitRunner on foxconn-bfx_ua300-SKBFXYWR0LWD
05-06 10:28:14 I/BaseHostJUnit4Test: Test com.google.android.resolution.tvts.DeviceResolutionTest#testMimeTypeVp9Wqhd: PASSED
05-06 10:28:14 D/ListInstrumentationParser: instrumentation:android.tvconcurrent.tvts/androidx.test.runner.AndroidJUnitRunner (target=android.tvconcurrent.tvts)
05-06 10:28:14 D/ListInstrumentationParser: instrumentation:com.google.android.resolution.tvts/androidx.test.runner.AndroidJUnitRunner (target=com.google.android.resolution.tvts)
05-06 10:28:14 D/ListInstrumentationParser: 
05-06 10:28:14 I/RemoteAndroidTestRunner: Running am instrument -w -r --abi armeabi-v7a  -e timeout_msec 600000 -e class 'com.google.android.resolution.tvts.DeviceResolutionTest#testMimeTypeVp9Fhd' com.google.android.resolution.tvts/androidx.test.runner.AndroidJUnitRunner on foxconn-bfx_ua300-SKBFXYWR0LWD
05-06 10:28:16 I/BaseHostJUnit4Test: Test com.google.android.resolution.tvts.DeviceResolutionTest#testMimeTypeVp9Fhd: PASSED
05-06 10:28:16 D/ListInstrumentationParser: instrumentation:android.tvconcurrent.tvts/androidx.test.runner.AndroidJUnitRunner (target=android.tvconcurrent.tvts)
05-06 10:28:16 D/ListInstrumentationParser: instrumentation:com.google.android.resolution.tvts/androidx.test.runner.AndroidJUnitRunner (target=com.google.android.resolution.tvts)
05-06 10:28:16 D/ListInstrumentationParser: 
05-06 10:28:16 I/RemoteAndroidTestRunner: Running am instrument -w -r --abi armeabi-v7a  -e timeout_msec 600000 -e class 'com.google.android.resolution.tvts.DeviceResolutionTest#testMimeTypeVp9Hd' com.google.android.resolution.tvts/androidx.test.runner.AndroidJUnitRunner on foxconn-bfx_ua300-SKBFXYWR0LWD
05-06 10:28:18 I/BaseHostJUnit4Test: Test com.google.android.resolution.tvts.DeviceResolutionTest#testMimeTypeVp9Hd: PASSED
05-06 10:28:18 D/ListInstrumentationParser: instrumentation:android.tvconcurrent.tvts/androidx.test.runner.AndroidJUnitRunner (target=android.tvconcurrent.tvts)
05-06 10:28:18 D/ListInstrumentationParser: instrumentation:com.google.android.resolution.tvts/androidx.test.runner.AndroidJUnitRunner (target=com.google.android.resolution.tvts)
05-06 10:28:18 D/ListInstrumentationParser: 
05-06 10:28:18 I/RemoteAndroidTestRunner: Running am instrument -w -r --abi armeabi-v7a  -e timeout_msec 600000 -e class 'com.google.android.resolution.tvts.DeviceResolutionTest#testMimeTypeH264Uhd' com.google.android.resolution.tvts/androidx.test.runner.AndroidJUnitRunner on foxconn-bfx_ua300-SKBFXYWR0LWD
05-06 10:28:20 I/BaseHostJUnit4Test: Test com.google.android.resolution.tvts.DeviceResolutionTest#testMimeTypeH264Uhd: PASSED
05-06 10:28:20 D/ListInstrumentationParser: instrumentation:android.tvconcurrent.tvts/androidx.test.runner.AndroidJUnitRunner (target=android.tvconcurrent.tvts)
05-06 10:28:20 D/ListInstrumentationParser: instrumentation:com.google.android.resolution.tvts/androidx.test.runner.AndroidJUnitRunner (target=com.google.android.resolution.tvts)
05-06 10:28:20 D/ListInstrumentationParser: 
05-06 10:28:20 I/RemoteAndroidTestRunner: Running am instrument -w -r --abi armeabi-v7a  -e timeout_msec 600000 -e class 'com.google.android.resolution.tvts.DeviceResolutionTest#testMimeTypeH264Wqhd' com.google.android.resolution.tvts/androidx.test.runner.AndroidJUnitRunner on foxconn-bfx_ua300-SKBFXYWR0LWD
05-06 10:28:23 I/BaseHostJUnit4Test: Test com.google.android.resolution.tvts.DeviceResolutionTest#testMimeTypeH264Wqhd: PASSED
05-06 10:28:23 D/ListInstrumentationParser: instrumentation:android.tvconcurrent.tvts/androidx.test.runner.AndroidJUnitRunner (target=android.tvconcurrent.tvts)
05-06 10:28:23 D/ListInstrumentationParser: instrumentation:com.google.android.resolution.tvts/androidx.test.runner.AndroidJUnitRunner (target=com.google.android.resolution.tvts)
05-06 10:28:23 D/ListInstrumentationParser: 
05-06 10:28:23 I/RemoteAndroidTestRunner: Running am instrument -w -r --abi armeabi-v7a  -e timeout_msec 600000 -e class 'com.google.android.resolution.tvts.DeviceResolutionTest#testMimeTypeH264Fhd' com.google.android.resolution.tvts/androidx.test.runner.AndroidJUnitRunner on foxconn-bfx_ua300-SKBFXYWR0LWD
05-06 10:28:25 I/BaseHostJUnit4Test: Test com.google.android.resolution.tvts.DeviceResolutionTest#testMimeTypeH264Fhd: PASSED
05-06 10:28:25 D/ListInstrumentationParser: instrumentation:android.tvconcurrent.tvts/androidx.test.runner.AndroidJUnitRunner (target=android.tvconcurrent.tvts)
05-06 10:28:25 D/ListInstrumentationParser: instrumentation:com.google.android.resolution.tvts/androidx.test.runner.AndroidJUnitRunner (target=com.google.android.resolution.tvts)
05-06 10:28:25 D/ListInstrumentationParser: 
05-06 10:28:25 I/RemoteAndroidTestRunner: Running am instrument -w -r --abi armeabi-v7a  -e timeout_msec 600000 -e class 'com.google.android.resolution.tvts.DeviceResolutionTest#testMimeTypeH264Hd' com.google.android.resolution.tvts/androidx.test.runner.AndroidJUnitRunner on foxconn-bfx_ua300-SKBFXYWR0LWD
05-06 10:28:27 I/BaseHostJUnit4Test: Test com.google.android.resolution.tvts.DeviceResolutionTest#testMimeTypeH264Hd: PASSED
05-06 10:28:27 D/ListInstrumentationParser: instrumentation:android.tvconcurrent.tvts/androidx.test.runner.AndroidJUnitRunner (target=android.tvconcurrent.tvts)
05-06 10:28:27 D/ListInstrumentationParser: instrumentation:com.google.android.resolution.tvts/androidx.test.runner.AndroidJUnitRunner (target=com.google.android.resolution.tvts)
05-06 10:28:27 D/ListInstrumentationParser: 
05-06 10:28:27 I/RemoteAndroidTestRunner: Running am instrument -w -r --abi armeabi-v7a  -e timeout_msec 600000 -e class 'com.google.android.resolution.tvts.DeviceResolutionTest#testMimeTypeHevcUhd' com.google.android.resolution.tvts/androidx.test.runner.AndroidJUnitRunner on foxconn-bfx_ua300-SKBFXYWR0LWD
05-06 10:28:29 I/BaseHostJUnit4Test: Test com.google.android.resolution.tvts.DeviceResolutionTest#testMimeTypeHevcUhd: PASSED
05-06 10:28:29 D/ListInstrumentationParser: instrumentation:android.tvconcurrent.tvts/androidx.test.runner.AndroidJUnitRunner (target=android.tvconcurrent.tvts)
05-06 10:28:29 D/ListInstrumentationParser: instrumentation:com.google.android.resolution.tvts/androidx.test.runner.AndroidJUnitRunner (target=com.google.android.resolution.tvts)
05-06 10:28:29 D/ListInstrumentationParser: 
05-06 10:28:29 I/RemoteAndroidTestRunner: Running am instrument -w -r --abi armeabi-v7a  -e timeout_msec 600000 -e class 'com.google.android.resolution.tvts.DeviceResolutionTest#testMimeTypeHevcWqhd' com.google.android.resolution.tvts/androidx.test.runner.AndroidJUnitRunner on foxconn-bfx_ua300-SKBFXYWR0LWD
05-06 10:28:32 I/BaseHostJUnit4Test: Test com.google.android.resolution.tvts.DeviceResolutionTest#testMimeTypeHevcWqhd: PASSED
05-06 10:28:32 D/ListInstrumentationParser: instrumentation:android.tvconcurrent.tvts/androidx.test.runner.AndroidJUnitRunner (target=android.tvconcurrent.tvts)
05-06 10:28:32 D/ListInstrumentationParser: instrumentation:com.google.android.resolution.tvts/androidx.test.runner.AndroidJUnitRunner (target=com.google.android.resolution.tvts)
05-06 10:28:32 D/ListInstrumentationParser: 
05-06 10:28:32 I/RemoteAndroidTestRunner: Running am instrument -w -r --abi armeabi-v7a  -e timeout_msec 600000 -e class 'com.google.android.resolution.tvts.DeviceResolutionTest#testMimeTypeHevcFhd' com.google.android.resolution.tvts/androidx.test.runner.AndroidJUnitRunner on foxconn-bfx_ua300-SKBFXYWR0LWD
05-06 10:28:34 I/BaseHostJUnit4Test: Test com.google.android.resolution.tvts.DeviceResolutionTest#testMimeTypeHevcFhd: PASSED
05-06 10:28:34 D/ListInstrumentationParser: instrumentation:android.tvconcurrent.tvts/androidx.test.runner.AndroidJUnitRunner (target=android.tvconcurrent.tvts)
05-06 10:28:34 D/ListInstrumentationParser: instrumentation:com.google.android.resolution.tvts/androidx.test.runner.AndroidJUnitRunner (target=com.google.android.resolution.tvts)
05-06 10:28:34 D/ListInstrumentationParser: 
05-06 10:28:34 I/RemoteAndroidTestRunner: Running am instrument -w -r --abi armeabi-v7a  -e timeout_msec 600000 -e class 'com.google.android.resolution.tvts.DeviceResolutionTest#testMimeTypeHevcHd' com.google.android.resolution.tvts/androidx.test.runner.AndroidJUnitRunner on foxconn-bfx_ua300-SKBFXYWR0LWD
05-06 10:28:36 I/BaseHostJUnit4Test: Test com.google.android.resolution.tvts.DeviceResolutionTest#testMimeTypeHevcHd: PASSED
05-06 10:28:36 D/ListInstrumentationParser: instrumentation:android.tvconcurrent.tvts/androidx.test.runner.AndroidJUnitRunner (target=android.tvconcurrent.tvts)
05-06 10:28:36 D/ListInstrumentationParser: instrumentation:com.google.android.resolution.tvts/androidx.test.runner.AndroidJUnitRunner (target=com.google.android.resolution.tvts)
05-06 10:28:36 D/ListInstrumentationParser: 
05-06 10:28:36 I/RemoteAndroidTestRunner: Running am instrument -w -r --abi armeabi-v7a  -e timeout_msec 600000 -e class 'com.google.android.resolution.tvts.DeviceResolutionTest#testMimeTypeAv1Uhd' com.google.android.resolution.tvts/androidx.test.runner.AndroidJUnitRunner on foxconn-bfx_ua300-SKBFXYWR0LWD
05-06 10:28:38 I/BaseHostJUnit4Test: Test com.google.android.resolution.tvts.DeviceResolutionTest#testMimeTypeAv1Uhd: PASSED
05-06 10:28:38 D/ListInstrumentationParser: instrumentation:android.tvconcurrent.tvts/androidx.test.runner.AndroidJUnitRunner (target=android.tvconcurrent.tvts)
05-06 10:28:38 D/ListInstrumentationParser: instrumentation:com.google.android.resolution.tvts/androidx.test.runner.AndroidJUnitRunner (target=com.google.android.resolution.tvts)
05-06 10:28:38 D/ListInstrumentationParser: 
05-06 10:28:38 I/RemoteAndroidTestRunner: Running am instrument -w -r --abi armeabi-v7a  -e timeout_msec 600000 -e class 'com.google.android.resolution.tvts.DeviceResolutionTest#testMimeTypeAv1Wqhd' com.google.android.resolution.tvts/androidx.test.runner.AndroidJUnitRunner on foxconn-bfx_ua300-SKBFXYWR0LWD
05-06 10:28:41 I/BaseHostJUnit4Test: Test com.google.android.resolution.tvts.DeviceResolutionTest#testMimeTypeAv1Wqhd: PASSED
05-06 10:28:41 D/ListInstrumentationParser: instrumentation:android.tvconcurrent.tvts/androidx.test.runner.AndroidJUnitRunner (target=android.tvconcurrent.tvts)
05-06 10:28:41 D/ListInstrumentationParser: instrumentation:com.google.android.resolution.tvts/androidx.test.runner.AndroidJUnitRunner (target=com.google.android.resolution.tvts)
05-06 10:28:41 D/ListInstrumentationParser: 
05-06 10:28:41 I/RemoteAndroidTestRunner: Running am instrument -w -r --abi armeabi-v7a  -e timeout_msec 600000 -e class 'com.google.android.resolution.tvts.DeviceResolutionTest#testMimeTypeAv1Fhd' com.google.android.resolution.tvts/androidx.test.runner.AndroidJUnitRunner on foxconn-bfx_ua300-SKBFXYWR0LWD
05-06 10:28:43 I/BaseHostJUnit4Test: Test com.google.android.resolution.tvts.DeviceResolutionTest#testMimeTypeAv1Fhd: PASSED
05-06 10:28:43 D/ListInstrumentationParser: instrumentation:android.tvconcurrent.tvts/androidx.test.runner.AndroidJUnitRunner (target=android.tvconcurrent.tvts)
05-06 10:28:43 D/ListInstrumentationParser: instrumentation:com.google.android.resolution.tvts/androidx.test.runner.AndroidJUnitRunner (target=com.google.android.resolution.tvts)
05-06 10:28:43 D/ListInstrumentationParser: 
05-06 10:28:43 I/RemoteAndroidTestRunner: Running am instrument -w -r --abi armeabi-v7a  -e timeout_msec 600000 -e class 'com.google.android.resolution.tvts.DeviceResolutionTest#testMimeTypeAv1Hd' com.google.android.resolution.tvts/androidx.test.runner.AndroidJUnitRunner on foxconn-bfx_ua300-SKBFXYWR0LWD
05-06 10:28:45 I/BaseHostJUnit4Test: Test com.google.android.resolution.tvts.DeviceResolutionTest#testMimeTypeAv1Hd: PASSED
05-06 10:28:45 D/ListInstrumentationParser: instrumentation:android.tvconcurrent.tvts/androidx.test.runner.AndroidJUnitRunner (target=android.tvconcurrent.tvts)
05-06 10:28:45 D/ListInstrumentationParser: instrumentation:com.google.android.resolution.tvts/androidx.test.runner.AndroidJUnitRunner (target=com.google.android.resolution.tvts)
05-06 10:28:45 D/ListInstrumentationParser: 
05-06 10:28:45 I/RemoteAndroidTestRunner: Running am instrument -w -r --abi armeabi-v7a  -e timeout_msec 600000 -e class 'com.google.android.resolution.tvts.DeviceResolutionTest#testMimeTypeWidevineVp9Uhd' com.google.android.resolution.tvts/androidx.test.runner.AndroidJUnitRunner on foxconn-bfx_ua300-SKBFXYWR0LWD
05-06 10:28:47 I/BaseHostJUnit4Test: Test com.google.android.resolution.tvts.DeviceResolutionTest#testMimeTypeWidevineVp9Uhd: PASSED
05-06 10:28:47 D/ListInstrumentationParser: instrumentation:android.tvconcurrent.tvts/androidx.test.runner.AndroidJUnitRunner (target=android.tvconcurrent.tvts)
05-06 10:28:47 D/ListInstrumentationParser: instrumentation:com.google.android.resolution.tvts/androidx.test.runner.AndroidJUnitRunner (target=com.google.android.resolution.tvts)
05-06 10:28:47 D/ListInstrumentationParser: 
05-06 10:28:47 I/RemoteAndroidTestRunner: Running am instrument -w -r --abi armeabi-v7a  -e timeout_msec 600000 -e class 'com.google.android.resolution.tvts.DeviceResolutionTest#testMimeTypeWidevineVp9Wqhd' com.google.android.resolution.tvts/androidx.test.runner.AndroidJUnitRunner on foxconn-bfx_ua300-SKBFXYWR0LWD
05-06 10:28:49 I/BaseHostJUnit4Test: Test com.google.android.resolution.tvts.DeviceResolutionTest#testMimeTypeWidevineVp9Wqhd: PASSED
05-06 10:28:50 D/ListInstrumentationParser: instrumentation:android.tvconcurrent.tvts/androidx.test.runner.AndroidJUnitRunner (target=android.tvconcurrent.tvts)
05-06 10:28:50 D/ListInstrumentationParser: instrumentation:com.google.android.resolution.tvts/androidx.test.runner.AndroidJUnitRunner (target=com.google.android.resolution.tvts)
05-06 10:28:50 D/ListInstrumentationParser: 
05-06 10:28:50 I/RemoteAndroidTestRunner: Running am instrument -w -r --abi armeabi-v7a  -e timeout_msec 600000 -e class 'com.google.android.resolution.tvts.DeviceResolutionTest#testMimeTypeWidevineVp9Fhd' com.google.android.resolution.tvts/androidx.test.runner.AndroidJUnitRunner on foxconn-bfx_ua300-SKBFXYWR0LWD
05-06 10:28:52 I/BaseHostJUnit4Test: Test com.google.android.resolution.tvts.DeviceResolutionTest#testMimeTypeWidevineVp9Fhd: PASSED
05-06 10:28:52 D/ListInstrumentationParser: instrumentation:android.tvconcurrent.tvts/androidx.test.runner.AndroidJUnitRunner (target=android.tvconcurrent.tvts)
05-06 10:28:52 D/ListInstrumentationParser: instrumentation:com.google.android.resolution.tvts/androidx.test.runner.AndroidJUnitRunner (target=com.google.android.resolution.tvts)
05-06 10:28:52 D/ListInstrumentationParser: 
05-06 10:28:52 I/RemoteAndroidTestRunner: Running am instrument -w -r --abi armeabi-v7a  -e timeout_msec 600000 -e class 'com.google.android.resolution.tvts.DeviceResolutionTest#testMimeTypeWidevineVp9Hd' com.google.android.resolution.tvts/androidx.test.runner.AndroidJUnitRunner on foxconn-bfx_ua300-SKBFXYWR0LWD
05-06 10:28:54 I/BaseHostJUnit4Test: Test com.google.android.resolution.tvts.DeviceResolutionTest#testMimeTypeWidevineVp9Hd: PASSED
05-06 10:28:54 D/ListInstrumentationParser: instrumentation:android.tvconcurrent.tvts/androidx.test.runner.AndroidJUnitRunner (target=android.tvconcurrent.tvts)
05-06 10:28:54 D/ListInstrumentationParser: instrumentation:com.google.android.resolution.tvts/androidx.test.runner.AndroidJUnitRunner (target=com.google.android.resolution.tvts)
05-06 10:28:54 D/ListInstrumentationParser: 
05-06 10:28:54 I/RemoteAndroidTestRunner: Running am instrument -w -r --abi armeabi-v7a  -e timeout_msec 600000 -e class 'com.google.android.resolution.tvts.DeviceResolutionTest#testMimeTypeWidevineH264Uhd' com.google.android.resolution.tvts/androidx.test.runner.AndroidJUnitRunner on foxconn-bfx_ua300-SKBFXYWR0LWD
05-06 10:28:56 I/BaseHostJUnit4Test: Test com.google.android.resolution.tvts.DeviceResolutionTest#testMimeTypeWidevineH264Uhd: PASSED
05-06 10:28:56 D/ListInstrumentationParser: instrumentation:android.tvconcurrent.tvts/androidx.test.runner.AndroidJUnitRunner (target=android.tvconcurrent.tvts)
05-06 10:28:56 D/ListInstrumentationParser: instrumentation:com.google.android.resolution.tvts/androidx.test.runner.AndroidJUnitRunner (target=com.google.android.resolution.tvts)
05-06 10:28:56 D/ListInstrumentationParser: 
05-06 10:28:56 I/RemoteAndroidTestRunner: Running am instrument -w -r --abi armeabi-v7a  -e timeout_msec 600000 -e class 'com.google.android.resolution.tvts.DeviceResolutionTest#testMimeTypeWidevineH264Wqhd' com.google.android.resolution.tvts/androidx.test.runner.AndroidJUnitRunner on foxconn-bfx_ua300-SKBFXYWR0LWD
05-06 10:28:58 I/BaseHostJUnit4Test: Test com.google.android.resolution.tvts.DeviceResolutionTest#testMimeTypeWidevineH264Wqhd: PASSED
05-06 10:28:58 D/ListInstrumentationParser: instrumentation:android.tvconcurrent.tvts/androidx.test.runner.AndroidJUnitRunner (target=android.tvconcurrent.tvts)
05-06 10:28:58 D/ListInstrumentationParser: instrumentation:com.google.android.resolution.tvts/androidx.test.runner.AndroidJUnitRunner (target=com.google.android.resolution.tvts)
05-06 10:28:58 D/ListInstrumentationParser: 
05-06 10:28:58 I/RemoteAndroidTestRunner: Running am instrument -w -r --abi armeabi-v7a  -e timeout_msec 600000 -e class 'com.google.android.resolution.tvts.DeviceResolutionTest#testMimeTypeWidevineH264Fhd' com.google.android.resolution.tvts/androidx.test.runner.AndroidJUnitRunner on foxconn-bfx_ua300-SKBFXYWR0LWD
05-06 10:29:01 I/BaseHostJUnit4Test: Test com.google.android.resolution.tvts.DeviceResolutionTest#testMimeTypeWidevineH264Fhd: PASSED
05-06 10:29:01 D/ListInstrumentationParser: instrumentation:android.tvconcurrent.tvts/androidx.test.runner.AndroidJUnitRunner (target=android.tvconcurrent.tvts)
05-06 10:29:01 D/ListInstrumentationParser: instrumentation:com.google.android.resolution.tvts/androidx.test.runner.AndroidJUnitRunner (target=com.google.android.resolution.tvts)
05-06 10:29:01 D/ListInstrumentationParser: 
05-06 10:29:01 I/RemoteAndroidTestRunner: Running am instrument -w -r --abi armeabi-v7a  -e timeout_msec 600000 -e class 'com.google.android.resolution.tvts.DeviceResolutionTest#testMimeTypeWidevineH264Hd' com.google.android.resolution.tvts/androidx.test.runner.AndroidJUnitRunner on foxconn-bfx_ua300-SKBFXYWR0LWD
05-06 10:29:03 I/BaseHostJUnit4Test: Test com.google.android.resolution.tvts.DeviceResolutionTest#testMimeTypeWidevineH264Hd: PASSED
05-06 10:29:03 D/ListInstrumentationParser: instrumentation:android.tvconcurrent.tvts/androidx.test.runner.AndroidJUnitRunner (target=android.tvconcurrent.tvts)
05-06 10:29:03 D/ListInstrumentationParser: instrumentation:com.google.android.resolution.tvts/androidx.test.runner.AndroidJUnitRunner (target=com.google.android.resolution.tvts)
05-06 10:29:03 D/ListInstrumentationParser: 
05-06 10:29:03 I/RemoteAndroidTestRunner: Running am instrument -w -r --abi armeabi-v7a  -e timeout_msec 600000 -e class 'com.google.android.resolution.tvts.DeviceResolutionTest#testMimeTypeWidevineHevcUhd' com.google.android.resolution.tvts/androidx.test.runner.AndroidJUnitRunner on foxconn-bfx_ua300-SKBFXYWR0LWD
05-06 10:29:05 I/BaseHostJUnit4Test: Test com.google.android.resolution.tvts.DeviceResolutionTest#testMimeTypeWidevineHevcUhd: PASSED
05-06 10:29:05 D/ListInstrumentationParser: instrumentation:android.tvconcurrent.tvts/androidx.test.runner.AndroidJUnitRunner (target=android.tvconcurrent.tvts)
05-06 10:29:05 D/ListInstrumentationParser: instrumentation:com.google.android.resolution.tvts/androidx.test.runner.AndroidJUnitRunner (target=com.google.android.resolution.tvts)
05-06 10:29:05 D/ListInstrumentationParser: 
05-06 10:29:05 I/RemoteAndroidTestRunner: Running am instrument -w -r --abi armeabi-v7a  -e timeout_msec 600000 -e class 'com.google.android.resolution.tvts.DeviceResolutionTest#testMimeTypeWidevineHevcWqhd' com.google.android.resolution.tvts/androidx.test.runner.AndroidJUnitRunner on foxconn-bfx_ua300-SKBFXYWR0LWD
05-06 10:29:07 I/BaseHostJUnit4Test: Test com.google.android.resolution.tvts.DeviceResolutionTest#testMimeTypeWidevineHevcWqhd: PASSED
05-06 10:29:07 D/ListInstrumentationParser: instrumentation:android.tvconcurrent.tvts/androidx.test.runner.AndroidJUnitRunner (target=android.tvconcurrent.tvts)
05-06 10:29:07 D/ListInstrumentationParser: instrumentation:com.google.android.resolution.tvts/androidx.test.runner.AndroidJUnitRunner (target=com.google.android.resolution.tvts)
05-06 10:29:07 D/ListInstrumentationParser: 
05-06 10:29:07 I/RemoteAndroidTestRunner: Running am instrument -w -r --abi armeabi-v7a  -e timeout_msec 600000 -e class 'com.google.android.resolution.tvts.DeviceResolutionTest#testMimeTypeWidevineHevcFhd' com.google.android.resolution.tvts/androidx.test.runner.AndroidJUnitRunner on foxconn-bfx_ua300-SKBFXYWR0LWD
05-06 10:29:09 I/BaseHostJUnit4Test: Test com.google.android.resolution.tvts.DeviceResolutionTest#testMimeTypeWidevineHevcFhd: PASSED
05-06 10:29:10 D/ListInstrumentationParser: instrumentation:android.tvconcurrent.tvts/androidx.test.runner.AndroidJUnitRunner (target=android.tvconcurrent.tvts)
05-06 10:29:10 D/ListInstrumentationParser: instrumentation:com.google.android.resolution.tvts/androidx.test.runner.AndroidJUnitRunner (target=com.google.android.resolution.tvts)
05-06 10:29:10 D/ListInstrumentationParser: 
05-06 10:29:10 I/RemoteAndroidTestRunner: Running am instrument -w -r --abi armeabi-v7a  -e timeout_msec 600000 -e class 'com.google.android.resolution.tvts.DeviceResolutionTest#testMimeTypeWidevineHevcHd' com.google.android.resolution.tvts/androidx.test.runner.AndroidJUnitRunner on foxconn-bfx_ua300-SKBFXYWR0LWD
05-06 10:29:12 I/BaseHostJUnit4Test: Test com.google.android.resolution.tvts.DeviceResolutionTest#testMimeTypeWidevineHevcHd: PASSED
05-06 10:29:12 D/ListInstrumentationParser: instrumentation:android.tvconcurrent.tvts/androidx.test.runner.AndroidJUnitRunner (target=android.tvconcurrent.tvts)
05-06 10:29:12 D/ListInstrumentationParser: instrumentation:com.google.android.resolution.tvts/androidx.test.runner.AndroidJUnitRunner (target=com.google.android.resolution.tvts)
05-06 10:29:12 D/ListInstrumentationParser: 
05-06 10:29:12 I/RemoteAndroidTestRunner: Running am instrument -w -r --abi armeabi-v7a  -e timeout_msec 600000 -e class 'com.google.android.resolution.tvts.DeviceResolutionTest#testRefreshRate' com.google.android.resolution.tvts/androidx.test.runner.AndroidJUnitRunner on foxconn-bfx_ua300-SKBFXYWR0LWD
05-06 10:29:14 I/BaseHostJUnit4Test: Test com.google.android.resolution.tvts.DeviceResolutionTest#testRefreshRate: PASSED
05-06 10:29:14 I/InstrumentationDerivedProperties: Instrumentation derived properties populated for device: com.android.tradefed.device.TestDevice@9b66e5d, with these resolutions: [HD, FHD, WQHD, UHD]
05-06 10:29:14 D/NativeDevice: Using property ro.build.version.sdk=29 from cache.
05-06 10:29:14 D/DeviceHostUtils: apiLevel: 29
05-06 10:29:14 D/TvConcurrentPlaybackHostTest: com.google.android.tv.concurrent.TvConcurrentPlaybackHostTest: before test, screen_brightness_mode = 0
05-06 10:29:14 D/TvConcurrentPlaybackHostTest: com.google.android.tv.concurrent.TvConcurrentPlaybackHostTest: before test, screensaver_enabled = 1
05-06 10:29:14 D/NativeDevice: Using property ro.build.version.sdk=29 from cache.
05-06 10:29:14 D/NativeDevice: Using property ro.build.version.sdk=29 from cache.
05-06 10:29:15 D/RunUtil: Running command [adb, -s, SKBFXYWR0LWD, shell, pm, list, features] with timeout: 2m 0s
05-06 10:29:15 W/TestDevice: Feature: feature:com.google.android.tv.hardware.quad_playback_4k60 is not available on SKBFXYWR0LWD
05-06 10:29:15 D/RunUtil: Running command [adb, -s, SKBFXYWR0LWD, shell, pm, list, features] with timeout: 2m 0s
05-06 10:29:15 W/TestDevice: Feature: feature:com.google.android.tv.hardware.quad_playback_4k30 is not available on SKBFXYWR0LWD
05-06 10:29:15 D/RunUtil: Running command [adb, -s, SKBFXYWR0LWD, shell, pm, list, features] with timeout: 2m 0s
05-06 10:29:15 W/TestDevice: Feature: feature:com.google.android.tv.hardware.quad_playback_1080p60 is not available on SKBFXYWR0LWD
05-06 10:29:15 D/RunUtil: Running command [adb, -s, SKBFXYWR0LWD, shell, pm, list, features] with timeout: 2m 0s
05-06 10:29:15 W/TestDevice: Feature: feature:com.google.android.tv.hardware.quad_playback_1080p30 is not available on SKBFXYWR0LWD
05-06 10:29:15 D/RunUtil: Running command [adb, -s, SKBFXYWR0LWD, shell, pm, list, features] with timeout: 2m 0s
05-06 10:29:15 W/TestDevice: Feature: feature:com.google.android.tv.hardware.quad_playback_720p60 is not available on SKBFXYWR0LWD
05-06 10:29:15 D/RunUtil: Running command [adb, -s, SKBFXYWR0LWD, shell, pm, list, features] with timeout: 2m 0s
05-06 10:29:15 W/TestDevice: Feature: feature:com.google.android.tv.hardware.quad_playback_720p30 is not available on SKBFXYWR0LWD
05-06 10:29:15 D/RunUtil: Running command [adb, -s, SKBFXYWR0LWD, shell, pm, list, features] with timeout: 2m 0s
05-06 10:29:15 W/TestDevice: Feature: feature:com.google.android.tv.hardware.quad_playback_540p60 is not available on SKBFXYWR0LWD
05-06 10:29:15 D/RunUtil: Running command [adb, -s, SKBFXYWR0LWD, shell, pm, list, features] with timeout: 2m 0s
05-06 10:29:15 W/TestDevice: Feature: feature:com.google.android.tv.hardware.quad_playback_540p30 is not available on SKBFXYWR0LWD
05-06 10:29:15 D/RunUtil: Running command [adb, -s, SKBFXYWR0LWD, shell, pm, list, features] with timeout: 2m 0s
05-06 10:29:15 W/TestDevice: Feature: feature:com.google.android.tv.hardware.quad_playback_480p60 is not available on SKBFXYWR0LWD
05-06 10:29:15 D/RunUtil: Running command [adb, -s, SKBFXYWR0LWD, shell, pm, list, features] with timeout: 2m 0s
05-06 10:29:15 W/TestDevice: Feature: feature:com.google.android.tv.hardware.quad_playback_480p30 is not available on SKBFXYWR0LWD
05-06 10:29:15 D/com.google.android.tv.concurrent.TvConcurrentPlaybackHostTest: com.google.android.tv.hardware.quad_playback_ not declared on device
05-06 10:29:15 D/TvConcurrentPlaybackHostTest: com.google.android.tv.concurrent.TvConcurrentPlaybackHostTest: after test, restore screen_brightness_mode to 0
05-06 10:29:15 D/NativeDevice: Using property ro.build.version.sdk=29 from cache.
05-06 10:29:15 D/TvConcurrentPlaybackHostTest: com.google.android.tv.concurrent.TvConcurrentPlaybackHostTest: after test, restore screensaver_enabled to 1
05-06 10:29:15 D/NativeDevice: Using property ro.build.version.sdk=29 from cache.
05-06 10:29:15 I/ConsoleReporter: [1/9 armeabi-v7a TvConcurrentMediaPlaybackHostTestCases SKBFXYWR0LWD] com.google.android.tv.concurrent.TvConcurrentPlaybackHostTest#testConcurrentQuadPlayback[0_CpuHog_false_MemHog_false] skip
05-06 10:29:15 D/PrettyTestEventLogger: 
==================== com.google.android.tv.concurrent.TvConcurrentPlaybackHostTest#testConcurrentQuadPlayback[0_CpuHog_false_MemHog_false] ENDED: Wed May 06 10:29:15 KST 2026 ====================
05-06 10:29:15 I/ModuleListener: [1/9] SKBFXYWR0LWD com.google.android.tv.concurrent.TvConcurrentPlaybackHostTest#testConcurrentQuadPlayback[0_CpuHog_false_MemHog_false] ASSUMPTION_FAILURE: org.junit.AssumptionViolatedException: Skipping the test because com.google.android.tv.hardware.quad_playback_ is not declared in this device
	at org.junit.Assume.assumeTrue(Assume.java:68)
	at org.junit.Assume.assumeFalse(Assume.java:75)
	at com.google.android.tv.concurrent.TvConcurrentPlaybackHostTest.testConcurrentQuadPlayback(TvConcurrentPlaybackHostTest.java:226)
	at java.base/jdk.internal.reflect.DirectMethodHandleAccessor.invoke(DirectMethodHandleAccessor.java:103)
	at java.base/java.lang.reflect.Method.invoke(Method.java:580)
	at org.junit.runners.model.FrameworkMethod$1.runReflectiveCall(FrameworkMethod.java:59)
	at org.junit.internal.runners.model.ReflectiveCallable.run(ReflectiveCallable.java:12)
	at org.junit.runners.model.FrameworkMethod.invokeExplosively(FrameworkMethod.java:61)
	at org.junit.internal.runners.statements.InvokeMethod.evaluate(InvokeMethod.java:17)
	at org.junit.internal.runners.statements.RunBefores.evaluate(RunBefores.java:26)
	at org.junit.internal.runners.statements.RunAfters.evaluate(RunAfters.java:27)
	at org.junit.rules.ExternalResource$1.evaluate(ExternalResource.java:54)
	at org.junit.rules.ExternalResource$1.evaluate(ExternalResource.java:54)
	at org.junit.rules.TestWatcher$1.evaluate(TestWatcher.java:61)
	at org.junit.runners.ParentRunner$3.evaluate(ParentRunner.java:306)
	at org.junit.runners.BlockJUnit4ClassRunner$1.evaluate(BlockJUnit4ClassRunner.java:100)
	at org.junit.runners.ParentRunner.runLeaf(ParentRunner.java:366)
	at org.junit.runners.BlockJUnit4ClassRunner.runChild(BlockJUnit4ClassRunner.java:103)
	at org.junit.runners.BlockJUnit4ClassRunner.runChild(BlockJUnit4ClassRunner.java:63)
	at org.junit.runners.ParentRunner$4.run(ParentRunner.java:331)
	at org.junit.runners.ParentRunner$1.schedule(ParentRunner.java:79)
	at org.junit.runners.ParentRunner.runChildren(ParentRunner.java:329)
	at org.junit.runners.ParentRunner$2.evaluate(ParentRunner.java:293)
	at org.junit.runners.ParentRunner.run(ParentRunner.java:413)
	at org.junit.runners.Suite.runChild(Suite.java:128)
	at android.cts.host.utils.DeviceJUnit4Parameterized.runChild(DeviceJUnit4Parameterized.java:125)
	at android.cts.host.utils.DeviceJUnit4Parameterized.runChild(DeviceJUnit4Parameterized.java:44)
	at org.junit.runners.ParentRunner$4.run(ParentRunner.java:331)
	at org.junit.runners.ParentRunner$1.schedule(ParentRunner.java:79)
	at org.junit.runners.ParentRunner.runChildren(ParentRunner.java:329)
	at org.junit.runners.ParentRunner$2.evaluate(ParentRunner.java:293)
	at org.junit.runners.ParentRunner$3.evaluate(ParentRunner.java:306)
	at org.junit.runners.ParentRunner.run(ParentRunner.java:413)
	at com.android.tradefed.testtype.junit4.ExceptionThrowingRunnerWrapper.run(ExceptionThrowingRunnerWrapper.java:43)
	at org.junit.runner.JUnitCore.run(JUnitCore.java:137)
	at com.android.tradefed.testtype.HostTest.runJUnit4Tests(HostTest.java:775)
	at com.android.tradefed.testtype.HostTest.runTestClasses(HostTest.java:655)
	at com.android.tradefed.testtype.HostTest.run(HostTest.java:603)
	at com.android.tradefed.testtype.suite.GranularRetriableTestWrapper.intraModuleRun(GranularRetriableTestWrapper.java:448)
	at com.android.tradefed.testtype.suite.GranularRetriableTestWrapper.run(GranularRetriableTestWrapper.java:341)
	at com.android.tradefed.testtype.suite.ModuleDefinition.run(ModuleDefinition.java:619)
	at com.android.tradefed.testtype.suite.ITestSuite.runSingleModule(ITestSuite.java:1368)
	at com.android.tradefed.testtype.suite.ITestSuite.run(ITestSuite.java:1080)
	at com.android.tradefed.invoker.InvocationExecution.runTest(InvocationExecution.java:1463)
	at com.android.tradefed.invoker.InvocationExecution.runTests(InvocationExecution.java:1238)
	at com.android.tradefed.invoker.TestInvocation.prepareAndRun(TestInvocation.java:648)
	at com.android.tradefed.invoker.TestInvocation.performInvocation(TestInvocation.java:294)
	at com.android.tradefed.invoker.TestInvocation.invoke(TestInvocation.java:1462)
	at com.android.tradefed.command.CommandScheduler$InvocationThread.run(CommandScheduler.java:719)

05-06 10:29:15 D/PrettyTestEventLogger: 
==================== com.google.android.tv.concurrent.TvConcurrentPlaybackHostTest#testConcurrentDualPlayback[0_CpuHog_false_MemHog_false] STARTED: Wed May 06 10:29:15 KST 2026 ====================
05-06 10:29:15 D/ModuleListener: ModuleListener.testStarted(com.google.android.tv.concurrent.TvConcurrentPlaybackHostTest#testConcurrentDualPlayback[0_CpuHog_false_MemHog_false]) on SKBFXYWR0LWD
05-06 10:29:15 D/NativeDevice: Using property ro.build.version.sdk=29 from cache.
05-06 10:29:15 D/DeviceHostUtils: apiLevel: 29
05-06 10:29:15 D/NativeDevice: Using property ro.build.version.sdk=29 from cache.
05-06 10:29:15 D/DeviceHostUtils: apiLevel: 29
05-06 10:29:16 D/TvConcurrentPlaybackHostTest: com.google.android.tv.concurrent.TvConcurrentPlaybackHostTest: before test, screen_brightness_mode = 0
05-06 10:29:16 D/TvConcurrentPlaybackHostTest: com.google.android.tv.concurrent.TvConcurrentPlaybackHostTest: before test, screensaver_enabled = 1
05-06 10:29:16 D/NativeDevice: Using property ro.build.version.sdk=29 from cache.
05-06 10:29:16 D/NativeDevice: Using property ro.build.version.sdk=29 from cache.
05-06 10:29:16 D/RunUtil: Running command [adb, -s, SKBFXYWR0LWD, shell, pm, list, features] with timeout: 2m 0s
05-06 10:29:16 W/TestDevice: Feature: feature:com.google.android.tv.hardware.dual_playback_4k60 is not available on SKBFXYWR0LWD
05-06 10:29:16 D/RunUtil: Running command [adb, -s, SKBFXYWR0LWD, shell, pm, list, features] with timeout: 2m 0s
05-06 10:29:16 W/TestDevice: Feature: feature:com.google.android.tv.hardware.dual_playback_4k30 is not available on SKBFXYWR0LWD
05-06 10:29:16 D/RunUtil: Running command [adb, -s, SKBFXYWR0LWD, shell, pm, list, features] with timeout: 2m 0s
05-06 10:29:16 W/TestDevice: Feature: feature:com.google.android.tv.hardware.dual_playback_1080p60 is not available on SKBFXYWR0LWD
05-06 10:29:16 D/RunUtil: Running command [adb, -s, SKBFXYWR0LWD, shell, pm, list, features] with timeout: 2m 0s
05-06 10:29:16 W/TestDevice: Feature: feature:com.google.android.tv.hardware.dual_playback_1080p30 is not available on SKBFXYWR0LWD
05-06 10:29:16 D/RunUtil: Running command [adb, -s, SKBFXYWR0LWD, shell, pm, list, features] with timeout: 2m 0s
05-06 10:29:16 W/TestDevice: Feature: feature:com.google.android.tv.hardware.dual_playback_720p60 is not available on SKBFXYWR0LWD
05-06 10:29:16 D/RunUtil: Running command [adb, -s, SKBFXYWR0LWD, shell, pm, list, features] with timeout: 2m 0s
05-06 10:29:16 W/TestDevice: Feature: feature:com.google.android.tv.hardware.dual_playback_720p30 is not available on SKBFXYWR0LWD
05-06 10:29:16 D/RunUtil: Running command [adb, -s, SKBFXYWR0LWD, shell, pm, list, features] with timeout: 2m 0s
05-06 10:29:17 W/TestDevice: Feature: feature:com.google.android.tv.hardware.dual_playback_540p60 is not available on SKBFXYWR0LWD
05-06 10:29:17 D/RunUtil: Running command [adb, -s, SKBFXYWR0LWD, shell, pm, list, features] with timeout: 2m 0s
05-06 10:29:17 W/TestDevice: Feature: feature:com.google.android.tv.hardware.dual_playback_540p30 is not available on SKBFXYWR0LWD
05-06 10:29:17 D/RunUtil: Running command [adb, -s, SKBFXYWR0LWD, shell, pm, list, features] with timeout: 2m 0s
05-06 10:29:17 W/TestDevice: Feature: feature:com.google.android.tv.hardware.dual_playback_480p60 is not available on SKBFXYWR0LWD
05-06 10:29:17 D/RunUtil: Running command [adb, -s, SKBFXYWR0LWD, shell, pm, list, features] with timeout: 2m 0s
05-06 10:29:17 W/TestDevice: Feature: feature:com.google.android.tv.hardware.dual_playback_480p30 is not available on SKBFXYWR0LWD
05-06 10:29:17 D/com.google.android.tv.concurrent.TvConcurrentPlaybackHostTest: com.google.android.tv.hardware.dual_playback_ not declared on device
05-06 10:29:17 D/TvConcurrentPlaybackHostTest: com.google.android.tv.concurrent.TvConcurrentPlaybackHostTest: after test, restore screen_brightness_mode to 0
05-06 10:29:17 D/NativeDevice: Using property ro.build.version.sdk=29 from cache.
05-06 10:29:17 D/TvConcurrentPlaybackHostTest: com.google.android.tv.concurrent.TvConcurrentPlaybackHostTest: after test, restore screensaver_enabled to 1
05-06 10:29:17 D/NativeDevice: Using property ro.build.version.sdk=29 from cache.
05-06 10:29:17 I/ConsoleReporter: [2/9 armeabi-v7a TvConcurrentMediaPlaybackHostTestCases SKBFXYWR0LWD] com.google.android.tv.concurrent.TvConcurrentPlaybackHostTest#testConcurrentDualPlayback[0_CpuHog_false_MemHog_false] skip
05-06 10:29:17 D/PrettyTestEventLogger: 
==================== com.google.android.tv.concurrent.TvConcurrentPlaybackHostTest#testConcurrentDualPlayback[0_CpuHog_false_MemHog_false] ENDED: Wed May 06 10:29:17 KST 2026 ====================
05-06 10:29:17 I/ModuleListener: [2/9] SKBFXYWR0LWD com.google.android.tv.concurrent.TvConcurrentPlaybackHostTest#testConcurrentDualPlayback[0_CpuHog_false_MemHog_false] ASSUMPTION_FAILURE: org.junit.AssumptionViolatedException: Skipping the test because com.google.android.tv.hardware.dual_playback_ is not declared in this device
	at org.junit.Assume.assumeTrue(Assume.java:68)
	at org.junit.Assume.assumeFalse(Assume.java:75)
	at com.google.android.tv.concurrent.TvConcurrentPlaybackHostTest.testConcurrentDualPlayback(TvConcurrentPlaybackHostTest.java:208)
	at java.base/jdk.internal.reflect.DirectMethodHandleAccessor.invoke(DirectMethodHandleAccessor.java:103)
	at java.base/java.lang.reflect.Method.invoke(Method.java:580)
	at org.junit.runners.model.FrameworkMethod$1.runReflectiveCall(FrameworkMethod.java:59)
	at org.junit.internal.runners.model.ReflectiveCallable.run(ReflectiveCallable.java:12)
	at org.junit.runners.model.FrameworkMethod.invokeExplosively(FrameworkMethod.java:61)
	at org.junit.internal.runners.statements.InvokeMethod.evaluate(InvokeMethod.java:17)
	at org.junit.internal.runners.statements.RunBefores.evaluate(RunBefores.java:26)
	at org.junit.internal.runners.statements.RunAfters.evaluate(RunAfters.java:27)
	at org.junit.rules.ExternalResource$1.evaluate(ExternalResource.java:54)
	at org.junit.rules.ExternalResource$1.evaluate(ExternalResource.java:54)
	at org.junit.rules.TestWatcher$1.evaluate(TestWatcher.java:61)
	at org.junit.runners.ParentRunner$3.evaluate(ParentRunner.java:306)
	at org.junit.runners.BlockJUnit4ClassRunner$1.evaluate(BlockJUnit4ClassRunner.java:100)
	at org.junit.runners.ParentRunner.runLeaf(ParentRunner.java:366)
	at org.junit.runners.BlockJUnit4ClassRunner.runChild(BlockJUnit4ClassRunner.java:103)
	at org.junit.runners.BlockJUnit4ClassRunner.runChild(BlockJUnit4ClassRunner.java:63)
	at org.junit.runners.ParentRunner$4.run(ParentRunner.java:331)
	at org.junit.runners.ParentRunner$1.schedule(ParentRunner.java:79)
	at org.junit.runners.ParentRunner.runChildren(ParentRunner.java:329)
	at org.junit.runners.ParentRunner$2.evaluate(ParentRunner.java:293)
	at org.junit.runners.ParentRunner.run(ParentRunner.java:413)
	at org.junit.runners.Suite.runChild(Suite.java:128)
	at android.cts.host.utils.DeviceJUnit4Parameterized.runChild(DeviceJUnit4Parameterized.java:125)
	at android.cts.host.utils.DeviceJUnit4Parameterized.runChild(DeviceJUnit4Parameterized.java:44)
	at org.junit.runners.ParentRunner$4.run(ParentRunner.java:331)
	at org.junit.runners.ParentRunner$1.schedule(ParentRunner.java:79)
	at org.junit.runners.ParentRunner.runChildren(ParentRunner.java:329)
	at org.junit.runners.ParentRunner$2.evaluate(ParentRunner.java:293)
	at org.junit.runners.ParentRunner$3.evaluate(ParentRunner.java:306)
	at org.junit.runners.ParentRunner.run(ParentRunner.java:413)
	at com.android.tradefed.testtype.junit4.ExceptionThrowingRunnerWrapper.run(ExceptionThrowingRunnerWrapper.java:43)
	at org.junit.runner.JUnitCore.run(JUnitCore.java:137)
	at com.android.tradefed.testtype.HostTest.runJUnit4Tests(HostTest.java:775)
	at com.android.tradefed.testtype.HostTest.runTestClasses(HostTest.java:655)
	at com.android.tradefed.testtype.HostTest.run(HostTest.java:603)
	at com.android.tradefed.testtype.suite.GranularRetriableTestWrapper.intraModuleRun(GranularRetriableTestWrapper.java:448)
	at com.android.tradefed.testtype.suite.GranularRetriableTestWrapper.run(GranularRetriableTestWrapper.java:341)
	at com.android.tradefed.testtype.suite.ModuleDefinition.run(ModuleDefinition.java:619)
	at com.android.tradefed.testtype.suite.ITestSuite.runSingleModule(ITestSuite.java:1368)
	at com.android.tradefed.testtype.suite.ITestSuite.run(ITestSuite.java:1080)
	at com.android.tradefed.invoker.InvocationExecution.runTest(InvocationExecution.java:1463)
	at com.android.tradefed.invoker.InvocationExecution.runTests(InvocationExecution.java:1238)
	at com.android.tradefed.invoker.TestInvocation.prepareAndRun(TestInvocation.java:648)
	at com.android.tradefed.invoker.TestInvocation.performInvocation(TestInvocation.java:294)
	at com.android.tradefed.invoker.TestInvocation.invoke(TestInvocation.java:1462)
	at com.android.tradefed.command.CommandScheduler$InvocationThread.run(CommandScheduler.java:719)

05-06 10:29:17 D/PrettyTestEventLogger: 
==================== com.google.android.tv.concurrent.TvConcurrentPlaybackHostTest#testConcurrentBasicSecondaryPlayback[0_CpuHog_false_MemHog_false] STARTED: Wed May 06 10:29:17 KST 2026 ====================
05-06 10:29:17 D/ModuleListener: ModuleListener.testStarted(com.google.android.tv.concurrent.TvConcurrentPlaybackHostTest#testConcurrentBasicSecondaryPlayback[0_CpuHog_false_MemHog_false]) on SKBFXYWR0LWD
05-06 10:29:17 D/NativeDevice: Using property ro.build.version.sdk=29 from cache.
05-06 10:29:17 D/DeviceHostUtils: apiLevel: 29
05-06 10:29:17 D/NativeDevice: Using property ro.build.version.sdk=29 from cache.
05-06 10:29:17 D/DeviceHostUtils: apiLevel: 29
05-06 10:29:17 D/TvConcurrentPlaybackHostTest: com.google.android.tv.concurrent.TvConcurrentPlaybackHostTest: before test, screen_brightness_mode = 0
05-06 10:29:17 D/TvConcurrentPlaybackHostTest: com.google.android.tv.concurrent.TvConcurrentPlaybackHostTest: before test, screensaver_enabled = 1
05-06 10:29:17 D/NativeDevice: Using property ro.build.version.sdk=29 from cache.
05-06 10:29:17 D/NativeDevice: Using property ro.build.version.sdk=29 from cache.
05-06 10:29:18 D/RunUtil: Running command [adb, -s, SKBFXYWR0LWD, shell, pm, list, features] with timeout: 2m 0s
05-06 10:29:18 W/TestDevice: Feature: feature:com.google.android.tv.hardware.secondary_playback_4k60 is not available on SKBFXYWR0LWD
05-06 10:29:18 D/RunUtil: Running command [adb, -s, SKBFXYWR0LWD, shell, pm, list, features] with timeout: 2m 0s
05-06 10:29:18 W/TestDevice: Feature: feature:com.google.android.tv.hardware.secondary_playback_4k30 is not available on SKBFXYWR0LWD
05-06 10:29:18 D/RunUtil: Running command [adb, -s, SKBFXYWR0LWD, shell, pm, list, features] with timeout: 2m 0s
05-06 10:29:18 W/TestDevice: Feature: feature:com.google.android.tv.hardware.secondary_playback_1080p60 is not available on SKBFXYWR0LWD
05-06 10:29:18 D/RunUtil: Running command [adb, -s, SKBFXYWR0LWD, shell, pm, list, features] with timeout: 2m 0s
05-06 10:29:18 W/TestDevice: Feature: feature:com.google.android.tv.hardware.secondary_playback_1080p30 is not available on SKBFXYWR0LWD
05-06 10:29:18 D/RunUtil: Running command [adb, -s, SKBFXYWR0LWD, shell, pm, list, features] with timeout: 2m 0s
05-06 10:29:18 W/TestDevice: Feature: feature:com.google.android.tv.hardware.secondary_playback_720p60 is not available on SKBFXYWR0LWD
05-06 10:29:18 D/RunUtil: Running command [adb, -s, SKBFXYWR0LWD, shell, pm, list, features] with timeout: 2m 0s
05-06 10:29:18 W/TestDevice: Feature: feature:com.google.android.tv.hardware.secondary_playback_720p30 is not available on SKBFXYWR0LWD
05-06 10:29:18 D/RunUtil: Running command [adb, -s, SKBFXYWR0LWD, shell, pm, list, features] with timeout: 2m 0s
05-06 10:29:18 W/TestDevice: Feature: feature:com.google.android.tv.hardware.secondary_playback_540p60 is not available on SKBFXYWR0LWD
05-06 10:29:18 D/RunUtil: Running command [adb, -s, SKBFXYWR0LWD, shell, pm, list, features] with timeout: 2m 0s
05-06 10:29:18 W/TestDevice: Feature: feature:com.google.android.tv.hardware.secondary_playback_540p30 is not available on SKBFXYWR0LWD
05-06 10:29:18 D/RunUtil: Running command [adb, -s, SKBFXYWR0LWD, shell, pm, list, features] with timeout: 2m 0s
05-06 10:29:18 W/TestDevice: Feature: feature:com.google.android.tv.hardware.secondary_playback_480p60 is not available on SKBFXYWR0LWD
05-06 10:29:18 D/RunUtil: Running command [adb, -s, SKBFXYWR0LWD, shell, pm, list, features] with timeout: 2m 0s
05-06 10:29:18 W/TestDevice: Feature: feature:com.google.android.tv.hardware.secondary_playback_480p30 is not available on SKBFXYWR0LWD
05-06 10:29:18 D/com.google.android.tv.concurrent.TvConcurrentPlaybackHostTest: com.google.android.tv.hardware.secondary_playback_ not declared on device
05-06 10:29:18 D/NativeDevice: Using property ro.build.version.sdk=29 from cache.
05-06 10:29:18 D/RunUtil: Running command [adb, -s, SKBFXYWR0LWD, shell, getprop, ro.config.low_ram] with timeout: 45s
05-06 10:29:18 D/RunUtil: Running command [adb, -s, SKBFXYWR0LWD, shell, pm, list, features] with timeout: 2m 0s
05-06 10:29:18 W/TestDevice: Feature: feature:com.google.android.feature.AMATI_EXPERIENCE is not available on SKBFXYWR0LWD
05-06 10:29:18 D/RunUtil: Running command [adb, -s, SKBFXYWR0LWD, shell, pm, list, features] with timeout: 2m 0s
05-06 10:29:18 W/TestDevice: Feature: feature:com.google.android.feature.tv.REFERENCE_PLUS is not available on SKBFXYWR0LWD
05-06 10:29:18 D/RunUtil: Running command [adb, -s, SKBFXYWR0LWD, shell, getprop, ro.product.first_api_level] with timeout: 45s
05-06 10:29:18 D/RunUtil: Running command [adb, -s, SKBFXYWR0LWD, shell, getprop, ro.boot.product.hardware.sku] with timeout: 45s
05-06 10:29:18 I/DeviceProfileCache: Product Hardware SKU Property null
05-06 10:29:18 I/DeviceProfileCache: Device Profile Cache created for device: com.android.tradefed.device.TestDevice@9b66e5d
05-06 10:29:18 D/TvConcurrentPlaybackHostTest: com.google.android.tv.concurrent.TvConcurrentPlaybackHostTest: after test, restore screen_brightness_mode to 0
05-06 10:29:18 D/NativeDevice: Using property ro.build.version.sdk=29 from cache.
05-06 10:29:18 D/TvConcurrentPlaybackHostTest: com.google.android.tv.concurrent.TvConcurrentPlaybackHostTest: after test, restore screensaver_enabled to 1
05-06 10:29:18 D/NativeDevice: Using property ro.build.version.sdk=29 from cache.
05-06 10:29:19 I/ConsoleReporter: [3/9 armeabi-v7a TvConcurrentMediaPlaybackHostTestCases SKBFXYWR0LWD] com.google.android.tv.concurrent.TvConcurrentPlaybackHostTest#testConcurrentBasicSecondaryPlayback[0_CpuHog_false_MemHog_false] skip
05-06 10:29:19 D/PrettyTestEventLogger: 
==================== com.google.android.tv.concurrent.TvConcurrentPlaybackHostTest#testConcurrentBasicSecondaryPlayback[0_CpuHog_false_MemHog_false] ENDED: Wed May 06 10:29:19 KST 2026 ====================
05-06 10:29:19 I/ModuleListener: [3/9] SKBFXYWR0LWD com.google.android.tv.concurrent.TvConcurrentPlaybackHostTest#testConcurrentBasicSecondaryPlayback[0_CpuHog_false_MemHog_false] ASSUMPTION_FAILURE: org.junit.AssumptionViolatedException: Skipping the test because com.google.android.tv.hardware.secondary_playback_ is not declared in this device and the device was launched with an Android version older than Android U
	at org.junit.Assume.assumeTrue(Assume.java:68)
	at org.junit.Assume.assumeFalse(Assume.java:75)
	at com.google.android.tv.concurrent.TvConcurrentPlaybackHostTest.testConcurrentBasicSecondaryPlayback(TvConcurrentPlaybackHostTest.java:187)
	at java.base/jdk.internal.reflect.DirectMethodHandleAccessor.invoke(DirectMethodHandleAccessor.java:103)
	at java.base/java.lang.reflect.Method.invoke(Method.java:580)
	at org.junit.runners.model.FrameworkMethod$1.runReflectiveCall(FrameworkMethod.java:59)
	at org.junit.internal.runners.model.ReflectiveCallable.run(ReflectiveCallable.java:12)
	at org.junit.runners.model.FrameworkMethod.invokeExplosively(FrameworkMethod.java:61)
	at org.junit.internal.runners.statements.InvokeMethod.evaluate(InvokeMethod.java:17)
	at org.junit.internal.runners.statements.RunBefores.evaluate(RunBefores.java:26)
	at org.junit.internal.runners.statements.RunAfters.evaluate(RunAfters.java:27)
	at org.junit.rules.ExternalResource$1.evaluate(ExternalResource.java:54)
	at org.junit.rules.ExternalResource$1.evaluate(ExternalResource.java:54)
	at org.junit.rules.TestWatcher$1.evaluate(TestWatcher.java:61)
	at org.junit.runners.ParentRunner$3.evaluate(ParentRunner.java:306)
	at org.junit.runners.BlockJUnit4ClassRunner$1.evaluate(BlockJUnit4ClassRunner.java:100)
	at org.junit.runners.ParentRunner.runLeaf(ParentRunner.java:366)
	at org.junit.runners.BlockJUnit4ClassRunner.runChild(BlockJUnit4ClassRunner.java:103)
	at org.junit.runners.BlockJUnit4ClassRunner.runChild(BlockJUnit4ClassRunner.java:63)
	at org.junit.runners.ParentRunner$4.run(ParentRunner.java:331)
	at org.junit.runners.ParentRunner$1.schedule(ParentRunner.java:79)
	at org.junit.runners.ParentRunner.runChildren(ParentRunner.java:329)
	at org.junit.runners.ParentRunner$2.evaluate(ParentRunner.java:293)
	at org.junit.runners.ParentRunner.run(ParentRunner.java:413)
	at org.junit.runners.Suite.runChild(Suite.java:128)
	at android.cts.host.utils.DeviceJUnit4Parameterized.runChild(DeviceJUnit4Parameterized.java:125)
	at android.cts.host.utils.DeviceJUnit4Parameterized.runChild(DeviceJUnit4Parameterized.java:44)
	at org.junit.runners.ParentRunner$4.run(ParentRunner.java:331)
	at org.junit.runners.ParentRunner$1.schedule(ParentRunner.java:79)
	at org.junit.runners.ParentRunner.runChildren(ParentRunner.java:329)
	at org.junit.runners.ParentRunner$2.evaluate(ParentRunner.java:293)
	at org.junit.runners.ParentRunner$3.evaluate(ParentRunner.java:306)
	at org.junit.runners.ParentRunner.run(ParentRunner.java:413)
	at com.android.tradefed.testtype.junit4.ExceptionThrowingRunnerWrapper.run(ExceptionThrowingRunnerWrapper.java:43)
	at org.junit.runner.JUnitCore.run(JUnitCore.java:137)
	at com.android.tradefed.testtype.HostTest.runJUnit4Tests(HostTest.java:775)
	at com.android.tradefed.testtype.HostTest.runTestClasses(HostTest.java:655)
	at com.android.tradefed.testtype.HostTest.run(HostTest.java:603)
	at com.android.tradefed.testtype.suite.GranularRetriableTestWrapper.intraModuleRun(GranularRetriableTestWrapper.java:448)
	at com.android.tradefed.testtype.suite.GranularRetriableTestWrapper.run(GranularRetriableTestWrapper.java:341)
	at com.android.tradefed.testtype.suite.ModuleDefinition.run(ModuleDefinition.java:619)
	at com.android.tradefed.testtype.suite.ITestSuite.runSingleModule(ITestSuite.java:1368)
	at com.android.tradefed.testtype.suite.ITestSuite.run(ITestSuite.java:1080)
	at com.android.tradefed.invoker.InvocationExecution.runTest(InvocationExecution.java:1463)
	at com.android.tradefed.invoker.InvocationExecution.runTests(InvocationExecution.java:1238)
	at com.android.tradefed.invoker.TestInvocation.prepareAndRun(TestInvocation.java:648)
	at com.android.tradefed.invoker.TestInvocation.performInvocation(TestInvocation.java:294)
	at com.android.tradefed.invoker.TestInvocation.invoke(TestInvocation.java:1462)
	at com.android.tradefed.command.CommandScheduler$InvocationThread.run(CommandScheduler.java:719)

05-06 10:29:19 D/PrettyTestEventLogger: 
==================== com.google.android.tv.concurrent.TvConcurrentPlaybackHostTest#testConcurrentQuadPlayback[1_CpuHog_true_MemHog_false] STARTED: Wed May 06 10:29:19 KST 2026 ====================
05-06 10:29:19 D/ModuleListener: ModuleListener.testStarted(com.google.android.tv.concurrent.TvConcurrentPlaybackHostTest#testConcurrentQuadPlayback[1_CpuHog_true_MemHog_false]) on SKBFXYWR0LWD
05-06 10:29:19 D/NativeDevice: Using property ro.build.version.sdk=29 from cache.
05-06 10:29:19 D/DeviceHostUtils: apiLevel: 29
05-06 10:29:19 D/NativeDevice: Using property ro.build.version.sdk=29 from cache.
05-06 10:29:19 D/DeviceHostUtils: apiLevel: 29
05-06 10:29:19 D/TvConcurrentPlaybackHostTest: com.google.android.tv.concurrent.TvConcurrentPlaybackHostTest: before test, screen_brightness_mode = 0
05-06 10:29:19 D/TvConcurrentPlaybackHostTest: com.google.android.tv.concurrent.TvConcurrentPlaybackHostTest: before test, screensaver_enabled = 1
05-06 10:29:19 D/NativeDevice: Using property ro.build.version.sdk=29 from cache.
05-06 10:29:19 D/NativeDevice: Using property ro.build.version.sdk=29 from cache.
05-06 10:29:19 D/RunUtil: Running command [adb, -s, SKBFXYWR0LWD, shell, pm, list, features] with timeout: 2m 0s
05-06 10:29:19 W/TestDevice: Feature: feature:com.google.android.tv.hardware.quad_playback_4k60 is not available on SKBFXYWR0LWD
05-06 10:29:19 D/RunUtil: Running command [adb, -s, SKBFXYWR0LWD, shell, pm, list, features] with timeout: 2m 0s
05-06 10:29:19 W/TestDevice: Feature: feature:com.google.android.tv.hardware.quad_playback_4k30 is not available on SKBFXYWR0LWD
05-06 10:29:19 D/RunUtil: Running command [adb, -s, SKBFXYWR0LWD, shell, pm, list, features] with timeout: 2m 0s
05-06 10:29:19 W/TestDevice: Feature: feature:com.google.android.tv.hardware.quad_playback_1080p60 is not available on SKBFXYWR0LWD
05-06 10:29:19 D/RunUtil: Running command [adb, -s, SKBFXYWR0LWD, shell, pm, list, features] with timeout: 2m 0s
05-06 10:29:19 W/TestDevice: Feature: feature:com.google.android.tv.hardware.quad_playback_1080p30 is not available on SKBFXYWR0LWD
05-06 10:29:19 D/RunUtil: Running command [adb, -s, SKBFXYWR0LWD, shell, pm, list, features] with timeout: 2m 0s
05-06 10:29:20 W/TestDevice: Feature: feature:com.google.android.tv.hardware.quad_playback_720p60 is not available on SKBFXYWR0LWD
05-06 10:29:20 D/RunUtil: Running command [adb, -s, SKBFXYWR0LWD, shell, pm, list, features] with timeout: 2m 0s
05-06 10:29:20 W/TestDevice: Feature: feature:com.google.android.tv.hardware.quad_playback_720p30 is not available on SKBFXYWR0LWD
05-06 10:29:20 D/RunUtil: Running command [adb, -s, SKBFXYWR0LWD, shell, pm, list, features] with timeout: 2m 0s
05-06 10:29:20 W/TestDevice: Feature: feature:com.google.android.tv.hardware.quad_playback_540p60 is not available on SKBFXYWR0LWD
05-06 10:29:20 D/RunUtil: Running command [adb, -s, SKBFXYWR0LWD, shell, pm, list, features] with timeout: 2m 0s
05-06 10:29:20 W/TestDevice: Feature: feature:com.google.android.tv.hardware.quad_playback_540p30 is not available on SKBFXYWR0LWD
05-06 10:29:20 D/RunUtil: Running command [adb, -s, SKBFXYWR0LWD, shell, pm, list, features] with timeout: 2m 0s
05-06 10:29:20 W/TestDevice: Feature: feature:com.google.android.tv.hardware.quad_playback_480p60 is not available on SKBFXYWR0LWD
05-06 10:29:20 D/RunUtil: Running command [adb, -s, SKBFXYWR0LWD, shell, pm, list, features] with timeout: 2m 0s
05-06 10:29:20 W/TestDevice: Feature: feature:com.google.android.tv.hardware.quad_playback_480p30 is not available on SKBFXYWR0LWD
05-06 10:29:20 D/com.google.android.tv.concurrent.TvConcurrentPlaybackHostTest: com.google.android.tv.hardware.quad_playback_ not declared on device
05-06 10:29:20 D/TvConcurrentPlaybackHostTest: com.google.android.tv.concurrent.TvConcurrentPlaybackHostTest: after test, restore screen_brightness_mode to 0
05-06 10:29:20 D/NativeDevice: Using property ro.build.version.sdk=29 from cache.
05-06 10:29:20 D/TvConcurrentPlaybackHostTest: com.google.android.tv.concurrent.TvConcurrentPlaybackHostTest: after test, restore screensaver_enabled to 1
05-06 10:29:20 D/NativeDevice: Using property ro.build.version.sdk=29 from cache.
05-06 10:29:20 I/ConsoleReporter: [4/9 armeabi-v7a TvConcurrentMediaPlaybackHostTestCases SKBFXYWR0LWD] com.google.android.tv.concurrent.TvConcurrentPlaybackHostTest#testConcurrentQuadPlayback[1_CpuHog_true_MemHog_false] skip
05-06 10:29:20 D/PrettyTestEventLogger: 
==================== com.google.android.tv.concurrent.TvConcurrentPlaybackHostTest#testConcurrentQuadPlayback[1_CpuHog_true_MemHog_false] ENDED: Wed May 06 10:29:20 KST 2026 ====================
05-06 10:29:20 I/ModuleListener: [4/9] SKBFXYWR0LWD com.google.android.tv.concurrent.TvConcurrentPlaybackHostTest#testConcurrentQuadPlayback[1_CpuHog_true_MemHog_false] ASSUMPTION_FAILURE: org.junit.AssumptionViolatedException: Skipping the test because com.google.android.tv.hardware.quad_playback_ is not declared in this device
	at org.junit.Assume.assumeTrue(Assume.java:68)
	at org.junit.Assume.assumeFalse(Assume.java:75)
	at com.google.android.tv.concurrent.TvConcurrentPlaybackHostTest.testConcurrentQuadPlayback(TvConcurrentPlaybackHostTest.java:226)
	at java.base/jdk.internal.reflect.DirectMethodHandleAccessor.invoke(DirectMethodHandleAccessor.java:103)
	at java.base/java.lang.reflect.Method.invoke(Method.java:580)
	at org.junit.runners.model.FrameworkMethod$1.runReflectiveCall(FrameworkMethod.java:59)
	at org.junit.internal.runners.model.ReflectiveCallable.run(ReflectiveCallable.java:12)
	at org.junit.runners.model.FrameworkMethod.invokeExplosively(FrameworkMethod.java:61)
	at org.junit.internal.runners.statements.InvokeMethod.evaluate(InvokeMethod.java:17)
	at org.junit.internal.runners.statements.RunBefores.evaluate(RunBefores.java:26)
	at org.junit.internal.runners.statements.RunAfters.evaluate(RunAfters.java:27)
	at org.junit.rules.ExternalResource$1.evaluate(ExternalResource.java:54)
	at org.junit.rules.ExternalResource$1.evaluate(ExternalResource.java:54)
	at org.junit.rules.TestWatcher$1.evaluate(TestWatcher.java:61)
	at org.junit.runners.ParentRunner$3.evaluate(ParentRunner.java:306)
	at org.junit.runners.BlockJUnit4ClassRunner$1.evaluate(BlockJUnit4ClassRunner.java:100)
	at org.junit.runners.ParentRunner.runLeaf(ParentRunner.java:366)
	at org.junit.runners.BlockJUnit4ClassRunner.runChild(BlockJUnit4ClassRunner.java:103)
	at org.junit.runners.BlockJUnit4ClassRunner.runChild(BlockJUnit4ClassRunner.java:63)
	at org.junit.runners.ParentRunner$4.run(ParentRunner.java:331)
	at org.junit.runners.ParentRunner$1.schedule(ParentRunner.java:79)
	at org.junit.runners.ParentRunner.runChildren(ParentRunner.java:329)
	at org.junit.runners.ParentRunner$2.evaluate(ParentRunner.java:293)
	at org.junit.runners.ParentRunner.run(ParentRunner.java:413)
	at org.junit.runners.Suite.runChild(Suite.java:128)
	at android.cts.host.utils.DeviceJUnit4Parameterized.runChild(DeviceJUnit4Parameterized.java:125)
	at android.cts.host.utils.DeviceJUnit4Parameterized.runChild(DeviceJUnit4Parameterized.java:44)
	at org.junit.runners.ParentRunner$4.run(ParentRunner.java:331)
	at org.junit.runners.ParentRunner$1.schedule(ParentRunner.java:79)
	at org.junit.runners.ParentRunner.runChildren(ParentRunner.java:329)
	at org.junit.runners.ParentRunner$2.evaluate(ParentRunner.java:293)
	at org.junit.runners.ParentRunner$3.evaluate(ParentRunner.java:306)
	at org.junit.runners.ParentRunner.run(ParentRunner.java:413)
	at com.android.tradefed.testtype.junit4.ExceptionThrowingRunnerWrapper.run(ExceptionThrowingRunnerWrapper.java:43)
	at org.junit.runner.JUnitCore.run(JUnitCore.java:137)
	at com.android.tradefed.testtype.HostTest.runJUnit4Tests(HostTest.java:775)
	at com.android.tradefed.testtype.HostTest.runTestClasses(HostTest.java:655)
	at com.android.tradefed.testtype.HostTest.run(HostTest.java:603)
	at com.android.tradefed.testtype.suite.GranularRetriableTestWrapper.intraModuleRun(GranularRetriableTestWrapper.java:448)
	at com.android.tradefed.testtype.suite.GranularRetriableTestWrapper.run(GranularRetriableTestWrapper.java:341)
	at com.android.tradefed.testtype.suite.ModuleDefinition.run(ModuleDefinition.java:619)
	at com.android.tradefed.testtype.suite.ITestSuite.runSingleModule(ITestSuite.java:1368)
	at com.android.tradefed.testtype.suite.ITestSuite.run(ITestSuite.java:1080)
	at com.android.tradefed.invoker.InvocationExecution.runTest(InvocationExecution.java:1463)
	at com.android.tradefed.invoker.InvocationExecution.runTests(InvocationExecution.java:1238)
	at com.android.tradefed.invoker.TestInvocation.prepareAndRun(TestInvocation.java:648)
	at com.android.tradefed.invoker.TestInvocation.performInvocation(TestInvocation.java:294)
	at com.android.tradefed.invoker.TestInvocation.invoke(TestInvocation.java:1462)
	at com.android.tradefed.command.CommandScheduler$InvocationThread.run(CommandScheduler.java:719)

05-06 10:29:20 D/PrettyTestEventLogger: 
==================== com.google.android.tv.concurrent.TvConcurrentPlaybackHostTest#testConcurrentDualPlayback[1_CpuHog_true_MemHog_false] STARTED: Wed May 06 10:29:20 KST 2026 ====================
05-06 10:29:20 D/ModuleListener: ModuleListener.testStarted(com.google.android.tv.concurrent.TvConcurrentPlaybackHostTest#testConcurrentDualPlayback[1_CpuHog_true_MemHog_false]) on SKBFXYWR0LWD
05-06 10:29:20 D/NativeDevice: Using property ro.build.version.sdk=29 from cache.
05-06 10:29:20 D/DeviceHostUtils: apiLevel: 29
05-06 10:29:20 D/NativeDevice: Using property ro.build.version.sdk=29 from cache.
05-06 10:29:20 D/DeviceHostUtils: apiLevel: 29
05-06 10:29:21 D/TvConcurrentPlaybackHostTest: com.google.android.tv.concurrent.TvConcurrentPlaybackHostTest: before test, screen_brightness_mode = 0
05-06 10:29:21 D/TvConcurrentPlaybackHostTest: com.google.android.tv.concurrent.TvConcurrentPlaybackHostTest: before test, screensaver_enabled = 1
05-06 10:29:21 D/NativeDevice: Using property ro.build.version.sdk=29 from cache.
05-06 10:29:21 D/NativeDevice: Using property ro.build.version.sdk=29 from cache.
05-06 10:29:21 D/RunUtil: Running command [adb, -s, SKBFXYWR0LWD, shell, pm, list, features] with timeout: 2m 0s
05-06 10:29:21 W/TestDevice: Feature: feature:com.google.android.tv.hardware.dual_playback_4k60 is not available on SKBFXYWR0LWD
05-06 10:29:21 D/RunUtil: Running command [adb, -s, SKBFXYWR0LWD, shell, pm, list, features] with timeout: 2m 0s
05-06 10:29:21 W/TestDevice: Feature: feature:com.google.android.tv.hardware.dual_playback_4k30 is not available on SKBFXYWR0LWD
05-06 10:29:21 D/RunUtil: Running command [adb, -s, SKBFXYWR0LWD, shell, pm, list, features] with timeout: 2m 0s
05-06 10:29:21 W/TestDevice: Feature: feature:com.google.android.tv.hardware.dual_playback_1080p60 is not available on SKBFXYWR0LWD
05-06 10:29:21 D/RunUtil: Running command [adb, -s, SKBFXYWR0LWD, shell, pm, list, features] with timeout: 2m 0s
05-06 10:29:21 W/TestDevice: Feature: feature:com.google.android.tv.hardware.dual_playback_1080p30 is not available on SKBFXYWR0LWD
05-06 10:29:21 D/RunUtil: Running command [adb, -s, SKBFXYWR0LWD, shell, pm, list, features] with timeout: 2m 0s
05-06 10:29:21 W/TestDevice: Feature: feature:com.google.android.tv.hardware.dual_playback_720p60 is not available on SKBFXYWR0LWD
05-06 10:29:21 D/RunUtil: Running command [adb, -s, SKBFXYWR0LWD, shell, pm, list, features] with timeout: 2m 0s
05-06 10:29:21 W/TestDevice: Feature: feature:com.google.android.tv.hardware.dual_playback_720p30 is not available on SKBFXYWR0LWD
05-06 10:29:21 D/RunUtil: Running command [adb, -s, SKBFXYWR0LWD, shell, pm, list, features] with timeout: 2m 0s
05-06 10:29:21 W/TestDevice: Feature: feature:com.google.android.tv.hardware.dual_playback_540p60 is not available on SKBFXYWR0LWD
05-06 10:29:21 D/RunUtil: Running command [adb, -s, SKBFXYWR0LWD, shell, pm, list, features] with timeout: 2m 0s
05-06 10:29:21 W/TestDevice: Feature: feature:com.google.android.tv.hardware.dual_playback_540p30 is not available on SKBFXYWR0LWD
05-06 10:29:21 D/RunUtil: Running command [adb, -s, SKBFXYWR0LWD, shell, pm, list, features] with timeout: 2m 0s
05-06 10:29:21 W/TestDevice: Feature: feature:com.google.android.tv.hardware.dual_playback_480p60 is not available on SKBFXYWR0LWD
05-06 10:29:21 D/RunUtil: Running command [adb, -s, SKBFXYWR0LWD, shell, pm, list, features] with timeout: 2m 0s
05-06 10:29:21 W/TestDevice: Feature: feature:com.google.android.tv.hardware.dual_playback_480p30 is not available on SKBFXYWR0LWD
05-06 10:29:21 D/com.google.android.tv.concurrent.TvConcurrentPlaybackHostTest: com.google.android.tv.hardware.dual_playback_ not declared on device
05-06 10:29:21 D/TvConcurrentPlaybackHostTest: com.google.android.tv.concurrent.TvConcurrentPlaybackHostTest: after test, restore screen_brightness_mode to 0
05-06 10:29:21 D/NativeDevice: Using property ro.build.version.sdk=29 from cache.
05-06 10:29:21 D/TvConcurrentPlaybackHostTest: com.google.android.tv.concurrent.TvConcurrentPlaybackHostTest: after test, restore screensaver_enabled to 1
05-06 10:29:21 D/NativeDevice: Using property ro.build.version.sdk=29 from cache.
05-06 10:29:21 I/ConsoleReporter: [5/9 armeabi-v7a TvConcurrentMediaPlaybackHostTestCases SKBFXYWR0LWD] com.google.android.tv.concurrent.TvConcurrentPlaybackHostTest#testConcurrentDualPlayback[1_CpuHog_true_MemHog_false] skip
05-06 10:29:21 D/PrettyTestEventLogger: 
==================== com.google.android.tv.concurrent.TvConcurrentPlaybackHostTest#testConcurrentDualPlayback[1_CpuHog_true_MemHog_false] ENDED: Wed May 06 10:29:21 KST 2026 ====================
05-06 10:29:21 I/ModuleListener: [5/9] SKBFXYWR0LWD com.google.android.tv.concurrent.TvConcurrentPlaybackHostTest#testConcurrentDualPlayback[1_CpuHog_true_MemHog_false] ASSUMPTION_FAILURE: org.junit.AssumptionViolatedException: Skipping the test because com.google.android.tv.hardware.dual_playback_ is not declared in this device
	at org.junit.Assume.assumeTrue(Assume.java:68)
	at org.junit.Assume.assumeFalse(Assume.java:75)
	at com.google.android.tv.concurrent.TvConcurrentPlaybackHostTest.testConcurrentDualPlayback(TvConcurrentPlaybackHostTest.java:208)
	at java.base/jdk.internal.reflect.DirectMethodHandleAccessor.invoke(DirectMethodHandleAccessor.java:103)
	at java.base/java.lang.reflect.Method.invoke(Method.java:580)
	at org.junit.runners.model.FrameworkMethod$1.runReflectiveCall(FrameworkMethod.java:59)
	at org.junit.internal.runners.model.ReflectiveCallable.run(ReflectiveCallable.java:12)
	at org.junit.runners.model.FrameworkMethod.invokeExplosively(FrameworkMethod.java:61)
	at org.junit.internal.runners.statements.InvokeMethod.evaluate(InvokeMethod.java:17)
	at org.junit.internal.runners.statements.RunBefores.evaluate(RunBefores.java:26)
	at org.junit.internal.runners.statements.RunAfters.evaluate(RunAfters.java:27)
	at org.junit.rules.ExternalResource$1.evaluate(ExternalResource.java:54)
	at org.junit.rules.ExternalResource$1.evaluate(ExternalResource.java:54)
	at org.junit.rules.TestWatcher$1.evaluate(TestWatcher.java:61)
	at org.junit.runners.ParentRunner$3.evaluate(ParentRunner.java:306)
	at org.junit.runners.BlockJUnit4ClassRunner$1.evaluate(BlockJUnit4ClassRunner.java:100)
	at org.junit.runners.ParentRunner.runLeaf(ParentRunner.java:366)
	at org.junit.runners.BlockJUnit4ClassRunner.runChild(BlockJUnit4ClassRunner.java:103)
	at org.junit.runners.BlockJUnit4ClassRunner.runChild(BlockJUnit4ClassRunner.java:63)
	at org.junit.runners.ParentRunner$4.run(ParentRunner.java:331)
	at org.junit.runners.ParentRunner$1.schedule(ParentRunner.java:79)
	at org.junit.runners.ParentRunner.runChildren(ParentRunner.java:329)
	at org.junit.runners.ParentRunner$2.evaluate(ParentRunner.java:293)
	at org.junit.runners.ParentRunner.run(ParentRunner.java:413)
	at org.junit.runners.Suite.runChild(Suite.java:128)
	at android.cts.host.utils.DeviceJUnit4Parameterized.runChild(DeviceJUnit4Parameterized.java:125)
	at android.cts.host.utils.DeviceJUnit4Parameterized.runChild(DeviceJUnit4Parameterized.java:44)
	at org.junit.runners.ParentRunner$4.run(ParentRunner.java:331)
	at org.junit.runners.ParentRunner$1.schedule(ParentRunner.java:79)
	at org.junit.runners.ParentRunner.runChildren(ParentRunner.java:329)
	at org.junit.runners.ParentRunner$2.evaluate(ParentRunner.java:293)
	at org.junit.runners.ParentRunner$3.evaluate(ParentRunner.java:306)
	at org.junit.runners.ParentRunner.run(ParentRunner.java:413)
	at com.android.tradefed.testtype.junit4.ExceptionThrowingRunnerWrapper.run(ExceptionThrowingRunnerWrapper.java:43)
	at org.junit.runner.JUnitCore.run(JUnitCore.java:137)
	at com.android.tradefed.testtype.HostTest.runJUnit4Tests(HostTest.java:775)
	at com.android.tradefed.testtype.HostTest.runTestClasses(HostTest.java:655)
	at com.android.tradefed.testtype.HostTest.run(HostTest.java:603)
	at com.android.tradefed.testtype.suite.GranularRetriableTestWrapper.intraModuleRun(GranularRetriableTestWrapper.java:448)
	at com.android.tradefed.testtype.suite.GranularRetriableTestWrapper.run(GranularRetriableTestWrapper.java:341)
	at com.android.tradefed.testtype.suite.ModuleDefinition.run(ModuleDefinition.java:619)
	at com.android.tradefed.testtype.suite.ITestSuite.runSingleModule(ITestSuite.java:1368)
	at com.android.tradefed.testtype.suite.ITestSuite.run(ITestSuite.java:1080)
	at com.android.tradefed.invoker.InvocationExecution.runTest(InvocationExecution.java:1463)
	at com.android.tradefed.invoker.InvocationExecution.runTests(InvocationExecution.java:1238)
	at com.android.tradefed.invoker.TestInvocation.prepareAndRun(TestInvocation.java:648)
	at com.android.tradefed.invoker.TestInvocation.performInvocation(TestInvocation.java:294)
	at com.android.tradefed.invoker.TestInvocation.invoke(TestInvocation.java:1462)
	at com.android.tradefed.command.CommandScheduler$InvocationThread.run(CommandScheduler.java:719)

05-06 10:29:21 D/PrettyTestEventLogger: 
==================== com.google.android.tv.concurrent.TvConcurrentPlaybackHostTest#testConcurrentBasicSecondaryPlayback[1_CpuHog_true_MemHog_false] STARTED: Wed May 06 10:29:21 KST 2026 ====================
05-06 10:29:21 D/ModuleListener: ModuleListener.testStarted(com.google.android.tv.concurrent.TvConcurrentPlaybackHostTest#testConcurrentBasicSecondaryPlayback[1_CpuHog_true_MemHog_false]) on SKBFXYWR0LWD
05-06 10:29:21 D/NativeDevice: Using property ro.build.version.sdk=29 from cache.
05-06 10:29:21 D/DeviceHostUtils: apiLevel: 29
05-06 10:29:21 D/NativeDevice: Using property ro.build.version.sdk=29 from cache.
05-06 10:29:21 D/DeviceHostUtils: apiLevel: 29
05-06 10:29:22 D/TvConcurrentPlaybackHostTest: com.google.android.tv.concurrent.TvConcurrentPlaybackHostTest: before test, screen_brightness_mode = 0
05-06 10:29:22 D/TvConcurrentPlaybackHostTest: com.google.android.tv.concurrent.TvConcurrentPlaybackHostTest: before test, screensaver_enabled = 1
05-06 10:29:22 D/NativeDevice: Using property ro.build.version.sdk=29 from cache.
05-06 10:29:22 D/NativeDevice: Using property ro.build.version.sdk=29 from cache.
05-06 10:29:22 D/RunUtil: Running command [adb, -s, SKBFXYWR0LWD, shell, pm, list, features] with timeout: 2m 0s
05-06 10:29:22 W/TestDevice: Feature: feature:com.google.android.tv.hardware.secondary_playback_4k60 is not available on SKBFXYWR0LWD
05-06 10:29:22 D/RunUtil: Running command [adb, -s, SKBFXYWR0LWD, shell, pm, list, features] with timeout: 2m 0s
05-06 10:29:22 W/TestDevice: Feature: feature:com.google.android.tv.hardware.secondary_playback_4k30 is not available on SKBFXYWR0LWD
05-06 10:29:22 D/RunUtil: Running command [adb, -s, SKBFXYWR0LWD, shell, pm, list, features] with timeout: 2m 0s
05-06 10:29:22 W/TestDevice: Feature: feature:com.google.android.tv.hardware.secondary_playback_1080p60 is not available on SKBFXYWR0LWD
05-06 10:29:22 D/RunUtil: Running command [adb, -s, SKBFXYWR0LWD, shell, pm, list, features] with timeout: 2m 0s
05-06 10:29:22 W/TestDevice: Feature: feature:com.google.android.tv.hardware.secondary_playback_1080p30 is not available on SKBFXYWR0LWD
05-06 10:29:22 D/RunUtil: Running command [adb, -s, SKBFXYWR0LWD, shell, pm, list, features] with timeout: 2m 0s
05-06 10:29:22 W/TestDevice: Feature: feature:com.google.android.tv.hardware.secondary_playback_720p60 is not available on SKBFXYWR0LWD
05-06 10:29:22 D/RunUtil: Running command [adb, -s, SKBFXYWR0LWD, shell, pm, list, features] with timeout: 2m 0s
05-06 10:29:22 W/TestDevice: Feature: feature:com.google.android.tv.hardware.secondary_playback_720p30 is not available on SKBFXYWR0LWD
05-06 10:29:22 D/RunUtil: Running command [adb, -s, SKBFXYWR0LWD, shell, pm, list, features] with timeout: 2m 0s
05-06 10:29:23 W/TestDevice: Feature: feature:com.google.android.tv.hardware.secondary_playback_540p60 is not available on SKBFXYWR0LWD
05-06 10:29:23 D/RunUtil: Running command [adb, -s, SKBFXYWR0LWD, shell, pm, list, features] with timeout: 2m 0s
05-06 10:29:23 W/TestDevice: Feature: feature:com.google.android.tv.hardware.secondary_playback_540p30 is not available on SKBFXYWR0LWD
05-06 10:29:23 D/RunUtil: Running command [adb, -s, SKBFXYWR0LWD, shell, pm, list, features] with timeout: 2m 0s
05-06 10:29:23 W/TestDevice: Feature: feature:com.google.android.tv.hardware.secondary_playback_480p60 is not available on SKBFXYWR0LWD
05-06 10:29:23 D/RunUtil: Running command [adb, -s, SKBFXYWR0LWD, shell, pm, list, features] with timeout: 2m 0s
05-06 10:29:23 W/TestDevice: Feature: feature:com.google.android.tv.hardware.secondary_playback_480p30 is not available on SKBFXYWR0LWD
05-06 10:29:23 D/com.google.android.tv.concurrent.TvConcurrentPlaybackHostTest: com.google.android.tv.hardware.secondary_playback_ not declared on device
05-06 10:29:23 D/NativeDevice: Using property ro.build.version.sdk=29 from cache.
05-06 10:29:23 D/TvConcurrentPlaybackHostTest: com.google.android.tv.concurrent.TvConcurrentPlaybackHostTest: after test, restore screen_brightness_mode to 0
05-06 10:29:23 D/NativeDevice: Using property ro.build.version.sdk=29 from cache.
05-06 10:29:23 D/TvConcurrentPlaybackHostTest: com.google.android.tv.concurrent.TvConcurrentPlaybackHostTest: after test, restore screensaver_enabled to 1
05-06 10:29:23 D/NativeDevice: Using property ro.build.version.sdk=29 from cache.
05-06 10:29:23 I/ConsoleReporter: [6/9 armeabi-v7a TvConcurrentMediaPlaybackHostTestCases SKBFXYWR0LWD] com.google.android.tv.concurrent.TvConcurrentPlaybackHostTest#testConcurrentBasicSecondaryPlayback[1_CpuHog_true_MemHog_false] skip
05-06 10:29:23 D/PrettyTestEventLogger: 
==================== com.google.android.tv.concurrent.TvConcurrentPlaybackHostTest#testConcurrentBasicSecondaryPlayback[1_CpuHog_true_MemHog_false] ENDED: Wed May 06 10:29:23 KST 2026 ====================
05-06 10:29:23 I/ModuleListener: [6/9] SKBFXYWR0LWD com.google.android.tv.concurrent.TvConcurrentPlaybackHostTest#testConcurrentBasicSecondaryPlayback[1_CpuHog_true_MemHog_false] ASSUMPTION_FAILURE: org.junit.AssumptionViolatedException: Skipping the test because com.google.android.tv.hardware.secondary_playback_ is not declared in this device and the device was launched with an Android version older than Android U
	at org.junit.Assume.assumeTrue(Assume.java:68)
	at org.junit.Assume.assumeFalse(Assume.java:75)
	at com.google.android.tv.concurrent.TvConcurrentPlaybackHostTest.testConcurrentBasicSecondaryPlayback(TvConcurrentPlaybackHostTest.java:187)
	at java.base/jdk.internal.reflect.DirectMethodHandleAccessor.invoke(DirectMethodHandleAccessor.java:103)
	at java.base/java.lang.reflect.Method.invoke(Method.java:580)
	at org.junit.runners.model.FrameworkMethod$1.runReflectiveCall(FrameworkMethod.java:59)
	at org.junit.internal.runners.model.ReflectiveCallable.run(ReflectiveCallable.java:12)
	at org.junit.runners.model.FrameworkMethod.invokeExplosively(FrameworkMethod.java:61)
	at org.junit.internal.runners.statements.InvokeMethod.evaluate(InvokeMethod.java:17)
	at org.junit.internal.runners.statements.RunBefores.evaluate(RunBefores.java:26)
	at org.junit.internal.runners.statements.RunAfters.evaluate(RunAfters.java:27)
	at org.junit.rules.ExternalResource$1.evaluate(ExternalResource.java:54)
	at org.junit.rules.ExternalResource$1.evaluate(ExternalResource.java:54)
	at org.junit.rules.TestWatcher$1.evaluate(TestWatcher.java:61)
	at org.junit.runners.ParentRunner$3.evaluate(ParentRunner.java:306)
	at org.junit.runners.BlockJUnit4ClassRunner$1.evaluate(BlockJUnit4ClassRunner.java:100)
	at org.junit.runners.ParentRunner.runLeaf(ParentRunner.java:366)
	at org.junit.runners.BlockJUnit4ClassRunner.runChild(BlockJUnit4ClassRunner.java:103)
	at org.junit.runners.BlockJUnit4ClassRunner.runChild(BlockJUnit4ClassRunner.java:63)
	at org.junit.runners.ParentRunner$4.run(ParentRunner.java:331)
	at org.junit.runners.ParentRunner$1.schedule(ParentRunner.java:79)
	at org.junit.runners.ParentRunner.runChildren(ParentRunner.java:329)
	at org.junit.runners.ParentRunner$2.evaluate(ParentRunner.java:293)
	at org.junit.runners.ParentRunner.run(ParentRunner.java:413)
	at org.junit.runners.Suite.runChild(Suite.java:128)
	at android.cts.host.utils.DeviceJUnit4Parameterized.runChild(DeviceJUnit4Parameterized.java:125)
	at android.cts.host.utils.DeviceJUnit4Parameterized.runChild(DeviceJUnit4Parameterized.java:44)
	at org.junit.runners.ParentRunner$4.run(ParentRunner.java:331)
	at org.junit.runners.ParentRunner$1.schedule(ParentRunner.java:79)
	at org.junit.runners.ParentRunner.runChildren(ParentRunner.java:329)
	at org.junit.runners.ParentRunner$2.evaluate(ParentRunner.java:293)
	at org.junit.runners.ParentRunner$3.evaluate(ParentRunner.java:306)
	at org.junit.runners.ParentRunner.run(ParentRunner.java:413)
	at com.android.tradefed.testtype.junit4.ExceptionThrowingRunnerWrapper.run(ExceptionThrowingRunnerWrapper.java:43)
	at org.junit.runner.JUnitCore.run(JUnitCore.java:137)
	at com.android.tradefed.testtype.HostTest.runJUnit4Tests(HostTest.java:775)
	at com.android.tradefed.testtype.HostTest.runTestClasses(HostTest.java:655)
	at com.android.tradefed.testtype.HostTest.run(HostTest.java:603)
	at com.android.tradefed.testtype.suite.GranularRetriableTestWrapper.intraModuleRun(GranularRetriableTestWrapper.java:448)
	at com.android.tradefed.testtype.suite.GranularRetriableTestWrapper.run(GranularRetriableTestWrapper.java:341)
	at com.android.tradefed.testtype.suite.ModuleDefinition.run(ModuleDefinition.java:619)
	at com.android.tradefed.testtype.suite.ITestSuite.runSingleModule(ITestSuite.java:1368)
	at com.android.tradefed.testtype.suite.ITestSuite.run(ITestSuite.java:1080)
	at com.android.tradefed.invoker.InvocationExecution.runTest(InvocationExecution.java:1463)
	at com.android.tradefed.invoker.InvocationExecution.runTests(InvocationExecution.java:1238)
	at com.android.tradefed.invoker.TestInvocation.prepareAndRun(TestInvocation.java:648)
	at com.android.tradefed.invoker.TestInvocation.performInvocation(TestInvocation.java:294)
	at com.android.tradefed.invoker.TestInvocation.invoke(TestInvocation.java:1462)
	at com.android.tradefed.command.CommandScheduler$InvocationThread.run(CommandScheduler.java:719)

05-06 10:29:23 D/PrettyTestEventLogger: 
==================== com.google.android.tv.concurrent.TvConcurrentPlaybackHostTest#testConcurrentQuadPlayback[2_CpuHog_false_MemHog_true] STARTED: Wed May 06 10:29:23 KST 2026 ====================
05-06 10:29:23 D/ModuleListener: ModuleListener.testStarted(com.google.android.tv.concurrent.TvConcurrentPlaybackHostTest#testConcurrentQuadPlayback[2_CpuHog_false_MemHog_true]) on SKBFXYWR0LWD
05-06 10:29:23 D/NativeDevice: Using property ro.build.version.sdk=29 from cache.
05-06 10:29:23 D/DeviceHostUtils: apiLevel: 29
05-06 10:29:23 D/NativeDevice: Using property ro.build.version.sdk=29 from cache.
05-06 10:29:23 D/DeviceHostUtils: apiLevel: 29
05-06 10:29:23 D/TvConcurrentPlaybackHostTest: com.google.android.tv.concurrent.TvConcurrentPlaybackHostTest: before test, screen_brightness_mode = 0
05-06 10:29:23 D/TvConcurrentPlaybackHostTest: com.google.android.tv.concurrent.TvConcurrentPlaybackHostTest: before test, screensaver_enabled = 1
05-06 10:29:23 D/NativeDevice: Using property ro.build.version.sdk=29 from cache.
05-06 10:29:23 D/NativeDevice: Using property ro.build.version.sdk=29 from cache.
05-06 10:29:23 D/RunUtil: Running command [adb, -s, SKBFXYWR0LWD, shell, pm, list, features] with timeout: 2m 0s
05-06 10:29:24 W/TestDevice: Feature: feature:com.google.android.tv.hardware.quad_playback_4k60 is not available on SKBFXYWR0LWD
05-06 10:29:24 D/RunUtil: Running command [adb, -s, SKBFXYWR0LWD, shell, pm, list, features] with timeout: 2m 0s
05-06 10:29:24 W/TestDevice: Feature: feature:com.google.android.tv.hardware.quad_playback_4k30 is not available on SKBFXYWR0LWD
05-06 10:29:24 D/RunUtil: Running command [adb, -s, SKBFXYWR0LWD, shell, pm, list, features] with timeout: 2m 0s
05-06 10:29:24 W/TestDevice: Feature: feature:com.google.android.tv.hardware.quad_playback_1080p60 is not available on SKBFXYWR0LWD
05-06 10:29:24 D/RunUtil: Running command [adb, -s, SKBFXYWR0LWD, shell, pm, list, features] with timeout: 2m 0s
05-06 10:29:24 W/TestDevice: Feature: feature:com.google.android.tv.hardware.quad_playback_1080p30 is not available on SKBFXYWR0LWD
05-06 10:29:24 D/RunUtil: Running command [adb, -s, SKBFXYWR0LWD, shell, pm, list, features] with timeout: 2m 0s
05-06 10:29:24 W/TestDevice: Feature: feature:com.google.android.tv.hardware.quad_playback_720p60 is not available on SKBFXYWR0LWD
05-06 10:29:24 D/RunUtil: Running command [adb, -s, SKBFXYWR0LWD, shell, pm, list, features] with timeout: 2m 0s
05-06 10:29:24 W/TestDevice: Feature: feature:com.google.android.tv.hardware.quad_playback_720p30 is not available on SKBFXYWR0LWD
05-06 10:29:24 D/RunUtil: Running command [adb, -s, SKBFXYWR0LWD, shell, pm, list, features] with timeout: 2m 0s
05-06 10:29:24 W/TestDevice: Feature: feature:com.google.android.tv.hardware.quad_playback_540p60 is not available on SKBFXYWR0LWD
05-06 10:29:24 D/RunUtil: Running command [adb, -s, SKBFXYWR0LWD, shell, pm, list, features] with timeout: 2m 0s
05-06 10:29:24 W/TestDevice: Feature: feature:com.google.android.tv.hardware.quad_playback_540p30 is not available on SKBFXYWR0LWD
05-06 10:29:24 D/RunUtil: Running command [adb, -s, SKBFXYWR0LWD, shell, pm, list, features] with timeout: 2m 0s
05-06 10:29:24 W/TestDevice: Feature: feature:com.google.android.tv.hardware.quad_playback_480p60 is not available on SKBFXYWR0LWD
05-06 10:29:24 D/RunUtil: Running command [adb, -s, SKBFXYWR0LWD, shell, pm, list, features] with timeout: 2m 0s
05-06 10:29:24 W/TestDevice: Feature: feature:com.google.android.tv.hardware.quad_playback_480p30 is not available on SKBFXYWR0LWD
05-06 10:29:24 D/com.google.android.tv.concurrent.TvConcurrentPlaybackHostTest: com.google.android.tv.hardware.quad_playback_ not declared on device
05-06 10:29:24 D/TvConcurrentPlaybackHostTest: com.google.android.tv.concurrent.TvConcurrentPlaybackHostTest: after test, restore screen_brightness_mode to 0
05-06 10:29:24 D/NativeDevice: Using property ro.build.version.sdk=29 from cache.
05-06 10:29:24 D/TvConcurrentPlaybackHostTest: com.google.android.tv.concurrent.TvConcurrentPlaybackHostTest: after test, restore screensaver_enabled to 1
05-06 10:29:24 D/NativeDevice: Using property ro.build.version.sdk=29 from cache.
05-06 10:29:24 I/ConsoleReporter: [7/9 armeabi-v7a TvConcurrentMediaPlaybackHostTestCases SKBFXYWR0LWD] com.google.android.tv.concurrent.TvConcurrentPlaybackHostTest#testConcurrentQuadPlayback[2_CpuHog_false_MemHog_true] skip
05-06 10:29:24 D/PrettyTestEventLogger: 
==================== com.google.android.tv.concurrent.TvConcurrentPlaybackHostTest#testConcurrentQuadPlayback[2_CpuHog_false_MemHog_true] ENDED: Wed May 06 10:29:24 KST 2026 ====================
05-06 10:29:24 I/ModuleListener: [7/9] SKBFXYWR0LWD com.google.android.tv.concurrent.TvConcurrentPlaybackHostTest#testConcurrentQuadPlayback[2_CpuHog_false_MemHog_true] ASSUMPTION_FAILURE: org.junit.AssumptionViolatedException: Skipping the test because com.google.android.tv.hardware.quad_playback_ is not declared in this device
	at org.junit.Assume.assumeTrue(Assume.java:68)
	at org.junit.Assume.assumeFalse(Assume.java:75)
	at com.google.android.tv.concurrent.TvConcurrentPlaybackHostTest.testConcurrentQuadPlayback(TvConcurrentPlaybackHostTest.java:226)
	at java.base/jdk.internal.reflect.DirectMethodHandleAccessor.invoke(DirectMethodHandleAccessor.java:103)
	at java.base/java.lang.reflect.Method.invoke(Method.java:580)
	at org.junit.runners.model.FrameworkMethod$1.runReflectiveCall(FrameworkMethod.java:59)
	at org.junit.internal.runners.model.ReflectiveCallable.run(ReflectiveCallable.java:12)
	at org.junit.runners.model.FrameworkMethod.invokeExplosively(FrameworkMethod.java:61)
	at org.junit.internal.runners.statements.InvokeMethod.evaluate(InvokeMethod.java:17)
	at org.junit.internal.runners.statements.RunBefores.evaluate(RunBefores.java:26)
	at org.junit.internal.runners.statements.RunAfters.evaluate(RunAfters.java:27)
	at org.junit.rules.ExternalResource$1.evaluate(ExternalResource.java:54)
	at org.junit.rules.ExternalResource$1.evaluate(ExternalResource.java:54)
	at org.junit.rules.TestWatcher$1.evaluate(TestWatcher.java:61)
	at org.junit.runners.ParentRunner$3.evaluate(ParentRunner.java:306)
	at org.junit.runners.BlockJUnit4ClassRunner$1.evaluate(BlockJUnit4ClassRunner.java:100)
	at org.junit.runners.ParentRunner.runLeaf(ParentRunner.java:366)
	at org.junit.runners.BlockJUnit4ClassRunner.runChild(BlockJUnit4ClassRunner.java:103)
	at org.junit.runners.BlockJUnit4ClassRunner.runChild(BlockJUnit4ClassRunner.java:63)
	at org.junit.runners.ParentRunner$4.run(ParentRunner.java:331)
	at org.junit.runners.ParentRunner$1.schedule(ParentRunner.java:79)
	at org.junit.runners.ParentRunner.runChildren(ParentRunner.java:329)
	at org.junit.runners.ParentRunner$2.evaluate(ParentRunner.java:293)
	at org.junit.runners.ParentRunner.run(ParentRunner.java:413)
	at org.junit.runners.Suite.runChild(Suite.java:128)
	at android.cts.host.utils.DeviceJUnit4Parameterized.runChild(DeviceJUnit4Parameterized.java:125)
	at android.cts.host.utils.DeviceJUnit4Parameterized.runChild(DeviceJUnit4Parameterized.java:44)
	at org.junit.runners.ParentRunner$4.run(ParentRunner.java:331)
	at org.junit.runners.ParentRunner$1.schedule(ParentRunner.java:79)
	at org.junit.runners.ParentRunner.runChildren(ParentRunner.java:329)
	at org.junit.runners.ParentRunner$2.evaluate(ParentRunner.java:293)
	at org.junit.runners.ParentRunner$3.evaluate(ParentRunner.java:306)
	at org.junit.runners.ParentRunner.run(ParentRunner.java:413)
	at com.android.tradefed.testtype.junit4.ExceptionThrowingRunnerWrapper.run(ExceptionThrowingRunnerWrapper.java:43)
	at org.junit.runner.JUnitCore.run(JUnitCore.java:137)
	at com.android.tradefed.testtype.HostTest.runJUnit4Tests(HostTest.java:775)
	at com.android.tradefed.testtype.HostTest.runTestClasses(HostTest.java:655)
	at com.android.tradefed.testtype.HostTest.run(HostTest.java:603)
	at com.android.tradefed.testtype.suite.GranularRetriableTestWrapper.intraModuleRun(GranularRetriableTestWrapper.java:448)
	at com.android.tradefed.testtype.suite.GranularRetriableTestWrapper.run(GranularRetriableTestWrapper.java:341)
	at com.android.tradefed.testtype.suite.ModuleDefinition.run(ModuleDefinition.java:619)
	at com.android.tradefed.testtype.suite.ITestSuite.runSingleModule(ITestSuite.java:1368)
	at com.android.tradefed.testtype.suite.ITestSuite.run(ITestSuite.java:1080)
	at com.android.tradefed.invoker.InvocationExecution.runTest(InvocationExecution.java:1463)
	at com.android.tradefed.invoker.InvocationExecution.runTests(InvocationExecution.java:1238)
	at com.android.tradefed.invoker.TestInvocation.prepareAndRun(TestInvocation.java:648)
	at com.android.tradefed.invoker.TestInvocation.performInvocation(TestInvocation.java:294)
	at com.android.tradefed.invoker.TestInvocation.invoke(TestInvocation.java:1462)
	at com.android.tradefed.command.CommandScheduler$InvocationThread.run(CommandScheduler.java:719)

05-06 10:29:24 D/PrettyTestEventLogger: 
==================== com.google.android.tv.concurrent.TvConcurrentPlaybackHostTest#testConcurrentDualPlayback[2_CpuHog_false_MemHog_true] STARTED: Wed May 06 10:29:24 KST 2026 ====================
05-06 10:29:24 D/ModuleListener: ModuleListener.testStarted(com.google.android.tv.concurrent.TvConcurrentPlaybackHostTest#testConcurrentDualPlayback[2_CpuHog_false_MemHog_true]) on SKBFXYWR0LWD
05-06 10:29:24 D/NativeDevice: Using property ro.build.version.sdk=29 from cache.
05-06 10:29:24 D/DeviceHostUtils: apiLevel: 29
05-06 10:29:24 D/NativeDevice: Using property ro.build.version.sdk=29 from cache.
05-06 10:29:24 D/DeviceHostUtils: apiLevel: 29
05-06 10:29:25 D/TvConcurrentPlaybackHostTest: com.google.android.tv.concurrent.TvConcurrentPlaybackHostTest: before test, screen_brightness_mode = 0
05-06 10:29:25 D/TvConcurrentPlaybackHostTest: com.google.android.tv.concurrent.TvConcurrentPlaybackHostTest: before test, screensaver_enabled = 1
05-06 10:29:25 D/NativeDevice: Using property ro.build.version.sdk=29 from cache.
05-06 10:29:25 D/NativeDevice: Using property ro.build.version.sdk=29 from cache.
05-06 10:29:25 D/RunUtil: Running command [adb, -s, SKBFXYWR0LWD, shell, pm, list, features] with timeout: 2m 0s
05-06 10:29:25 W/TestDevice: Feature: feature:com.google.android.tv.hardware.dual_playback_4k60 is not available on SKBFXYWR0LWD
05-06 10:29:25 D/RunUtil: Running command [adb, -s, SKBFXYWR0LWD, shell, pm, list, features] with timeout: 2m 0s
05-06 10:29:25 W/TestDevice: Feature: feature:com.google.android.tv.hardware.dual_playback_4k30 is not available on SKBFXYWR0LWD
05-06 10:29:25 D/RunUtil: Running command [adb, -s, SKBFXYWR0LWD, shell, pm, list, features] with timeout: 2m 0s
05-06 10:29:25 W/TestDevice: Feature: feature:com.google.android.tv.hardware.dual_playback_1080p60 is not available on SKBFXYWR0LWD
05-06 10:29:25 D/RunUtil: Running command [adb, -s, SKBFXYWR0LWD, shell, pm, list, features] with timeout: 2m 0s
05-06 10:29:25 W/TestDevice: Feature: feature:com.google.android.tv.hardware.dual_playback_1080p30 is not available on SKBFXYWR0LWD
05-06 10:29:25 D/RunUtil: Running command [adb, -s, SKBFXYWR0LWD, shell, pm, list, features] with timeout: 2m 0s
05-06 10:29:25 W/TestDevice: Feature: feature:com.google.android.tv.hardware.dual_playback_720p60 is not available on SKBFXYWR0LWD
05-06 10:29:25 D/RunUtil: Running command [adb, -s, SKBFXYWR0LWD, shell, pm, list, features] with timeout: 2m 0s
05-06 10:29:25 W/TestDevice: Feature: feature:com.google.android.tv.hardware.dual_playback_720p30 is not available on SKBFXYWR0LWD
05-06 10:29:25 D/RunUtil: Running command [adb, -s, SKBFXYWR0LWD, shell, pm, list, features] with timeout: 2m 0s
05-06 10:29:25 W/TestDevice: Feature: feature:com.google.android.tv.hardware.dual_playback_540p60 is not available on SKBFXYWR0LWD
05-06 10:29:25 D/RunUtil: Running command [adb, -s, SKBFXYWR0LWD, shell, pm, list, features] with timeout: 2m 0s
05-06 10:29:26 W/TestDevice: Feature: feature:com.google.android.tv.hardware.dual_playback_540p30 is not available on SKBFXYWR0LWD
05-06 10:29:26 D/RunUtil: Running command [adb, -s, SKBFXYWR0LWD, shell, pm, list, features] with timeout: 2m 0s
05-06 10:29:26 W/TestDevice: Feature: feature:com.google.android.tv.hardware.dual_playback_480p60 is not available on SKBFXYWR0LWD
05-06 10:29:26 D/RunUtil: Running command [adb, -s, SKBFXYWR0LWD, shell, pm, list, features] with timeout: 2m 0s
05-06 10:29:26 W/TestDevice: Feature: feature:com.google.android.tv.hardware.dual_playback_480p30 is not available on SKBFXYWR0LWD
05-06 10:29:26 D/com.google.android.tv.concurrent.TvConcurrentPlaybackHostTest: com.google.android.tv.hardware.dual_playback_ not declared on device
05-06 10:29:26 D/TvConcurrentPlaybackHostTest: com.google.android.tv.concurrent.TvConcurrentPlaybackHostTest: after test, restore screen_brightness_mode to 0
05-06 10:29:26 D/NativeDevice: Using property ro.build.version.sdk=29 from cache.
05-06 10:29:26 D/TvConcurrentPlaybackHostTest: com.google.android.tv.concurrent.TvConcurrentPlaybackHostTest: after test, restore screensaver_enabled to 1
05-06 10:29:26 D/NativeDevice: Using property ro.build.version.sdk=29 from cache.
05-06 10:29:26 I/ConsoleReporter: [8/9 armeabi-v7a TvConcurrentMediaPlaybackHostTestCases SKBFXYWR0LWD] com.google.android.tv.concurrent.TvConcurrentPlaybackHostTest#testConcurrentDualPlayback[2_CpuHog_false_MemHog_true] skip
05-06 10:29:26 D/PrettyTestEventLogger: 
==================== com.google.android.tv.concurrent.TvConcurrentPlaybackHostTest#testConcurrentDualPlayback[2_CpuHog_false_MemHog_true] ENDED: Wed May 06 10:29:26 KST 2026 ====================
05-06 10:29:26 I/ModuleListener: [8/9] SKBFXYWR0LWD com.google.android.tv.concurrent.TvConcurrentPlaybackHostTest#testConcurrentDualPlayback[2_CpuHog_false_MemHog_true] ASSUMPTION_FAILURE: org.junit.AssumptionViolatedException: Skipping the test because com.google.android.tv.hardware.dual_playback_ is not declared in this device
	at org.junit.Assume.assumeTrue(Assume.java:68)
	at org.junit.Assume.assumeFalse(Assume.java:75)
	at com.google.android.tv.concurrent.TvConcurrentPlaybackHostTest.testConcurrentDualPlayback(TvConcurrentPlaybackHostTest.java:208)
	at java.base/jdk.internal.reflect.DirectMethodHandleAccessor.invoke(DirectMethodHandleAccessor.java:103)
	at java.base/java.lang.reflect.Method.invoke(Method.java:580)
	at org.junit.runners.model.FrameworkMethod$1.runReflectiveCall(FrameworkMethod.java:59)
	at org.junit.internal.runners.model.ReflectiveCallable.run(ReflectiveCallable.java:12)
	at org.junit.runners.model.FrameworkMethod.invokeExplosively(FrameworkMethod.java:61)
	at org.junit.internal.runners.statements.InvokeMethod.evaluate(InvokeMethod.java:17)
	at org.junit.internal.runners.statements.RunBefores.evaluate(RunBefores.java:26)
	at org.junit.internal.runners.statements.RunAfters.evaluate(RunAfters.java:27)
	at org.junit.rules.ExternalResource$1.evaluate(ExternalResource.java:54)
	at org.junit.rules.ExternalResource$1.evaluate(ExternalResource.java:54)
	at org.junit.rules.TestWatcher$1.evaluate(TestWatcher.java:61)
	at org.junit.runners.ParentRunner$3.evaluate(ParentRunner.java:306)
	at org.junit.runners.BlockJUnit4ClassRunner$1.evaluate(BlockJUnit4ClassRunner.java:100)
	at org.junit.runners.ParentRunner.runLeaf(ParentRunner.java:366)
	at org.junit.runners.BlockJUnit4ClassRunner.runChild(BlockJUnit4ClassRunner.java:103)
	at org.junit.runners.BlockJUnit4ClassRunner.runChild(BlockJUnit4ClassRunner.java:63)
	at org.junit.runners.ParentRunner$4.run(ParentRunner.java:331)
	at org.junit.runners.ParentRunner$1.schedule(ParentRunner.java:79)
	at org.junit.runners.ParentRunner.runChildren(ParentRunner.java:329)
	at org.junit.runners.ParentRunner$2.evaluate(ParentRunner.java:293)
	at org.junit.runners.ParentRunner.run(ParentRunner.java:413)
	at org.junit.runners.Suite.runChild(Suite.java:128)
	at android.cts.host.utils.DeviceJUnit4Parameterized.runChild(DeviceJUnit4Parameterized.java:125)
	at android.cts.host.utils.DeviceJUnit4Parameterized.runChild(DeviceJUnit4Parameterized.java:44)
	at org.junit.runners.ParentRunner$4.run(ParentRunner.java:331)
	at org.junit.runners.ParentRunner$1.schedule(ParentRunner.java:79)
	at org.junit.runners.ParentRunner.runChildren(ParentRunner.java:329)
	at org.junit.runners.ParentRunner$2.evaluate(ParentRunner.java:293)
	at org.junit.runners.ParentRunner$3.evaluate(ParentRunner.java:306)
	at org.junit.runners.ParentRunner.run(ParentRunner.java:413)
	at com.android.tradefed.testtype.junit4.ExceptionThrowingRunnerWrapper.run(ExceptionThrowingRunnerWrapper.java:43)
	at org.junit.runner.JUnitCore.run(JUnitCore.java:137)
	at com.android.tradefed.testtype.HostTest.runJUnit4Tests(HostTest.java:775)
	at com.android.tradefed.testtype.HostTest.runTestClasses(HostTest.java:655)
	at com.android.tradefed.testtype.HostTest.run(HostTest.java:603)
	at com.android.tradefed.testtype.suite.GranularRetriableTestWrapper.intraModuleRun(GranularRetriableTestWrapper.java:448)
	at com.android.tradefed.testtype.suite.GranularRetriableTestWrapper.run(GranularRetriableTestWrapper.java:341)
	at com.android.tradefed.testtype.suite.ModuleDefinition.run(ModuleDefinition.java:619)
	at com.android.tradefed.testtype.suite.ITestSuite.runSingleModule(ITestSuite.java:1368)
	at com.android.tradefed.testtype.suite.ITestSuite.run(ITestSuite.java:1080)
	at com.android.tradefed.invoker.InvocationExecution.runTest(InvocationExecution.java:1463)
	at com.android.tradefed.invoker.InvocationExecution.runTests(InvocationExecution.java:1238)
	at com.android.tradefed.invoker.TestInvocation.prepareAndRun(TestInvocation.java:648)
	at com.android.tradefed.invoker.TestInvocation.performInvocation(TestInvocation.java:294)
	at com.android.tradefed.invoker.TestInvocation.invoke(TestInvocation.java:1462)
	at com.android.tradefed.command.CommandScheduler$InvocationThread.run(CommandScheduler.java:719)

05-06 10:29:26 D/PrettyTestEventLogger: 
==================== com.google.android.tv.concurrent.TvConcurrentPlaybackHostTest#testConcurrentBasicSecondaryPlayback[2_CpuHog_false_MemHog_true] STARTED: Wed May 06 10:29:26 KST 2026 ====================
05-06 10:29:26 D/ModuleListener: ModuleListener.testStarted(com.google.android.tv.concurrent.TvConcurrentPlaybackHostTest#testConcurrentBasicSecondaryPlayback[2_CpuHog_false_MemHog_true]) on SKBFXYWR0LWD
05-06 10:29:26 D/NativeDevice: Using property ro.build.version.sdk=29 from cache.
05-06 10:29:26 D/DeviceHostUtils: apiLevel: 29
05-06 10:29:26 D/NativeDevice: Using property ro.build.version.sdk=29 from cache.
05-06 10:29:26 D/DeviceHostUtils: apiLevel: 29
05-06 10:29:26 D/TvConcurrentPlaybackHostTest: com.google.android.tv.concurrent.TvConcurrentPlaybackHostTest: before test, screen_brightness_mode = 0
05-06 10:29:26 D/TvConcurrentPlaybackHostTest: com.google.android.tv.concurrent.TvConcurrentPlaybackHostTest: before test, screensaver_enabled = 1
05-06 10:29:26 D/NativeDevice: Using property ro.build.version.sdk=29 from cache.
05-06 10:29:26 D/NativeDevice: Using property ro.build.version.sdk=29 from cache.
05-06 10:29:26 D/RunUtil: Running command [adb, -s, SKBFXYWR0LWD, shell, pm, list, features] with timeout: 2m 0s
05-06 10:29:26 W/TestDevice: Feature: feature:com.google.android.tv.hardware.secondary_playback_4k60 is not available on SKBFXYWR0LWD
05-06 10:29:26 D/RunUtil: Running command [adb, -s, SKBFXYWR0LWD, shell, pm, list, features] with timeout: 2m 0s
05-06 10:29:27 W/TestDevice: Feature: feature:com.google.android.tv.hardware.secondary_playback_4k30 is not available on SKBFXYWR0LWD
05-06 10:29:27 D/RunUtil: Running command [adb, -s, SKBFXYWR0LWD, shell, pm, list, features] with timeout: 2m 0s
05-06 10:29:27 W/TestDevice: Feature: feature:com.google.android.tv.hardware.secondary_playback_1080p60 is not available on SKBFXYWR0LWD
05-06 10:29:27 D/RunUtil: Running command [adb, -s, SKBFXYWR0LWD, shell, pm, list, features] with timeout: 2m 0s
05-06 10:29:27 W/TestDevice: Feature: feature:com.google.android.tv.hardware.secondary_playback_1080p30 is not available on SKBFXYWR0LWD
05-06 10:29:27 D/RunUtil: Running command [adb, -s, SKBFXYWR0LWD, shell, pm, list, features] with timeout: 2m 0s
05-06 10:29:27 W/TestDevice: Feature: feature:com.google.android.tv.hardware.secondary_playback_720p60 is not available on SKBFXYWR0LWD
05-06 10:29:27 D/RunUtil: Running command [adb, -s, SKBFXYWR0LWD, shell, pm, list, features] with timeout: 2m 0s
05-06 10:29:27 W/TestDevice: Feature: feature:com.google.android.tv.hardware.secondary_playback_720p30 is not available on SKBFXYWR0LWD
05-06 10:29:27 D/RunUtil: Running command [adb, -s, SKBFXYWR0LWD, shell, pm, list, features] with timeout: 2m 0s
05-06 10:29:27 W/TestDevice: Feature: feature:com.google.android.tv.hardware.secondary_playback_540p60 is not available on SKBFXYWR0LWD
05-06 10:29:27 D/RunUtil: Running command [adb, -s, SKBFXYWR0LWD, shell, pm, list, features] with timeout: 2m 0s
05-06 10:29:27 W/TestDevice: Feature: feature:com.google.android.tv.hardware.secondary_playback_540p30 is not available on SKBFXYWR0LWD
05-06 10:29:27 D/RunUtil: Running command [adb, -s, SKBFXYWR0LWD, shell, pm, list, features] with timeout: 2m 0s
05-06 10:29:27 W/TestDevice: Feature: feature:com.google.android.tv.hardware.secondary_playback_480p60 is not available on SKBFXYWR0LWD
05-06 10:29:27 D/RunUtil: Running command [adb, -s, SKBFXYWR0LWD, shell, pm, list, features] with timeout: 2m 0s
05-06 10:29:27 W/TestDevice: Feature: feature:com.google.android.tv.hardware.secondary_playback_480p30 is not available on SKBFXYWR0LWD
05-06 10:29:27 D/com.google.android.tv.concurrent.TvConcurrentPlaybackHostTest: com.google.android.tv.hardware.secondary_playback_ not declared on device
05-06 10:29:27 D/NativeDevice: Using property ro.build.version.sdk=29 from cache.
05-06 10:29:27 D/TvConcurrentPlaybackHostTest: com.google.android.tv.concurrent.TvConcurrentPlaybackHostTest: after test, restore screen_brightness_mode to 0
05-06 10:29:27 D/NativeDevice: Using property ro.build.version.sdk=29 from cache.
05-06 10:29:27 D/TvConcurrentPlaybackHostTest: com.google.android.tv.concurrent.TvConcurrentPlaybackHostTest: after test, restore screensaver_enabled to 1
05-06 10:29:27 D/NativeDevice: Using property ro.build.version.sdk=29 from cache.
05-06 10:29:27 I/ConsoleReporter: [9/9 armeabi-v7a TvConcurrentMediaPlaybackHostTestCases SKBFXYWR0LWD] com.google.android.tv.concurrent.TvConcurrentPlaybackHostTest#testConcurrentBasicSecondaryPlayback[2_CpuHog_false_MemHog_true] skip
05-06 10:29:27 D/PrettyTestEventLogger: 
==================== com.google.android.tv.concurrent.TvConcurrentPlaybackHostTest#testConcurrentBasicSecondaryPlayback[2_CpuHog_false_MemHog_true] ENDED: Wed May 06 10:29:27 KST 2026 ====================
05-06 10:29:27 I/ModuleListener: [9/9] SKBFXYWR0LWD com.google.android.tv.concurrent.TvConcurrentPlaybackHostTest#testConcurrentBasicSecondaryPlayback[2_CpuHog_false_MemHog_true] ASSUMPTION_FAILURE: org.junit.AssumptionViolatedException: Skipping the test because com.google.android.tv.hardware.secondary_playback_ is not declared in this device and the device was launched with an Android version older than Android U
	at org.junit.Assume.assumeTrue(Assume.java:68)
	at org.junit.Assume.assumeFalse(Assume.java:75)
	at com.google.android.tv.concurrent.TvConcurrentPlaybackHostTest.testConcurrentBasicSecondaryPlayback(TvConcurrentPlaybackHostTest.java:187)
	at java.base/jdk.internal.reflect.DirectMethodHandleAccessor.invoke(DirectMethodHandleAccessor.java:103)
	at java.base/java.lang.reflect.Method.invoke(Method.java:580)
	at org.junit.runners.model.FrameworkMethod$1.runReflectiveCall(FrameworkMethod.java:59)
	at org.junit.internal.runners.model.ReflectiveCallable.run(ReflectiveCallable.java:12)
	at org.junit.runners.model.FrameworkMethod.invokeExplosively(FrameworkMethod.java:61)
	at org.junit.internal.runners.statements.InvokeMethod.evaluate(InvokeMethod.java:17)
	at org.junit.internal.runners.statements.RunBefores.evaluate(RunBefores.java:26)
	at org.junit.internal.runners.statements.RunAfters.evaluate(RunAfters.java:27)
	at org.junit.rules.ExternalResource$1.evaluate(ExternalResource.java:54)
	at org.junit.rules.ExternalResource$1.evaluate(ExternalResource.java:54)
	at org.junit.rules.TestWatcher$1.evaluate(TestWatcher.java:61)
	at org.junit.runners.ParentRunner$3.evaluate(ParentRunner.java:306)
	at org.junit.runners.BlockJUnit4ClassRunner$1.evaluate(BlockJUnit4ClassRunner.java:100)
	at org.junit.runners.ParentRunner.runLeaf(ParentRunner.java:366)
	at org.junit.runners.BlockJUnit4ClassRunner.runChild(BlockJUnit4ClassRunner.java:103)
	at org.junit.runners.BlockJUnit4ClassRunner.runChild(BlockJUnit4ClassRunner.java:63)
	at org.junit.runners.ParentRunner$4.run(ParentRunner.java:331)
	at org.junit.runners.ParentRunner$1.schedule(ParentRunner.java:79)
	at org.junit.runners.ParentRunner.runChildren(ParentRunner.java:329)
	at org.junit.runners.ParentRunner$2.evaluate(ParentRunner.java:293)
	at org.junit.runners.ParentRunner.run(ParentRunner.java:413)
	at org.junit.runners.Suite.runChild(Suite.java:128)
	at android.cts.host.utils.DeviceJUnit4Parameterized.runChild(DeviceJUnit4Parameterized.java:125)
	at android.cts.host.utils.DeviceJUnit4Parameterized.runChild(DeviceJUnit4Parameterized.java:44)
	at org.junit.runners.ParentRunner$4.run(ParentRunner.java:331)
	at org.junit.runners.ParentRunner$1.schedule(ParentRunner.java:79)
	at org.junit.runners.ParentRunner.runChildren(ParentRunner.java:329)
	at org.junit.runners.ParentRunner$2.evaluate(ParentRunner.java:293)
	at org.junit.runners.ParentRunner$3.evaluate(ParentRunner.java:306)
	at org.junit.runners.ParentRunner.run(ParentRunner.java:413)
	at com.android.tradefed.testtype.junit4.ExceptionThrowingRunnerWrapper.run(ExceptionThrowingRunnerWrapper.java:43)
	at org.junit.runner.JUnitCore.run(JUnitCore.java:137)
	at com.android.tradefed.testtype.HostTest.runJUnit4Tests(HostTest.java:775)
	at com.android.tradefed.testtype.HostTest.runTestClasses(HostTest.java:655)
	at com.android.tradefed.testtype.HostTest.run(HostTest.java:603)
	at com.android.tradefed.testtype.suite.GranularRetriableTestWrapper.intraModuleRun(GranularRetriableTestWrapper.java:448)
	at com.android.tradefed.testtype.suite.GranularRetriableTestWrapper.run(GranularRetriableTestWrapper.java:341)
	at com.android.tradefed.testtype.suite.ModuleDefinition.run(ModuleDefinition.java:619)
	at com.android.tradefed.testtype.suite.ITestSuite.runSingleModule(ITestSuite.java:1368)
	at com.android.tradefed.testtype.suite.ITestSuite.run(ITestSuite.java:1080)
	at com.android.tradefed.invoker.InvocationExecution.runTest(InvocationExecution.java:1463)
	at com.android.tradefed.invoker.InvocationExecution.runTests(InvocationExecution.java:1238)
	at com.android.tradefed.invoker.TestInvocation.prepareAndRun(TestInvocation.java:648)
	at com.android.tradefed.invoker.TestInvocation.performInvocation(TestInvocation.java:294)
	at com.android.tradefed.invoker.TestInvocation.invoke(TestInvocation.java:1462)
	at com.android.tradefed.command.CommandScheduler$InvocationThread.run(CommandScheduler.java:719)

05-06 10:29:27 D/PrettyTestEventLogger: 
==================== RUN ENDED: Wed May 06 10:29:27 KST 2026 ====================
05-06 10:29:27 I/ConsoleReporter: [SKBFXYWR0LWD] armeabi-v7a TvConcurrentMediaPlaybackHostTestCases completed in 1m 18s. 0 passed, 0 failed, 0 not executed
05-06 10:29:27 D/ModuleListener: ModuleListener.testRunEnded(78206) on SKBFXYWR0LWD
05-06 10:29:27 D/TestDevice: Uninstalling android.tvconcurrent.tvts with extra args 
05-06 10:29:28 D/NativeDevice: Using property ro.build.version.sdk=29 from cache.
05-06 10:29:28 I/NativeDeviceStateMonitor: Device SKBFXYWR0LWD is already ONLINE
05-06 10:29:28 I/NativeDeviceStateMonitor: Waiting 359999 ms for device SKBFXYWR0LWD boot complete
05-06 10:29:28 I/DeviceStateMonitor: Waiting 359927 ms for device SKBFXYWR0LWD package manager
05-06 10:29:28 I/NativeDeviceStateMonitor: Waiting 359865 ms for device SKBFXYWR0LWD external store
05-06 10:29:28 D/FileUtil: Creating temp file at /home/dev2-google04/android-tvts/arm_android-tvts-2.14_r1/android-tvts/tools/./../../android-tvts/results/2026.05.06_10.26.23/proto with prefix "tmp-proto" suffix ""
05-06 10:29:28 D/PrettyPrintDelimiter: 
=============================
===== TEST PHASE ENDING =====
=============================
05-06 10:29:28 D/LogFileSaver: Log data for device_logcat_test_SKBFXYWR0LWD is already compressed, skipping compression
05-06 10:29:28 D/FileUtil: Creating temp file at /home/dev2-google04/android-tvts/arm_android-tvts-2.14_r1/android-tvts/tools/./../../android-tvts/logs/2026.05.06_10.26.23/inv_8236708342172730979 with prefix "device_logcat_test_SKBFXYWR0LWD_" suffix ".txt"
05-06 10:29:28 I/LogFileSaver: Saved log file /home/dev2-google04/android-tvts/arm_android-tvts-2.14_r1/android-tvts/tools/./../../android-tvts/logs/2026.05.06_10.26.23/inv_8236708342172730979/device_logcat_test_SKBFXYWR0LWD_14510639771751045103.txt. [size=945470, elapsed=4ms]
05-06 10:29:28 D/CertificationSuiteResultReporter: Saved logs for device_logcat_test_SKBFXYWR0LWD in /home/dev2-google04/android-tvts/arm_android-tvts-2.14_r1/android-tvts/tools/./../../android-tvts/logs/2026.05.06_10.26.23/inv_8236708342172730979/device_logcat_test_SKBFXYWR0LWD_14510639771751045103.txt
05-06 10:29:28 D/LogFileSaver: Log data for device_logcat_test_SKBFXYWR0LWD is already compressed, skipping compression
05-06 10:29:28 D/FileUtil: Creating temp file at /tmp/13641659/tvts/inv_14923917419519687788/inv_9146255718902668723 with prefix "device_logcat_test_SKBFXYWR0LWD_" suffix ".txt"
05-06 10:29:28 I/LogFileSaver: Saved log file /tmp/13641659/tvts/inv_14923917419519687788/inv_9146255718902668723/device_logcat_test_SKBFXYWR0LWD_16940954237387543938.txt. [size=945470, elapsed=4ms]
05-06 10:29:28 I/CommandInterrupter: Interrupt blocked
05-06 10:29:28 D/TestInvocation: Testing minimum responsiveness.
05-06 10:29:28 I/NativeDeviceStateMonitor: Device SKBFXYWR0LWD is already ONLINE
05-06 10:29:28 D/RunUtil: Running command [adb, -s, SKBFXYWR0LWD, shell, getprop, ro.build.version.sdk] with timeout: 45s
05-06 10:29:28 D/FileUtil: Creating temp file at /home/dev2-google04/android-tvts/arm_android-tvts-2.14_r1/android-tvts/tools/./../../android-tvts/logs/2026.05.06_10.26.23/inv_8236708342172730979 with prefix "executeShellCommandLog_SKBFXYWR0LWD_" suffix ".txt.gz"
05-06 10:29:28 I/LogFileSaver: Saved gzip log file /home/dev2-google04/android-tvts/arm_android-tvts-2.14_r1/android-tvts/tools/./../../android-tvts/logs/2026.05.06_10.26.23/inv_8236708342172730979/executeShellCommandLog_SKBFXYWR0LWD_16424367036756828628.txt.gz. [size=10, elapsed=0ms]
05-06 10:29:28 D/CertificationSuiteResultReporter: Saved logs for executeShellCommandLog_SKBFXYWR0LWD in /home/dev2-google04/android-tvts/arm_android-tvts-2.14_r1/android-tvts/tools/./../../android-tvts/logs/2026.05.06_10.26.23/inv_8236708342172730979/executeShellCommandLog_SKBFXYWR0LWD_16424367036756828628.txt.gz
05-06 10:29:28 D/FileUtil: Creating temp file at /tmp/13641659/tvts/inv_14923917419519687788/inv_9146255718902668723 with prefix "executeShellCommandLog_SKBFXYWR0LWD_" suffix ".txt.gz"
05-06 10:29:28 I/LogFileSaver: Saved gzip log file /tmp/13641659/tvts/inv_14923917419519687788/inv_9146255718902668723/executeShellCommandLog_SKBFXYWR0LWD_12570587498739552713.txt.gz. [size=10, elapsed=0ms]
05-06 10:29:28 D/TestInvocation: Checking that devices are online.
05-06 10:29:28 I/NativeDeviceStateMonitor: Device SKBFXYWR0LWD is already ONLINE
05-06 10:29:28 I/NativeDeviceStateMonitor: Waiting 179999 ms for device SKBFXYWR0LWD boot complete
05-06 10:29:28 I/DeviceStateMonitor: Waiting 179963 ms for device SKBFXYWR0LWD package manager
05-06 10:29:29 I/NativeDeviceStateMonitor: Waiting 179901 ms for device SKBFXYWR0LWD external store
05-06 10:29:29 D/InvocationExecution: starting tearDown 'com.google.android.perfverify.tvts.prep.ApkChecker@75471b07' on device: 'SKBFXYWR0LWD'
05-06 10:29:29 D/InvocationExecution: done with tearDown 'com.google.android.perfverify.tvts.prep.ApkChecker@75471b07' on device: 'SKBFXYWR0LWD' in 0 ms
05-06 10:29:29 D/InvocationExecution: starting tearDown 'com.google.android.perfverify.tvts.prep.ApkChecker@2f406e6f' on device: 'SKBFXYWR0LWD'
05-06 10:29:29 D/InvocationExecution: done with tearDown 'com.google.android.perfverify.tvts.prep.ApkChecker@2f406e6f' on device: 'SKBFXYWR0LWD' in 0 ms
05-06 10:29:29 D/InvocationExecution: starting tearDown 'com.google.android.perfverify.tvts.prep.ApkChecker@5a0d300a' on device: 'SKBFXYWR0LWD'
05-06 10:29:29 D/InvocationExecution: done with tearDown 'com.google.android.perfverify.tvts.prep.ApkChecker@5a0d300a' on device: 'SKBFXYWR0LWD' in 0 ms
05-06 10:29:29 D/InvocationExecution: starting tearDown 'com.google.android.perfverify.tvts.prep.ApkChecker@6f42de76' on device: 'SKBFXYWR0LWD'
05-06 10:29:29 D/InvocationExecution: done with tearDown 'com.google.android.perfverify.tvts.prep.ApkChecker@6f42de76' on device: 'SKBFXYWR0LWD' in 1 ms
05-06 10:29:29 D/InvocationExecution: starting tearDown 'com.google.android.perfverify.tvts.prep.ApkChecker@7cf4c52d' on device: 'SKBFXYWR0LWD'
05-06 10:29:29 D/InvocationExecution: done with tearDown 'com.google.android.perfverify.tvts.prep.ApkChecker@7cf4c52d' on device: 'SKBFXYWR0LWD' in 0 ms
05-06 10:29:29 D/InvocationExecution: starting tearDown 'com.google.android.perfverify.tvts.prep.ApkChecker@441635d9' on device: 'SKBFXYWR0LWD'
05-06 10:29:29 D/InvocationExecution: done with tearDown 'com.google.android.perfverify.tvts.prep.ApkChecker@441635d9' on device: 'SKBFXYWR0LWD' in 0 ms
05-06 10:29:29 D/InvocationExecution: starting tearDown 'com.google.android.perfverify.tvts.prep.ApkChecker@676718d' on device: 'SKBFXYWR0LWD'
05-06 10:29:29 D/InvocationExecution: done with tearDown 'com.google.android.perfverify.tvts.prep.ApkChecker@676718d' on device: 'SKBFXYWR0LWD' in 0 ms
05-06 10:29:29 D/InvocationExecution: starting tearDown 'com.google.android.perfverify.tvts.prep.ApkChecker@632e1174' on device: 'SKBFXYWR0LWD'
05-06 10:29:29 D/InvocationExecution: done with tearDown 'com.google.android.perfverify.tvts.prep.ApkChecker@632e1174' on device: 'SKBFXYWR0LWD' in 1 ms
05-06 10:29:29 D/InvocationExecution: starting tearDown 'com.google.android.perfverify.tvts.prep.ApkChecker@7cc88254' on device: 'SKBFXYWR0LWD'
05-06 10:29:29 D/InvocationExecution: done with tearDown 'com.google.android.perfverify.tvts.prep.ApkChecker@7cc88254' on device: 'SKBFXYWR0LWD' in 0 ms
05-06 10:29:29 D/InvocationExecution: starting tearDown 'com.google.android.perfverify.tvts.prep.ApkChecker@6e1586fc' on device: 'SKBFXYWR0LWD'
05-06 10:29:29 D/InvocationExecution: done with tearDown 'com.google.android.perfverify.tvts.prep.ApkChecker@6e1586fc' on device: 'SKBFXYWR0LWD' in 1 ms
05-06 10:29:29 D/InvocationExecution: starting tearDown 'com.google.android.perfverify.tvts.prep.ApkChecker@7cf339cd' on device: 'SKBFXYWR0LWD'
05-06 10:29:29 D/InvocationExecution: done with tearDown 'com.google.android.perfverify.tvts.prep.ApkChecker@7cf339cd' on device: 'SKBFXYWR0LWD' in 0 ms
05-06 10:29:29 D/InvocationExecution: starting tearDown 'com.google.android.perfverify.tvts.prep.ApkChecker@23d785dc' on device: 'SKBFXYWR0LWD'
05-06 10:29:29 D/InvocationExecution: done with tearDown 'com.google.android.perfverify.tvts.prep.ApkChecker@23d785dc' on device: 'SKBFXYWR0LWD' in 1 ms
05-06 10:29:29 D/InvocationExecution: starting tearDown 'com.google.android.perfverify.tvts.prep.ApkChecker@67feb63c' on device: 'SKBFXYWR0LWD'
05-06 10:29:29 D/InvocationExecution: done with tearDown 'com.google.android.perfverify.tvts.prep.ApkChecker@67feb63c' on device: 'SKBFXYWR0LWD' in 0 ms
05-06 10:29:29 D/InvocationExecution: starting tearDown 'com.google.android.perfverify.tvts.TvtsSetupAndTearDown@22797fba' on device: 'SKBFXYWR0LWD'
05-06 10:29:29 D/NativeDevice: Using property ro.build.version.sdk=29 from cache.
05-06 10:29:29 D/NativeDevice: Using 'ls' to check doesFileExist(/storage/emulated/0/Download/failure-screenshots)
05-06 10:29:29 D/RunUtil: Running command [adb, -s, SKBFXYWR0LWD, shell, ls, '/storage/emulated/0/Download/failure-screenshots'] with timeout: 2m 0s
05-06 10:29:29 D/NativeDevice: File /storage/emulated/0/Download/failure-screenshots does not exist.
stdout: 
stderr: ls: /storage/emulated/0/Download/failure-screenshots: No such file or directory

05-06 10:29:29 E/NativeDevice: Device path /storage/emulated/0/Download/failure-screenshots does not exist to be pulled.
05-06 10:29:29 D/NativeDevice: Using 'ls' to check doesFileExist(/data/local/tmp/files)
05-06 10:29:29 D/RunUtil: Running command [adb, -s, SKBFXYWR0LWD, shell, ls, '/data/local/tmp/files'] with timeout: 2m 0s
05-06 10:29:29 I/NativeDevice: Device path is empty, nothing to do.
05-06 10:29:29 D/NativeDevice: Using property ro.build.version.sdk=29 from cache.
05-06 10:29:29 D/InvocationExecution: done with tearDown 'com.google.android.perfverify.tvts.TvtsSetupAndTearDown@22797fba' on device: 'SKBFXYWR0LWD' in 374 ms
05-06 10:29:29 D/InvocationExecution: starting tearDown 'com.android.tradefed.targetprep.suite.SuiteApkInstaller@231dc906' on device: 'SKBFXYWR0LWD'
05-06 10:29:29 D/TestDevice: Uninstalling com.google.android.resolution.tvts with extra args 
05-06 10:29:29 D/InvocationExecution: done with tearDown 'com.android.tradefed.targetprep.suite.SuiteApkInstaller@231dc906' on device: 'SKBFXYWR0LWD' in 418 ms
05-06 10:29:29 D/InvocationExecution: starting tearDown 'com.android.compatibility.common.tradefed.targetprep.PropertyCheck@cefe483' on device: 'SKBFXYWR0LWD'
05-06 10:29:29 D/InvocationExecution: done with tearDown 'com.android.compatibility.common.tradefed.targetprep.PropertyCheck@cefe483' on device: 'SKBFXYWR0LWD' in 0 ms
05-06 10:29:29 D/InvocationExecution: starting tearDown 'com.android.compatibility.common.tradefed.targetprep.PropertyCheck@5c827850' on device: 'SKBFXYWR0LWD'
05-06 10:29:29 D/InvocationExecution: done with tearDown 'com.android.compatibility.common.tradefed.targetprep.PropertyCheck@5c827850' on device: 'SKBFXYWR0LWD' in 0 ms
05-06 10:29:29 D/InvocationExecution: starting tearDown 'com.android.tradefed.targetprep.RunCommandTargetPreparer@6db66e3a' on device: 'SKBFXYWR0LWD'
05-06 10:29:30 D/InvocationExecution: done with tearDown 'com.android.tradefed.targetprep.RunCommandTargetPreparer@6db66e3a' on device: 'SKBFXYWR0LWD' in 1 ms
05-06 10:29:30 D/InvocationExecution: starting tearDown 'com.android.compatibility.common.tradefed.targetprep.FilePusher@3cbb32c5' on device: 'SKBFXYWR0LWD'
05-06 10:29:30 D/InvocationExecution: done with tearDown 'com.android.compatibility.common.tradefed.targetprep.FilePusher@3cbb32c5' on device: 'SKBFXYWR0LWD' in 220 ms
05-06 10:29:30 D/InvocationExecution: starting tearDown 'com.android.tradefed.targetprep.RunCommandTargetPreparer@27d48e1d' on device: 'SKBFXYWR0LWD'
05-06 10:29:30 D/InvocationExecution: done with tearDown 'com.android.tradefed.targetprep.RunCommandTargetPreparer@27d48e1d' on device: 'SKBFXYWR0LWD' in 0 ms
05-06 10:29:30 D/InvocationExecution: starting tearDown 'com.android.compatibility.common.tradefed.targetprep.ReportLogCollector@4bb387cd' on device: 'SKBFXYWR0LWD'
05-06 10:29:30 D/NativeDevice: Using property ro.build.version.sdk=29 from cache.
05-06 10:29:30 D/NativeDevice: Using 'ls' to check doesFileExist(/storage/emulated/0/report-log-files/)
05-06 10:29:30 D/RunUtil: Running command [adb, -s, SKBFXYWR0LWD, shell, ls, '/storage/emulated/0/report-log-files/'] with timeout: 2m 0s
05-06 10:29:30 D/NativeDevice: File /storage/emulated/0/report-log-files/ does not exist.
stdout: 
stderr: ls: /storage/emulated/0/report-log-files/: No such file or directory

05-06 10:29:30 E/NativeDevice: Device path /sdcard/report-log-files/ does not exist to be pulled.
05-06 10:29:30 D/InvocationExecution: done with tearDown 'com.android.compatibility.common.tradefed.targetprep.ReportLogCollector@4bb387cd' on device: 'SKBFXYWR0LWD' in 146 ms
05-06 10:29:30 D/InvocationExecution: starting tearDown 'com.google.android.perfverify.tvts.prep.DeviceReliabilityVerifier@77c1070c' on device: 'SKBFXYWR0LWD'
05-06 10:29:30 D/InvocationExecution: done with tearDown 'com.google.android.perfverify.tvts.prep.DeviceReliabilityVerifier@77c1070c' on device: 'SKBFXYWR0LWD' in 0 ms
05-06 10:29:30 D/InvocationExecution: starting tearDown 'com.android.compatibility.common.tradefed.targetprep.DeviceInfoCollector@88f6b3a' on device: 'SKBFXYWR0LWD'
05-06 10:29:30 D/InvocationExecution: done with tearDown 'com.android.compatibility.common.tradefed.targetprep.DeviceInfoCollector@88f6b3a' on device: 'SKBFXYWR0LWD' in 3 ms
05-06 10:29:30 D/InvocationExecution: starting tearDown 'com.android.tradefed.targetprep.RunCommandTargetPreparer@49bb078e' on device: 'SKBFXYWR0LWD'
05-06 10:29:30 D/InvocationExecution: done with tearDown 'com.android.tradefed.targetprep.RunCommandTargetPreparer@49bb078e' on device: 'SKBFXYWR0LWD' in 0 ms
05-06 10:29:30 D/TestDevice: Uninstalling android.tradefed.contentprovider with extra args 
05-06 10:29:30 D/RunUtil: Running command [id, -u, dev2-google04] with timeout: 1m 0s
05-06 10:29:30 D/RunUtil: Running command [tail, -c, 10MB, /tmp/adb.1000.log] with timeout: 1m 0s
05-06 10:29:30 D/LogFileSaver: Log data for host_adb_log is already compressed, skipping compression
05-06 10:29:30 D/FileUtil: Creating temp file at /home/dev2-google04/android-tvts/arm_android-tvts-2.14_r1/android-tvts/tools/./../../android-tvts/logs/2026.05.06_10.26.23/inv_8236708342172730979 with prefix "host_adb_log_" suffix ".txt"
05-06 10:29:30 I/LogFileSaver: Saved log file /home/dev2-google04/android-tvts/arm_android-tvts-2.14_r1/android-tvts/tools/./../../android-tvts/logs/2026.05.06_10.26.23/inv_8236708342172730979/host_adb_log_14387466479286095512.txt. [size=82747, elapsed=1ms]
05-06 10:29:30 D/CertificationSuiteResultReporter: Saved logs for host_adb_log in /home/dev2-google04/android-tvts/arm_android-tvts-2.14_r1/android-tvts/tools/./../../android-tvts/logs/2026.05.06_10.26.23/inv_8236708342172730979/host_adb_log_14387466479286095512.txt
05-06 10:29:30 D/LogFileSaver: Log data for host_adb_log is already compressed, skipping compression
05-06 10:29:30 D/FileUtil: Creating temp file at /tmp/13641659/tvts/inv_14923917419519687788/inv_9146255718902668723 with prefix "host_adb_log_" suffix ".txt"
05-06 10:29:30 I/LogFileSaver: Saved log file /tmp/13641659/tvts/inv_14923917419519687788/inv_9146255718902668723/host_adb_log_15700789261373517085.txt. [size=82747, elapsed=1ms]
05-06 10:29:30 D/LogFileSaver: Log data for device_logcat_teardown_SKBFXYWR0LWD is already compressed, skipping compression
05-06 10:29:30 D/FileUtil: Creating temp file at /home/dev2-google04/android-tvts/arm_android-tvts-2.14_r1/android-tvts/tools/./../../android-tvts/logs/2026.05.06_10.26.23/inv_8236708342172730979 with prefix "device_logcat_teardown_SKBFXYWR0LWD_" suffix ".txt"
05-06 10:29:30 I/LogFileSaver: Saved log file /home/dev2-google04/android-tvts/arm_android-tvts-2.14_r1/android-tvts/tools/./../../android-tvts/logs/2026.05.06_10.26.23/inv_8236708342172730979/device_logcat_teardown_SKBFXYWR0LWD_14255022732123063541.txt. [size=35148, elapsed=0ms]
05-06 10:29:30 D/CertificationSuiteResultReporter: Saved logs for device_logcat_teardown_SKBFXYWR0LWD in /home/dev2-google04/android-tvts/arm_android-tvts-2.14_r1/android-tvts/tools/./../../android-tvts/logs/2026.05.06_10.26.23/inv_8236708342172730979/device_logcat_teardown_SKBFXYWR0LWD_14255022732123063541.txt
05-06 10:29:30 D/LogFileSaver: Log data for device_logcat_teardown_SKBFXYWR0LWD is already compressed, skipping compression
05-06 10:29:30 D/FileUtil: Creating temp file at /tmp/13641659/tvts/inv_14923917419519687788/inv_9146255718902668723 with prefix "device_logcat_teardown_SKBFXYWR0LWD_" suffix ".txt"
05-06 10:29:30 I/LogFileSaver: Saved log file /tmp/13641659/tvts/inv_14923917419519687788/inv_9146255718902668723/device_logcat_teardown_SKBFXYWR0LWD_4056858872963591407.txt. [size=35148, elapsed=0ms]
05-06 10:29:30 I/TestInvocation: Done stopping logcat for SKBFXYWR0LWD
05-06 10:29:30 D/BackgroundDeviceAction: com.android.ddmlib.TimeoutException while running logcat on SKBFXYWR0LWD. May see duplicated content in log.
05-06 10:29:30 D/BackgroundDeviceAction: Waiting for device SKBFXYWR0LWD online before starting.
05-06 10:29:30 D/CommandScheduler: TestDeviceState for releasing 'SKBFXYWR0LWD(class com.android.tradefed.device.TestDevice)' is 'ONLINE'
05-06 10:29:30 I/NativeDeviceStateMonitor: Waiting 30000 ms for device SKBFXYWR0LWD shell to be responsive
05-06 10:29:31 I/NativeDeviceStateMonitor: shell ready. id output: uid=2000(shell) gid=2000(shell) groups=2000(shell),1004(input),1007(log),1011(adb),1015(sdcard_rw),1028(sdcard_r),3001(net_bt_admin),3002(net_bt),3003(inet),3006(net_bw_stats),3009(readproc),3011(uhid) context=u:r:shell:s0

05-06 10:29:31 D/CommandScheduler: Release map of the devices: {com.android.tradefed.device.TestDevice@9b66e5d=AVAILABLE}
05-06 10:29:31 W/NativeDevice: Attempting to stop logcat when not capturing for SKBFXYWR0LWD
05-06 10:29:31 D/TestDevice: No snapuserd notification in progress for BLOCK_BEFORE_RELEASING
