TEXT: 
============================================
================= Results ==================
=============== Consumed Time ==============
    armeabi-v7a GtsMediaTestCases: 11h 30m 8s
    armeabi-v7a GtsGmscoreHostTestCases: 2h 26m 58s
    armeabi-v7a GtsExoPlayerTestCases: 1h 1m 38s
    armeabi-v7a GtsPermissionTestCases: 12m 19s
    armeabi-v7a GtsMbaPrivilegedPermissionTestCases: 11m 59s
    armeabi-v7a GtsPlacementTestCases: 11m 30s
    armeabi-v7a GtsOsTestCases: 8m 13s
    armeabi-v7a GtsRegulationComplianceTestCases: 7m 55s
    armeabi-v7a GtsAssistIntentTestCases: 7m 17s
    armeabi-v7a GtsStatsdHostTestCases: 7m 4s
    armeabi-v7a GtsSettingsTestCases: 6m 48s
    armeabi-v7a GtsEdiHostTestCases: 5m 40s
    armeabi-v7a GtsVoiceInteractionHostTestCases: 3m 39s
    armeabi-v7a GtsDevicePolicyGmsInstrumentationTestCases: 2m 30s
    armeabi-v7a GtsStagedInstallHostTestCases: 2m 24s
    armeabi-v7a GtsSecurityHostTestCases: 2m 1s
    armeabi-v7a GtsFeaturesTestCases: 2m 0s
    armeabi-v7a GtsRollbackManagerTest: 1m 37s
    armeabi-v7a GtsArtManagerHostTestCases: 1m 27s
    armeabi-v7a GtsPackageManagerHostTestCases: 1m 14s
    armeabi-v7a CtsEdiHostTestCases: 1m 13s
    armeabi-v7a GtsDevicePolicyTestCases: 1m 1s
    armeabi-v7a GtsPlayStoreHostTestCases: 1m 1s
    armeabi-v7a GtsYouTubeTestCases: 46s
    armeabi-v7a GtsPermissionUiTestCases: 44s
    armeabi-v7a GtsUnofficialApisUsageTestCases: 42s
    armeabi-v7a GtsBootStatsTestCases: 41s
    armeabi-v7a GtsHealthConnectTests: 40s
    armeabi-v7a GtsSuspendAppsTestCases: 39s
    armeabi-v7a GtsAppTestCases: 38s
    armeabi-v7a GtsPackageInstallTestCases: 36s
    armeabi-v7a GtsDuoReadyTestCases: 35s
    armeabi-v7a GtsNotificationTestCases: 34s
    armeabi-v7a GtsContentTestCases: 32s
    armeabi-v7a GtsNetTestCases: 31s
    armeabi-v7a GtsLocationTestCases: 31s
    armeabi-v7a GtsLargeApkHostTestCases: 29s
    armeabi-v7a GtsDozeDeviceTestCases: 28s
    armeabi-v7a GtsNetworkWatchlistTestCases: 28s
    armeabi-v7a GtsBackupTestCases: 26s
    armeabi-v7a GtsBackupHostTestCases: 25s
    armeabi-v7a GtsDeviceConfigTestCases: 24s
    armeabi-v7a GtsTvTestCases: 22s
    armeabi-v7a GtsPrintTestCases: 22s
    armeabi-v7a GtsNmgiarcTestCases: 20s
    armeabi-v7a GtsPersonalSafetyTestCases: 20s
    armeabi-v7a GtsLensTestCases: 20s
    armeabi-v7a GtsTelephonyTestCases: 20s
    armeabi-v7a GtsAppBlacklistDeviceTestCases: 19s
    armeabi-v7a GtsPlayAutoInstallTestCases: 19s
    armeabi-v7a GtsTetheringTestCases: 19s
    armeabi-v7a GtsWellbeingTestCases: 19s
    armeabi-v7a GtsUsageStatsTestCases: 18s
    armeabi-v7a GtsTelecomManagerTests: 18s
    armeabi-v7a GtsWebViewTestCases: 18s
    armeabi-v7a GtsViewTestCases: 17s
    armeabi-v7a GtsCameraTestCases: 17s
    armeabi-v7a GtsContextHubPermissionDeviceTestCases: 16s
    armeabi-v7a GtsRlzTestCases: 16s
    armeabi-v7a GtsPackageInstallerTapjackingTestCases: 16s
    armeabi-v7a GtsNoPermissionTestCases: 16s
    armeabi-v7a GtsWallpaperTestCases: 16s
    armeabi-v7a GtsAndroidAutoDeviceTestCases: 16s
    armeabi-v7a GtsNoPermissionTestCases25: 16s
    armeabi-v7a GtsAfwTestCases: 16s
    armeabi-v7a GtsInstallPackagesWhitelistDeviceTestCases: 15s
    armeabi-v7a GtsContactsTest: 15s
    armeabi-v7a GtsOemLockServiceTestCases: 15s
    armeabi-v7a GtsIncidentManagerTestCases: 15s
    armeabi-v7a GtsPackageRoleEnforcementTests: 15s
    armeabi-v7a GtsSuspendAppsPermissionTestCases: 14s
    armeabi-v7a GtsCalendarTests: 14s
    armeabi-v7a GtsThemingTestCases: 14s
    armeabi-v7a GtsAdminTestCases: 14s
    armeabi-v7a GtsTelephonyNumberVerificationHostCases: 14s
    armeabi-v7a GtsDialerAudioTestCases: 14s
    armeabi-v7a GtsSupervisionTestCases: 14s
    armeabi-v7a GtsWellbeingPermissionPolicyTestCases: 14s
    armeabi-v7a GtsSimAppDialogTestCases: 14s
    armeabi-v7a GtsPackageUninstallTestCases: 14s
    armeabi-v7a GtsCNGCoreTestCases: 13s
    armeabi-v7a GtsStorageTestCases: 13s
    armeabi-v7a GtsNetStatsHostTestCases: 13s
    armeabi-v7a GtsTvBugReportTestCases: 13s
    armeabi-v7a GtsEntertainmentSpaceDeviceTestCases: 13s
    armeabi-v7a GtsSpeechServicesTestCases: 13s
    armeabi-v7a GtsContactsAppDeviceTestCases: 13s
    armeabi-v7a GtsPrivacyTestCases: 13s
    armeabi-v7a GtsIntelligenceTestCases: 13s
    armeabi-v7a GtsMemoryTestCases: 13s
    armeabi-v7a GtsSafetyCenterTestCases: 13s
    armeabi-v7a GtsAppVisibilityDeviceTestCases: 13s
    armeabi-v7a GtsSetupWizardNoPermissionTestCases: 12s
    armeabi-v7a GtsCallLogTestCases: 12s
    armeabi-v7a GtsPropertiesTestCases: 12s
    armeabi-v7a GtsSsaidHostTestCases: 12s
    armeabi-v7a GtsFilesByGoogleTestCases: 12s
    armeabi-v7a GtsPackageNameCertPairsDeviceTestCases: 12s
    armeabi-v7a GtsLocationHostTestCases: 12s
    armeabi-v7a GtsModuleMetadataTestCases: 12s
    armeabi-v7a GtsPartnerBookmarksTestCases: 12s
    armeabi-v7a GtsSmartBatteryDeviceTestCases: 12s
    armeabi-v7a GtsIncrementalInstallProxyHostTestCases: 11s
    armeabi-v7a GtsCastHostTestCases: 10s
    armeabi-v7a GtsNetworkStackHostTestCases: 10s
    armeabi-v7a GtsSensorHostTestCases: 10s
    armeabi-v7a GtsPermissionControllerHostTestCases: 7s
    armeabi-v7a GtsAssistantHostTestCases: 6s
    armeabi-v7a GtsSetupWizardHostTestCases: 5s
    armeabi-v7a GtsTvHostTestCases: 4s
    armeabi-v7a GtsMemoryHostTestCases: 3s
    armeabi-v7a GtsWebViewHostTestCases: 3s
    armeabi-v7a GtsInstantAppsHostTestCases: 3s
    armeabi-v7a GtsGraphicsHostTestCases: 2s
    armeabi-v7a GtsContentHostTestCases: 2s
    armeabi-v7a GtsSettingsHostTestCases: 2s
    armeabi-v7a GtsDozeHostSideTestCases: 2s
    armeabi-v7a GtsKidsHomeHostTestCases: 1s
    armeabi-v7a GtsPreserveLegacyStorageHostTest: 1s
    armeabi-v7a GtsUserspaceRebootHostSideTestCases: 1s
    armeabi-v7a GtsSearchHostTestCases: 1s
    armeabi-v7a GtsScreenshotHostTestCases: 1s
    armeabi-v7a GtsAssistantMicHostTestCases: 1s
    armeabi-v7a GtsWellbeingHostTestCases: 1s
    armeabi-v7a GtsEntertainmentSpaceHostTestCases: 1s
    armeabi-v7a GtsGameOverlayTestCases: 1s
    armeabi-v7a GtsLinkerConfigTestCases: 993 ms
    armeabi-v7a GtsBootHealthHostTestCases: 959 ms
    armeabi-v7a GtsHomeHostTestCases: 836 ms
    armeabi-v7a GtsVndkDependencyTestCases: 819 ms
    armeabi-v7a CtsClasspathDeviceInfoTestCases: 750 ms
    armeabi-v7a CtsScopedStorageHostTest: 0 ms
Total aggregated tests run time: 17h 6m 3s
============== TOP 109 Slow Modules ==============
    armeabi-v7a GtsAssistIntentTestCases: 0.00 tests/sec [2 tests / 437291 msec]
    armeabi-v7a GtsRegulationComplianceTestCases: 0.01 tests/sec [3 tests / 475038 msec]
    armeabi-v7a GtsSettingsTestCases: 0.01 tests/sec [3 tests / 408183 msec]
    armeabi-v7a GtsRollbackManagerTest: 0.01 tests/sec [1 tests / 97904 msec]
    armeabi-v7a GtsExoPlayerTestCases: 0.01 tests/sec [42 tests / 3698056 msec]
    armeabi-v7a GtsVoiceInteractionHostTestCases: 0.01 tests/sec [3 tests / 219316 msec]
    armeabi-v7a GtsMediaTestCases: 0.01 tests/sec [571 tests / 41408823 msec]
    armeabi-v7a GtsMbaPrivilegedPermissionTestCases: 0.02 tests/sec [13 tests / 719657 msec]
    armeabi-v7a GtsEdiHostTestCases: 0.02 tests/sec [7 tests / 340235 msec]
    armeabi-v7a GtsBootStatsTestCases: 0.02 tests/sec [1 tests / 41430 msec]
    armeabi-v7a GtsLargeApkHostTestCases: 0.03 tests/sec [1 tests / 29649 msec]
    armeabi-v7a GtsGmscoreHostTestCases: 0.04 tests/sec [319 tests / 8818541 msec]
    armeabi-v7a GtsPlacementTestCases: 0.04 tests/sec [29 tests / 690561 msec]
    armeabi-v7a GtsStagedInstallHostTestCases: 0.05 tests/sec [7 tests / 144082 msec]
    armeabi-v7a GtsPermissionTestCases: 0.05 tests/sec [36 tests / 739056 msec]
    armeabi-v7a GtsAppBlacklistDeviceTestCases: 0.05 tests/sec [1 tests / 19868 msec]
    armeabi-v7a GtsAppTestCases: 0.05 tests/sec [2 tests / 38944 msec]
    armeabi-v7a CtsEdiHostTestCases: 0.05 tests/sec [4 tests / 73746 msec]
    armeabi-v7a GtsContextHubPermissionDeviceTestCases: 0.06 tests/sec [1 tests / 16609 msec]
    armeabi-v7a GtsPackageInstallerTapjackingTestCases: 0.06 tests/sec [1 tests / 16541 msec]
    armeabi-v7a GtsOsTestCases: 0.06 tests/sec [30 tests / 493632 msec]
    armeabi-v7a GtsInstallPackagesWhitelistDeviceTestCases: 0.06 tests/sec [1 tests / 15512 msec]
    armeabi-v7a GtsPackageRoleEnforcementTests: 0.07 tests/sec [1 tests / 15018 msec]
    armeabi-v7a GtsPermissionUiTestCases: 0.07 tests/sec [3 tests / 44801 msec]
    armeabi-v7a GtsThemingTestCases: 0.07 tests/sec [1 tests / 14399 msec]
    armeabi-v7a GtsTelephonyNumberVerificationHostCases: 0.07 tests/sec [1 tests / 14295 msec]
    armeabi-v7a GtsDialerAudioTestCases: 0.07 tests/sec [1 tests / 14290 msec]
    armeabi-v7a GtsPackageUninstallTestCases: 0.07 tests/sec [1 tests / 14101 msec]
    armeabi-v7a GtsUnofficialApisUsageTestCases: 0.07 tests/sec [3 tests / 42034 msec]
    armeabi-v7a GtsCNGCoreTestCases: 0.07 tests/sec [1 tests / 13937 msec]
    armeabi-v7a GtsStorageTestCases: 0.07 tests/sec [1 tests / 13919 msec]
    armeabi-v7a GtsNetStatsHostTestCases: 0.07 tests/sec [1 tests / 13820 msec]
    armeabi-v7a GtsTvBugReportTestCases: 0.07 tests/sec [1 tests / 13690 msec]
    armeabi-v7a GtsEntertainmentSpaceDeviceTestCases: 0.07 tests/sec [1 tests / 13632 msec]
    armeabi-v7a GtsContactsAppDeviceTestCases: 0.07 tests/sec [1 tests / 13529 msec]
    armeabi-v7a GtsPrivacyTestCases: 0.07 tests/sec [1 tests / 13437 msec]
    armeabi-v7a GtsIntelligenceTestCases: 0.08 tests/sec [1 tests / 13329 msec]
    armeabi-v7a GtsMemoryTestCases: 0.08 tests/sec [1 tests / 13187 msec]
    armeabi-v7a GtsSafetyCenterTestCases: 0.08 tests/sec [1 tests / 13100 msec]
    armeabi-v7a GtsSetupWizardNoPermissionTestCases: 0.08 tests/sec [1 tests / 12873 msec]
    armeabi-v7a GtsCallLogTestCases: 0.08 tests/sec [1 tests / 12857 msec]
    armeabi-v7a GtsPropertiesTestCases: 0.08 tests/sec [1 tests / 12797 msec]
    armeabi-v7a GtsFilesByGoogleTestCases: 0.08 tests/sec [1 tests / 12666 msec]
    armeabi-v7a GtsArtManagerHostTestCases: 0.08 tests/sec [7 tests / 87888 msec]
    armeabi-v7a GtsPackageNameCertPairsDeviceTestCases: 0.08 tests/sec [1 tests / 12553 msec]
    armeabi-v7a GtsModuleMetadataTestCases: 0.08 tests/sec [1 tests / 12427 msec]
    armeabi-v7a GtsPartnerBookmarksTestCases: 0.08 tests/sec [1 tests / 12406 msec]
    armeabi-v7a GtsSmartBatteryDeviceTestCases: 0.08 tests/sec [1 tests / 12252 msec]
    armeabi-v7a GtsPlayStoreHostTestCases: 0.08 tests/sec [5 tests / 61019 msec]
    armeabi-v7a GtsStatsdHostTestCases: 0.09 tests/sec [39 tests / 424830 msec]
    armeabi-v7a GtsCastHostTestCases: 0.09 tests/sec [1 tests / 10604 msec]
    armeabi-v7a GtsNetworkWatchlistTestCases: 0.11 tests/sec [3 tests / 28529 msec]
    armeabi-v7a GtsYouTubeTestCases: 0.11 tests/sec [5 tests / 46990 msec]
    armeabi-v7a GtsViewTestCases: 0.11 tests/sec [2 tests / 17659 msec]
    armeabi-v7a GtsNoPermissionTestCases: 0.12 tests/sec [2 tests / 16447 msec]
    armeabi-v7a GtsAndroidAutoDeviceTestCases: 0.12 tests/sec [2 tests / 16271 msec]
    armeabi-v7a GtsNoPermissionTestCases25: 0.12 tests/sec [2 tests / 16269 msec]
    armeabi-v7a GtsHealthConnectTests: 0.12 tests/sec [5 tests / 40618 msec]
    armeabi-v7a GtsDeviceConfigTestCases: 0.12 tests/sec [3 tests / 24201 msec]
    armeabi-v7a GtsNetTestCases: 0.13 tests/sec [4 tests / 31898 msec]
    armeabi-v7a GtsPrintTestCases: 0.13 tests/sec [3 tests / 22571 msec]
    armeabi-v7a GtsCalendarTests: 0.14 tests/sec [2 tests / 14415 msec]
    armeabi-v7a GtsSupervisionTestCases: 0.14 tests/sec [2 tests / 14272 msec]
    armeabi-v7a GtsWellbeingPermissionPolicyTestCases: 0.14 tests/sec [2 tests / 14169 msec]
    armeabi-v7a GtsAppVisibilityDeviceTestCases: 0.15 tests/sec [2 tests / 13044 msec]
    armeabi-v7a GtsUsageStatsTestCases: 0.16 tests/sec [3 tests / 18822 msec]
    armeabi-v7a GtsLocationHostTestCases: 0.16 tests/sec [2 tests / 12485 msec]
    armeabi-v7a GtsPackageManagerHostTestCases: 0.16 tests/sec [12 tests / 74776 msec]
    armeabi-v7a GtsCameraTestCases: 0.17 tests/sec [3 tests / 17310 msec]
    armeabi-v7a GtsSensorHostTestCases: 0.19 tests/sec [2 tests / 10559 msec]
    armeabi-v7a GtsContactsTest: 0.19 tests/sec [3 tests / 15504 msec]
    armeabi-v7a GtsNotificationTestCases: 0.21 tests/sec [7 tests / 34049 msec]
    armeabi-v7a GtsSimAppDialogTestCases: 0.21 tests/sec [3 tests / 14135 msec]
    armeabi-v7a GtsSsaidHostTestCases: 0.24 tests/sec [3 tests / 12720 msec]
    armeabi-v7a GtsSuspendAppsPermissionTestCases: 0.27 tests/sec [4 tests / 14953 msec]
    armeabi-v7a GtsPackageInstallTestCases: 0.27 tests/sec [10 tests / 36663 msec]
    armeabi-v7a GtsAdminTestCases: 0.28 tests/sec [4 tests / 14346 msec]
    armeabi-v7a GtsDevicePolicyGmsInstrumentationTestCases: 0.29 tests/sec [44 tests / 150530 msec]
    armeabi-v7a GtsAfwTestCases: 0.31 tests/sec [5 tests / 16251 msec]
    armeabi-v7a GtsOemLockServiceTestCases: 0.33 tests/sec [5 tests / 15265 msec]
    armeabi-v7a GtsIncidentManagerTestCases: 0.33 tests/sec [5 tests / 15222 msec]
    armeabi-v7a GtsNmgiarcTestCases: 0.34 tests/sec [7 tests / 20679 msec]
    armeabi-v7a GtsSecurityHostTestCases: 0.34 tests/sec [41 tests / 121095 msec]
    armeabi-v7a GtsTvTestCases: 0.35 tests/sec [8 tests / 22855 msec]
    armeabi-v7a GtsTetheringTestCases: 0.36 tests/sec [7 tests / 19413 msec]
    armeabi-v7a GtsRlzTestCases: 0.36 tests/sec [6 tests / 16555 msec]
    armeabi-v7a GtsWallpaperTestCases: 0.37 tests/sec [6 tests / 16359 msec]
    armeabi-v7a GtsSpeechServicesTestCases: 0.37 tests/sec [5 tests / 13531 msec]
    armeabi-v7a GtsTelecomManagerTests: 0.38 tests/sec [7 tests / 18483 msec]
    armeabi-v7a GtsSuspendAppsTestCases: 0.38 tests/sec [15 tests / 39355 msec]
    armeabi-v7a GtsWebViewTestCases: 0.38 tests/sec [7 tests / 18328 msec]
    armeabi-v7a GtsPlayAutoInstallTestCases: 0.41 tests/sec [8 tests / 19450 msec]
    armeabi-v7a GtsFeaturesTestCases: 0.44 tests/sec [53 tests / 120687 msec]
    armeabi-v7a GtsDozeDeviceTestCases: 0.49 tests/sec [14 tests / 28732 msec]
    armeabi-v7a GtsLensTestCases: 0.49 tests/sec [10 tests / 20224 msec]
    armeabi-v7a GtsPersonalSafetyTestCases: 0.59 tests/sec [12 tests / 20453 msec]
    armeabi-v7a GtsLocationTestCases: 0.60 tests/sec [19 tests / 31801 msec]
    armeabi-v7a GtsDevicePolicyTestCases: 0.72 tests/sec [44 tests / 61103 msec]
    armeabi-v7a GtsNetworkStackHostTestCases: 0.76 tests/sec [8 tests / 10569 msec]
    armeabi-v7a GtsDuoReadyTestCases: 0.79 tests/sec [28 tests / 35309 msec]
    armeabi-v7a GtsContentTestCases: 1.00 tests/sec [32 tests / 32058 msec]
    armeabi-v7a GtsBackupTestCases: 1.06 tests/sec [28 tests / 26341 msec]
    armeabi-v7a GtsAssistantHostTestCases: 1.28 tests/sec [8 tests / 6235 msec]
    armeabi-v7a GtsPermissionControllerHostTestCases: 1.28 tests/sec [9 tests / 7010 msec]
    armeabi-v7a GtsWellbeingTestCases: 1.77 tests/sec [34 tests / 19177 msec]
    armeabi-v7a GtsBackupHostTestCases: 1.96 tests/sec [50 tests / 25542 msec]
    armeabi-v7a GtsSetupWizardHostTestCases: 3.09 tests/sec [18 tests / 5828 msec]
    armeabi-v7a GtsIncrementalInstallProxyHostTestCases: 3.43 tests/sec [38 tests / 11074 msec]
    armeabi-v7a GtsTelephonyTestCases: 3.88 tests/sec [78 tests / 20104 msec]
============== Modules Preparation Times ==============
    armeabi-v7a GtsViewTestCases => prep = 4165 ms || clean = 1404 ms
    armeabi-v7a GtsArtManagerHostTestCases => prep = 3881 ms || clean = 1338 ms
    armeabi-v7a GtsPrivacyTestCases => prep = 3858 ms || clean = 1484 ms
    armeabi-v7a GtsOsTestCases => prep = 14236 ms || clean = 5193 ms
    armeabi-v7a GtsAndroidAutoDeviceTestCases => prep = 4033 ms || clean = 1278 ms
    armeabi-v7a GtsLinkerConfigTestCases => prep = 0 ms || clean = 722 ms
    armeabi-v7a GtsWellbeingPermissionPolicyTestCases => prep = 3717 ms || clean = 1225 ms
    armeabi-v7a GtsUsageStatsTestCases => prep = 7508 ms || clean = 1897 ms
    armeabi-v7a GtsAfwTestCases => prep = 3726 ms || clean = 1251 ms
    armeabi-v7a GtsStorageTestCases => prep = 5010 ms || clean = 1368 ms
    armeabi-v7a GtsVndkDependencyTestCases => prep = 0 ms || clean = 573 ms
    armeabi-v7a GtsDozeDeviceTestCases => prep = 4597 ms || clean = 1267 ms
    armeabi-v7a GtsPackageManagerHostTestCases => prep = 0 ms || clean = 898 ms
    armeabi-v7a GtsKidsHomeHostTestCases => prep = 0 ms || clean = 622 ms
    armeabi-v7a GtsDeviceConfigTestCases => prep = 1459 ms || clean = 1191 ms
    armeabi-v7a GtsThemingTestCases => prep = 4120 ms || clean = 1370 ms
    armeabi-v7a GtsAppVisibilityDeviceTestCases => prep = 5261 ms || clean = 1843 ms
    armeabi-v7a GtsPermissionControllerHostTestCases => prep = 317 ms || clean = 789 ms
    armeabi-v7a GtsUnofficialApisUsageTestCases => prep = 337 ms || clean = 769 ms
    armeabi-v7a GtsLocationHostTestCases => prep = 14 ms || clean = 727 ms
    armeabi-v7a CtsEdiHostTestCases => prep = 0 ms || clean = 596 ms
    armeabi-v7a GtsDevicePolicyTestCases => prep = 10970 ms || clean = 1461 ms
    armeabi-v7a GtsPreserveLegacyStorageHostTest => prep = 12353 ms || clean = 885 ms
    armeabi-v7a GtsHealthConnectTests => prep = 5011 ms || clean = 1328 ms
    armeabi-v7a GtsBootHealthHostTestCases => prep = 0 ms || clean = 773 ms
    armeabi-v7a GtsYouTubeTestCases => prep = 55274 ms || clean = 1479 ms
    armeabi-v7a GtsBackupTestCases => prep = 14376 ms || clean = 3781 ms
    armeabi-v7a GtsSetupWizardNoPermissionTestCases => prep = 3913 ms || clean = 1224 ms
    armeabi-v7a GtsSetupWizardHostTestCases => prep = 3673 ms || clean = 1285 ms
    armeabi-v7a GtsInstantAppsHostTestCases => prep = 0 ms || clean = 730 ms
    armeabi-v7a CtsClasspathDeviceInfoTestCases => prep = 0 ms || clean = 609 ms
    armeabi-v7a GtsCastHostTestCases => prep = 4030 ms || clean = 972 ms
    armeabi-v7a GtsWebViewHostTestCases => prep = 0 ms || clean = 1048 ms
    armeabi-v7a GtsRollbackManagerTest => prep = 0 ms || clean = 1614 ms
    armeabi-v7a GtsAssistIntentTestCases => prep = 11892 ms || clean = 2495 ms
    armeabi-v7a GtsPermissionUiTestCases => prep = 6646 ms || clean = 1985 ms
    armeabi-v7a GtsPackageInstallTestCases => prep = 4752 ms || clean = 1575 ms
    armeabi-v7a GtsMemoryHostTestCases => prep = 5291 ms || clean = 1616 ms
    armeabi-v7a GtsTetheringTestCases => prep = 3818 ms || clean = 1302 ms
    armeabi-v7a GtsGmscoreHostTestCases => prep = 29454 ms || clean = 9211 ms
    armeabi-v7a GtsCNGCoreTestCases => prep = 4381 ms || clean = 1323 ms
    armeabi-v7a GtsPermissionTestCases => prep = 6200 ms || clean = 1971 ms
    armeabi-v7a GtsPackageNameCertPairsDeviceTestCases => prep = 4604 ms || clean = 1464 ms
    armeabi-v7a GtsEntertainmentSpaceDeviceTestCases => prep = 4446 ms || clean = 1318 ms
    armeabi-v7a GtsCalendarTests => prep = 3724 ms || clean = 1158 ms
    armeabi-v7a GtsAppBlacklistDeviceTestCases => prep = 5543 ms || clean = 1324 ms
    armeabi-v7a GtsBackupHostTestCases => prep = 18425 ms || clean = 5312 ms
    armeabi-v7a GtsAppTestCases => prep = 18138 ms || clean = 3982 ms
    armeabi-v7a GtsContactsTest => prep = 3724 ms || clean = 1253 ms
    armeabi-v7a GtsTelephonyTestCases => prep = 7321 ms || clean = 1758 ms
    armeabi-v7a GtsTvBugReportTestCases => prep = 3640 ms || clean = 1339 ms
    armeabi-v7a GtsSensorHostTestCases => prep = 0 ms || clean = 703 ms
    armeabi-v7a GtsDevicePolicyGmsInstrumentationTestCases => prep = 10864 ms || clean = 1427 ms
    armeabi-v7a GtsIncidentManagerTestCases => prep = 4034 ms || clean = 1528 ms
    armeabi-v7a GtsOemLockServiceTestCases => prep = 3694 ms || clean = 1167 ms
    armeabi-v7a GtsWellbeingHostTestCases => prep = 1966 ms || clean = 1144 ms
    armeabi-v7a GtsCameraTestCases => prep = 3886 ms || clean = 1473 ms
    armeabi-v7a GtsSimAppDialogTestCases => prep = 3635 ms || clean = 1164 ms
    armeabi-v7a GtsNetStatsHostTestCases => prep = 8250 ms || clean = 2118 ms
    armeabi-v7a GtsAdminTestCases => prep = 3654 ms || clean = 1304 ms
    armeabi-v7a GtsVoiceInteractionHostTestCases => prep = 21 ms || clean = 689 ms
    armeabi-v7a GtsWellbeingTestCases => prep = 3788 ms || clean = 1219 ms
    armeabi-v7a GtsContextHubPermissionDeviceTestCases => prep = 4948 ms || clean = 1467 ms
    armeabi-v7a GtsIntelligenceTestCases => prep = 3617 ms || clean = 1288 ms
    armeabi-v7a GtsNmgiarcTestCases => prep = 5215 ms || clean = 1844 ms
    armeabi-v7a GtsLocationTestCases => prep = 8091 ms || clean = 1355 ms
    armeabi-v7a GtsPropertiesTestCases => prep = 3817 ms || clean = 1119 ms
    armeabi-v7a GtsPackageInstallerTapjackingTestCases => prep = 5239 ms || clean = 2208 ms
    armeabi-v7a GtsSsaidHostTestCases => prep = 3693 ms || clean = 1999 ms
    armeabi-v7a GtsPackageUninstallTestCases => prep = 5193 ms || clean = 2072 ms
    armeabi-v7a GtsPlacementTestCases => prep = 4827 ms || clean = 1527 ms
    armeabi-v7a GtsSecurityHostTestCases => prep = 823 ms || clean = 850 ms
    armeabi-v7a GtsAssistantHostTestCases => prep = 4400 ms || clean = 1303 ms
    armeabi-v7a GtsEdiHostTestCases => prep = 4768 ms || clean = 1635 ms
    armeabi-v7a GtsPlayStoreHostTestCases => prep = 6527 ms || clean = 3045 ms
    armeabi-v7a GtsPartnerBookmarksTestCases => prep = 3949 ms || clean = 1265 ms
    armeabi-v7a GtsPlayAutoInstallTestCases => prep = 3690 ms || clean = 1171 ms
    armeabi-v7a GtsFeaturesTestCases => prep = 3099 ms || clean = 1722 ms
    armeabi-v7a GtsNotificationTestCases => prep = 1500 ms || clean = 1318 ms
    armeabi-v7a GtsNetTestCases => prep = 5346 ms || clean = 1411 ms
    armeabi-v7a GtsSearchHostTestCases => prep = 16 ms || clean = 800 ms
    armeabi-v7a GtsRegulationComplianceTestCases => prep = 3949 ms || clean = 1253 ms
    armeabi-v7a GtsSuspendAppsPermissionTestCases => prep = 5084 ms || clean = 1967 ms
    armeabi-v7a GtsSafetyCenterTestCases => prep = 3966 ms || clean = 1340 ms
    armeabi-v7a GtsNoPermissionTestCases => prep = 5423 ms || clean = 1362 ms
    armeabi-v7a GtsNetworkStackHostTestCases => prep = 14 ms || clean = 604 ms
    armeabi-v7a GtsSpeechServicesTestCases => prep = 4086 ms || clean = 1185 ms
    armeabi-v7a GtsSupervisionTestCases => prep = 3869 ms || clean = 1317 ms
    armeabi-v7a GtsInstallPackagesWhitelistDeviceTestCases => prep = 4534 ms || clean = 1355 ms
    armeabi-v7a GtsPackageRoleEnforcementTests => prep = 4188 ms || clean = 1480 ms
    armeabi-v7a GtsStagedInstallHostTestCases => prep = 9643 ms || clean = 1927 ms
    armeabi-v7a GtsExoPlayerTestCases => prep = 6921 ms || clean = 1723 ms
    armeabi-v7a GtsMbaPrivilegedPermissionTestCases => prep = 4249 ms || clean = 1417 ms
    armeabi-v7a GtsContentHostTestCases => prep = 3570 ms || clean = 1426 ms
    armeabi-v7a GtsBootStatsTestCases => prep = 0 ms || clean = 3310 ms
    armeabi-v7a GtsStatsdHostTestCases => prep = 10813 ms || clean = 1229 ms
    armeabi-v7a GtsDuoReadyTestCases => prep = 6354 ms || clean = 1577 ms
    armeabi-v7a GtsModuleMetadataTestCases => prep = 3643 ms || clean = 1260 ms
    armeabi-v7a GtsNoPermissionTestCases25 => prep = 4654 ms || clean = 1292 ms
    armeabi-v7a GtsSettingsTestCases => prep = 3610 ms || clean = 1326 ms
    armeabi-v7a GtsSettingsHostTestCases => prep = 0 ms || clean = 633 ms
    armeabi-v7a GtsScreenshotHostTestCases => prep = 14 ms || clean = 976 ms
    armeabi-v7a GtsTvHostTestCases => prep = 0 ms || clean = 926 ms
    armeabi-v7a GtsLensTestCases => prep = 3903 ms || clean = 1270 ms
    armeabi-v7a GtsLargeApkHostTestCases => prep = 0 ms || clean = 890 ms
    armeabi-v7a GtsSuspendAppsTestCases => prep = 7398 ms || clean = 3058 ms
    armeabi-v7a GtsCallLogTestCases => prep = 3967 ms || clean = 1212 ms
    armeabi-v7a GtsPrintTestCases => prep = 5466 ms || clean = 1403 ms
    armeabi-v7a GtsEntertainmentSpaceHostTestCases => prep = 1 ms || clean = 596 ms
    armeabi-v7a GtsRlzTestCases => prep = 3498 ms || clean = 1154 ms
    armeabi-v7a GtsGraphicsHostTestCases => prep = 0 ms || clean = 678 ms
    armeabi-v7a GtsTvTestCases => prep = 5527 ms || clean = 2395 ms
    armeabi-v7a GtsSmartBatteryDeviceTestCases => prep = 3649 ms || clean = 1302 ms
    armeabi-v7a GtsWallpaperTestCases => prep = 3776 ms || clean = 1280 ms
    armeabi-v7a GtsContactsAppDeviceTestCases => prep = 3883 ms || clean = 1236 ms
    armeabi-v7a GtsWebViewTestCases => prep = 3743 ms || clean = 1189 ms
    armeabi-v7a GtsPersonalSafetyTestCases => prep = 4139 ms || clean = 1463 ms
    armeabi-v7a GtsUserspaceRebootHostSideTestCases => prep = 0 ms || clean = 809 ms
    armeabi-v7a GtsGameOverlayTestCases => prep = 0 ms || clean = 685 ms
    armeabi-v7a GtsMediaTestCases => prep = 23302 ms || clean = 8528 ms
    armeabi-v7a GtsMemoryTestCases => prep = 5743 ms || clean = 1509 ms
    armeabi-v7a GtsHomeHostTestCases => prep = 114 ms || clean = 665 ms
    armeabi-v7a GtsNetworkWatchlistTestCases => prep = 5225 ms || clean = 1389 ms
    armeabi-v7a GtsTelecomManagerTests => prep = 3343 ms || clean = 1227 ms
    armeabi-v7a GtsIncrementalInstallProxyHostTestCases => prep = 2620 ms || clean = 2082 ms
    armeabi-v7a GtsDozeHostSideTestCases => prep = 3793 ms || clean = 1204 ms
    armeabi-v7a GtsFilesByGoogleTestCases => prep = 4045 ms || clean = 1284 ms
    armeabi-v7a GtsTelephonyNumberVerificationHostCases => prep = 0 ms || clean = 736 ms
    armeabi-v7a GtsContentTestCases => prep = 5560 ms || clean = 1396 ms
    armeabi-v7a GtsAssistantMicHostTestCases => prep = 3929 ms || clean = 1143 ms
    armeabi-v7a GtsDialerAudioTestCases => prep = 5085 ms || clean = 1519 ms
Total preparation time: 10m 40s  ||  Total tear down time: 3m 22s
=======================================================
=============== Summary ===============
Total Run time: 5m 9s
130/132 modules completed
Module(s) with run failure(s):
    armeabi-v7a CtsScopedStorageHostTest: There were 4 failures:
  com.android.tradefed.targetprep.TargetSetupError[APK_INSTALLATION_FAILED|520001|DEPENDENCY_ISSUE]: Failed to install android.scopedstorage.cts.testapp.A.withres with [/data/tmp/b82d4538-c7a8-4a6b-8079-136d9e68fdeb/android-gts/testcases/CtsScopedStorageHostTest/CtsScopedStorageTestAppA.apk] on SKBFXYWE0GRI. Reason: 'INSTALL_FAILED_OLDER_SDK: Failed parse during installPackageLI: /data/app/vmdl1712441488.tmp/base.apk (at Binary XML file line #18): Requires newer sdk version #30 (current version is #29)' [SKBFXYWE0GRI sequoia:bfx-ua300 QT]
	at com.android.tradefed.targetprep.TestAppInstallSetup.installSinglePackage(TestAppInstallSetup.java:558)
	at com.android.tradefed.targetprep.TestAppInstallSetup.installer(TestAppInstallSetup.java:525)
	at com.android.tradefed.targetprep.TestAppInstallSetup.setUp(TestAppInstallSetup.java:413)
	at com.android.tradefed.testtype.suite.ModuleDefinition.runPreparerSetup(ModuleDefinition.java:999)
	at com.android.tradefed.testtype.suite.ModuleDefinition.runTargetPreparation(ModuleDefinition.java:1432)
	at com.android.tradefed.testtype.suite.ModuleDefinition.runPreparation(ModuleDefinition.java:958)
	at com.android.tradefed.testtype.suite.ModuleDefinition.run(ModuleDefinition.java:484)
	at com.android.tradefed.testtype.suite.ITestSuite.runSingleModule(ITestSuite.java:937)
	at com.android.tradefed.testtype.suite.ITestSuite.run(ITestSuite.java:817)
	at com.android.tradefed.invoker.shard.TestsPoolPoller.run(TestsPoolPoller.java:161)
	at com.android.tradefed.invoker.InvocationExecution.runTest(InvocationExecution.java:1336)
	at com.android.tradefed.invoker.InvocationExecution.runTests(InvocationExecution.java:1115)
	at com.android.tradefed.invoker.TestInvocation.prepareAndRun(TestInvocation.java:617)
	at com.android.tradefed.invoker.TestInvocation.performInvocation(TestInvocation.java:275)
	at com.android.tradefed.invoker.TestInvocation.invoke(TestInvocation.java:1335)
	at com.android.tradefed.command.CommandScheduler$InvocationThread.run(CommandScheduler.java:678)

  com.android.tradefed.targetprep.TargetSetupError[APK_INSTALLATION_FAILED|520001|DEPENDENCY_ISSUE]: Failed to install android.scopedstorage.cts.testapp.A.withres with [/data/tmp/b82d4538-c7a8-4a6b-8079-136d9e68fdeb/android-gts/testcases/CtsScopedStorageHostTest/CtsScopedStorageTestAppA.apk] on SKBFXYWE0GRC. Reason: 'INSTALL_FAILED_OLDER_SDK: Failed parse during installPackageLI: /data/app/vmdl480462989.tmp/base.apk (at Binary XML file line #18): Requires newer sdk version #30 (current version is #29)' [SKBFXYWE0GRC sequoia:bfx-ua300 QT]
	at com.android.tradefed.targetprep.TestAppInstallSetup.installSinglePackage(TestAppInstallSetup.java:558)
	at com.android.tradefed.targetprep.TestAppInstallSetup.installer(TestAppInstallSetup.java:525)
	at com.android.tradefed.targetprep.TestAppInstallSetup.setUp(TestAppInstallSetup.java:413)
	at com.android.tradefed.testtype.suite.ModuleDefinition.runPreparerSetup(ModuleDefinition.java:999)
	at com.android.tradefed.testtype.suite.ModuleDefinition.runTargetPreparation(ModuleDefinition.java:1432)
	at com.android.tradefed.testtype.suite.ModuleDefinition.runPreparation(ModuleDefinition.java:958)
	at com.android.tradefed.testtype.suite.ModuleDefinition.run(ModuleDefinition.java:484)
	at com.android.tradefed.testtype.suite.ITestSuite.runSingleModule(ITestSuite.java:937)
	at com.android.tradefed.testtype.suite.ITestSuite.run(ITestSuite.java:817)
	at com.android.tradefed.invoker.shard.TestsPoolPoller.run(TestsPoolPoller.java:161)
	at com.android.tradefed.invoker.InvocationExecution.runTest(InvocationExecution.java:1336)
	at com.android.tradefed.invoker.InvocationExecution.runTests(InvocationExecution.java:1115)
	at com.android.tradefed.invoker.TestInvocation.prepareAndRun(TestInvocation.java:617)
	at com.android.tradefed.invoker.TestInvocation.performInvocation(TestInvocation.java:275)
	at com.android.tradefed.invoker.TestInvocation.invoke(TestInvocation.java:1335)
	at com.android.tradefed.command.CommandScheduler$InvocationThread.run(CommandScheduler.java:678)

  com.android.tradefed.targetprep.TargetSetupError[APK_INSTALLATION_FAILED|520001|DEPENDENCY_ISSUE]: Failed to install android.scopedstorage.cts.testapp.A.withres with [/data/tmp/b82d4538-c7a8-4a6b-8079-136d9e68fdeb/android-gts/testcases/CtsScopedStorageHostTest/CtsScopedStorageTestAppA.apk] on SKBFXYWE0GMF. Reason: 'INSTALL_FAILED_OLDER_SDK: Failed parse during installPackageLI: /data/app/vmdl1591902106.tmp/base.apk (at Binary XML file line #18): Requires newer sdk version #30 (current version is #29)' [SKBFXYWE0GMF sequoia:bfx-ua300 QT]
	at com.android.tradefed.targetprep.TestAppInstallSetup.installSinglePackage(TestAppInstallSetup.java:558)
	at com.android.tradefed.targetprep.TestAppInstallSetup.installer(TestAppInstallSetup.java:525)
	at com.android.tradefed.targetprep.TestAppInstallSetup.setUp(TestAppInstallSetup.java:413)
	at com.android.tradefed.testtype.suite.ModuleDefinition.runPreparerSetup(ModuleDefinition.java:999)
	at com.android.tradefed.testtype.suite.ModuleDefinition.runTargetPreparation(ModuleDefinition.java:1432)
	at com.android.tradefed.testtype.suite.ModuleDefinition.runPreparation(ModuleDefinition.java:958)
	at com.android.tradefed.testtype.suite.ModuleDefinition.run(ModuleDefinition.java:484)
	at com.android.tradefed.testtype.suite.ITestSuite.runSingleModule(ITestSuite.java:937)
	at com.android.tradefed.testtype.suite.ITestSuite.run(ITestSuite.java:817)
	at com.android.tradefed.invoker.shard.TestsPoolPoller.run(TestsPoolPoller.java:161)
	at com.android.tradefed.invoker.InvocationExecution.runTest(InvocationExecution.java:1336)
	at com.android.tradefed.invoker.InvocationExecution.runTests(InvocationExecution.java:1115)
	at com.android.tradefed.invoker.TestInvocation.prepareAndRun(TestInvocation.java:617)
	at com.android.tradefed.invoker.TestInvocation.performInvocation(TestInvocation.java:275)
	at com.android.tradefed.invoker.TestInvocation.invoke(TestInvocation.java:1335)
	at com.android.tradefed.command.CommandScheduler$InvocationThread.run(CommandScheduler.java:678)

  com.android.tradefed.targetprep.TargetSetupError[APK_INSTALLATION_FAILED|520001|DEPENDENCY_ISSUE]: Failed to install android.scopedstorage.cts.testapp.A.withres with [/data/tmp/b82d4538-c7a8-4a6b-8079-136d9e68fdeb/android-gts/testcases/CtsScopedStorageHostTest/CtsScopedStorageTestAppA.apk] on SKBFXYWE0GRC. Reason: 'INSTALL_FAILED_OLDER_SDK: Failed parse during installPackageLI: /data/app/vmdl1281064917.tmp/base.apk (at Binary XML file line #18): Requires newer sdk version #30 (current version is #29)' [SKBFXYWE0GRC sequoia:bfx-ua300 QT]
	at com.android.tradefed.targetprep.TestAppInstallSetup.installSinglePackage(TestAppInstallSetup.java:558)
	at com.android.tradefed.targetprep.TestAppInstallSetup.installer(TestAppInstallSetup.java:525)
	at com.android.tradefed.targetprep.TestAppInstallSetup.setUp(TestAppInstallSetup.java:413)
	at com.android.tradefed.testtype.suite.ModuleDefinition.runPreparerSetup(ModuleDefinition.java:999)
	at com.android.tradefed.testtype.suite.ModuleDefinition.runTargetPreparation(ModuleDefinition.java:1432)
	at com.android.tradefed.testtype.suite.ModuleDefinition.runPreparation(ModuleDefinition.java:958)
	at com.android.tradefed.testtype.suite.ModuleDefinition.run(ModuleDefinition.java:484)
	at com.android.tradefed.testtype.suite.ITestSuite.runSingleModule(ITestSuite.java:937)
	at com.android.tradefed.testtype.suite.ITestSuite.run(ITestSuite.java:817)
	at com.android.tradefed.invoker.shard.TestsPoolPoller.run(TestsPoolPoller.java:161)
	at com.android.tradefed.invoker.InvocationExecution.runTest(InvocationExecution.java:1336)
	at com.android.tradefed.invoker.InvocationExecution.runTests(InvocationExecution.java:1115)
	at com.android.tradefed.invoker.TestInvocation.prepareAndRun(TestInvocation.java:617)
	at com.android.tradefed.invoker.TestInvocation.performInvocation(TestInvocation.java:275)
	at com.android.tradefed.invoker.TestInvocation.invoke(TestInvocation.java:1335)
	at com.android.tradefed.command.CommandScheduler$InvocationThread.run(CommandScheduler.java:678)

    armeabi-v7a GtsMediaTestCases: Instrumentation run failed due to 'Process crashed.'
Java Crash Messages sorted from most recent:
Failed to allocate a 183845 byte allocation with 44168 free bytes and 43KB until OOM, target footprint 268435456, growth limit 268435456
java.lang.OutOfMemoryError: Failed to allocate a 183845 byte allocation with 44168 free bytes and 43KB until OOM, target footprint 268435456, growth limit 268435456
	at dalvik.system.VMRuntime.newNonMovableArray(Native Method)
	at java.nio.DirectByteBuffer$MemoryRef.<init>(DirectByteBuffer.java:70)
	at java.nio.ByteBuffer.allocateDirect(ByteBuffer.java:258)
	at com.google.android.exoplayer2.decoder.DecoderInputBuffer.createReplacementByteBuffer(DecoderInputBuffer.java:201)
	at com.google.android.exoplayer2.decoder.DecoderInputBuffer.ensureSpaceForWrite(DecoderInputBuffer.java:136)
	at com.google.android.exoplayer2.source.SampleDataQueue.readToBuffer(SampleDataQueue.java:145)
	at com.google.android.exoplayer2.source.SampleQueue.read(SampleQueue.java:330)
	at com.google.android.exoplayer2.source.ProgressiveMediaPeriod.readData(ProgressiveMediaPeriod.java:478)
	at com.google.android.exoplayer2.source.ProgressiveMediaPeriod$SampleStreamImpl.readData(ProgressiveMediaPeriod.java:894)
	at com.google.android.media.gts.extractor.ExoPlayer2ExtractorAdapter$7.run(ExoPlayer2ExtractorAdapter.java:565)
	at com.google.android.media.gts.extractor.ExoPlayer2ExtractorAdapter$7.run(ExoPlayer2ExtractorAdapter.java:555)
	at com.google.android.media.gts.extractor.LooperThread$3.run(LooperThread.java:93)
	at android.os.Handler.handleCallback(Handler.java:883)
	at android.os.Handler.dispatchMessage(Handler.java:100)
	at android.os.Looper.loop(Looper.java:214)
	at android.os.HandlerThread.run(HandlerThread.java:67)
Total Tests       : 2028
PASSED            : 1301
FAILED            : 24
IGNORED           : 12
ASSUMPTION_FAILURE: 633
IMPORTANT: Some modules failed to run to completion, tests counts may be inaccurate.
Shard 0 used: [SKBFXYWR0LWD]
Shard 1 used: [SKBFXYWR0LX5]
Shard 2 used: [SKBFXYWE0GMF]
Shard 3 used: [SKBFXYWR0LXX]
Shard 4 used: [SKBFXYWR0LWX]
Shard 5 used: [SKBFXYWE0GRC]
Shard 6 used: [SKBFXYWE0GRI]
============== End of Results ==============
============================================
