![]() |
| Summary | |
|---|---|
| Suite / Plan | CTS / cts |
| Suite / Build | 10_r16 / 9712475 |
| Host Info | Result/@start dev2google05 (Linux - 6.5.0-41-generic) |
| Start time / End Time | Tue Jul 02 08:31:52 KST 2024 / Tue Jul 02 09:03:10 KST 2024 |
| Tests Passed | 613973 |
| Tests Failed | 63 |
| Modules Done | 485 |
| Modules Total | 485 |
| Fingerprint | SKB/BFX_UA300/BFX-UA300:10/QT/19.541.521-20240701:user/release-keys |
| Security Patch | 2024-05-01 |
| Release (SDK) | 10 (29) |
| ABIs | armeabi-v7a,armeabi |
| Module | Passed | Failed | Assumption Failure | Ignored | Total Tests | Done |
|---|---|---|---|---|---|---|
| armeabi-v7a CtsAbiOverrideHostTestCases | 1 | 0 | 0 | 0 | 1 | true |
| armeabi-v7a CtsAbiOverrideHostTestCases[instant] | 1 | 0 | 0 | 0 | 1 | true |
| armeabi-v7a CtsAccelerationTestCases | 6 | 0 | 0 | 0 | 6 | true |
| armeabi-v7a CtsAccelerationTestCases[instant] | 6 | 0 | 0 | 0 | 6 | true |
| armeabi-v7a CtsAccessibilityServiceTestCases | 146 | 0 | 0 | 0 | 146 | true |
| armeabi-v7a CtsAccessibilityServiceTestCases[instant] | 76 | 0 | 0 | 0 | 76 | true |
| armeabi-v7a CtsAccessibilityTestCases | 48 | 0 | 0 | 0 | 48 | true |
| armeabi-v7a CtsAccessibilityTestCases[instant] | 46 | 0 | 0 | 0 | 46 | true |
| armeabi-v7a CtsAccountManagerTestCases | 151 | 0 | 0 | 0 | 151 | true |
| armeabi-v7a CtsAccountManagerTestCases[instant] | 120 | 0 | 0 | 0 | 120 | true |
| armeabi-v7a CtsActivityManagerBackgroundActivityTestCases | 15 | 0 | 0 | 1 | 16 | true |
| armeabi-v7a CtsAdminPackageInstallerTestCases | 6 | 0 | 0 | 0 | 6 | true |
| armeabi-v7a CtsAdminTestCases | 92 | 0 | 0 | 0 | 92 | true |
| armeabi-v7a CtsAlarmManagerTestCases | 21 | 0 | 0 | 0 | 21 | true |
| armeabi-v7a CtsAlarmManagerTestCases[instant] | 4 | 0 | 0 | 0 | 4 | true |
| armeabi-v7a CtsAndroidAppTestCases | 5 | 0 | 0 | 0 | 5 | true |
| armeabi-v7a CtsAndroidAppTestCases[instant] | 5 | 0 | 0 | 0 | 5 | true |
| armeabi-v7a CtsAndroidTestBase28ApiSignatureTestCases | 1 | 0 | 0 | 0 | 1 | true |
| armeabi-v7a CtsAndroidTestBaseCurrentApiSignatureTestCases | 1 | 0 | 0 | 0 | 1 | true |
| armeabi-v7a CtsAndroidTestMockCurrentApiSignatureTestCases | 1 | 0 | 0 | 0 | 1 | true |
| armeabi-v7a CtsAndroidTestRunnerCurrentApiSignatureTestCases | 1 | 0 | 0 | 0 | 1 | true |
| armeabi-v7a CtsAngleIntegrationHostTestCases | 0 | 0 | 17 | 0 | 17 | true |
| armeabi-v7a CtsAngleIntegrationHostTestCases[instant] | 0 | 0 | 17 | 0 | 17 | true |
| armeabi-v7a CtsAnimationTestCases | 145 | 0 | 0 | 0 | 145 | true |
| armeabi-v7a CtsAnimationTestCases[instant] | 145 | 0 | 0 | 0 | 145 | true |
| armeabi-v7a CtsApacheHttpLegacy27ApiSignatureTestCases | 1 | 0 | 0 | 0 | 1 | true |
| armeabi-v7a CtsApacheHttpLegacyCurrentApiSignatureTestCases | 1 | 0 | 0 | 0 | 1 | true |
| armeabi-v7a CtsApacheHttpLegacyUsesLibraryApiSignatureTestCases | 1 | 0 | 0 | 0 | 1 | true |
| armeabi-v7a CtsApexTestCases | 2 | 0 | 0 | 0 | 2 | true |
| armeabi-v7a CtsAppBindingHostTestCases | 14 | 0 | 0 | 0 | 14 | true |
| armeabi-v7a CtsAppComponentFactoryTestCases | 4 | 0 | 0 | 0 | 4 | true |
| armeabi-v7a CtsAppComponentFactoryTestCases[instant] | 4 | 0 | 0 | 0 | 4 | true |
| armeabi-v7a CtsAppOpsTestCases | 11 | 0 | 0 | 6 | 17 | true |
| armeabi-v7a CtsAppOpsTestCases[instant] | 11 | 0 | 0 | 6 | 17 | true |
| armeabi-v7a CtsAppPredictionServiceTestCases | 7 | 0 | 0 | 0 | 7 | true |
| armeabi-v7a CtsAppSecurityHostTestCases | 355 | 0 | 2 | 0 | 357 | true |
| armeabi-v7a CtsAppTestCases | 679 | 1 | 0 | 0 | 680 | true |
| armeabi-v7a CtsAppTestCases[instant] | 679 | 1 | 0 | 0 | 680 | true |
| armeabi-v7a CtsAppUsageHostTestCases | 5 | 0 | 0 | 0 | 5 | true |
| armeabi-v7a CtsAppUsageHostTestCases[instant] | 5 | 0 | 0 | 0 | 5 | true |
| armeabi-v7a CtsAppWidgetTestCases | 0 | 0 | 40 | 0 | 40 | true |
| armeabi-v7a CtsAppWidgetTestCases[instant] | 0 | 0 | 2 | 0 | 2 | true |
| armeabi-v7a CtsAslrMallocTestCases | 1 | 0 | 0 | 0 | 1 | true |
| armeabi-v7a CtsAssistTestCases | 16 | 0 | 0 | 0 | 16 | true |
| armeabi-v7a CtsAssistTestCases[instant] | 16 | 0 | 0 | 0 | 16 | true |
| armeabi-v7a CtsAtomicInstallTestCases | 5 | 0 | 0 | 0 | 5 | true |
| armeabi-v7a CtsAtraceHostTestCases | 8 | 0 | 0 | 0 | 8 | true |
| armeabi-v7a CtsAtraceHostTestCases[instant] | 8 | 0 | 0 | 0 | 8 | true |
| armeabi-v7a CtsAttentionServiceDeviceTestCases | 0 | 0 | 3 | 0 | 3 | true |
| armeabi-v7a CtsAutoFillServiceTestCases | 636 | 0 | 0 | 4 | 640 | true |
| armeabi-v7a CtsAutoFillServiceTestCases[instant] | 155 | 0 | 0 | 2 | 157 | true |
| armeabi-v7a CtsBackgroundRestrictionsTestCases | 2 | 0 | 0 | 0 | 2 | true |
| armeabi-v7a CtsBackgroundRestrictionsTestCases[instant] | 1 | 0 | 0 | 0 | 1 | true |
| armeabi-v7a CtsBackupHostTestCases | 23 | 0 | 16 | 0 | 39 | true |
| armeabi-v7a CtsBackupTestCases | 21 | 0 | 0 | 0 | 21 | true |
| armeabi-v7a CtsBatterySavingTestCases | 0 | 0 | 11 | 0 | 11 | true |
| armeabi-v7a CtsBionicTestCases | 2839 | 0 | 0 | 16 | 2855 | true |
| armeabi-v7a CtsBluetoothTestCases | 50 | 0 | 0 | 0 | 50 | true |
| armeabi-v7a CtsBootStatsTestCases | 1 | 0 | 0 | 0 | 1 | true |
| armeabi-v7a CtsCalendarcommon2TestCases | 1 | 0 | 0 | 0 | 1 | true |
| armeabi-v7a CtsCameraApi25TestCases | 1 | 0 | 0 | 0 | 1 | true |
| armeabi-v7a CtsCameraTestCases | 290 | 0 | 0 | 0 | 290 | true |
| armeabi-v7a CtsCameraTestCases[instant] | 289 | 0 | 0 | 0 | 289 | true |
| armeabi-v7a CtsCarTestCases | 0 | 0 | 0 | 12 | 12 | true |
| armeabi-v7a CtsCarrierApiTestCases | 37 | 0 | 0 | 0 | 37 | true |
| armeabi-v7a CtsClassLoaderFactoryInMemoryDexClassLoaderTestCases | 2 | 0 | 0 | 0 | 2 | true |
| armeabi-v7a CtsClassLoaderFactoryInMemoryDexClassLoaderTestCases[instant] | 2 | 0 | 0 | 0 | 2 | true |
| armeabi-v7a CtsClassLoaderFactoryPathClassLoaderTestCases | 2 | 0 | 0 | 0 | 2 | true |
| armeabi-v7a CtsClassLoaderFactoryPathClassLoaderTestCases[instant] | 2 | 0 | 0 | 0 | 2 | true |
| armeabi-v7a CtsClassloaderSplitsHostTestCases | 4 | 0 | 0 | 0 | 4 | true |
| armeabi-v7a CtsClassloaderSplitsHostTestCases[instant] | 3 | 0 | 0 | 0 | 3 | true |
| armeabi-v7a CtsColorModeTestCases | 3 | 0 | 0 | 0 | 3 | true |
| armeabi-v7a CtsColorModeTestCases[instant] | 3 | 0 | 0 | 0 | 3 | true |
| armeabi-v7a CtsCompilationTestCases | 5 | 0 | 0 | 0 | 5 | true |
| armeabi-v7a CtsContactsProviderWipe | 3 | 0 | 0 | 0 | 3 | true |
| armeabi-v7a CtsContentCaptureServiceTestCases | 47 | 0 | 2 | 2 | 51 | true |
| armeabi-v7a CtsContentCaptureServiceTestCases[instant] | 0 | 0 | 2 | 0 | 2 | true |
| armeabi-v7a CtsContentSuggestionsTestCases | 4 | 0 | 0 | 0 | 4 | true |
| armeabi-v7a CtsContentTestCases | 951 | 0 | 4 | 7 | 962 | true |
| armeabi-v7a CtsContentTestCases[instant] | 593 | 0 | 0 | 0 | 593 | true |
| armeabi-v7a CtsCppToolsTestCases | 2 | 0 | 0 | 0 | 2 | true |
| armeabi-v7a CtsCurrentApiSignatureTestCases | 1 | 0 | 0 | 0 | 1 | true |
| armeabi-v7a CtsDatabaseTestCases | 277 | 0 | 0 | 0 | 277 | true |
| armeabi-v7a CtsDatabaseTestCases[instant] | 276 | 0 | 0 | 0 | 276 | true |
| armeabi-v7a CtsDeqpTestCases | 496989 | 0 | 0 | 0 | 496989 | true |
| armeabi-v7a CtsDeviceConfigTestCases | 56 | 0 | 0 | 0 | 56 | true |
| armeabi-v7a CtsDeviceConfigTestCases[instant] | 56 | 0 | 0 | 0 | 56 | true |
| armeabi-v7a CtsDeviceIdleHostTestCases | 2 | 0 | 0 | 0 | 2 | true |
| armeabi-v7a CtsDevicePolicyManagerTestCases | 535 | 0 | 0 | 0 | 535 | true |
| armeabi-v7a CtsDexMetadataHostTestCases | 9 | 0 | 0 | 0 | 9 | true |
| armeabi-v7a CtsDisplayTestCases | 22 | 0 | 0 | 0 | 22 | true |
| armeabi-v7a CtsDisplayTestCases[instant] | 14 | 0 | 0 | 0 | 14 | true |
| armeabi-v7a CtsDownloadManagerApi28 | 6 | 0 | 0 | 0 | 6 | true |
| armeabi-v7a CtsDownloadManagerLegacy | 3 | 0 | 0 | 0 | 3 | true |
| armeabi-v7a CtsDpiTestCases | 9 | 0 | 0 | 0 | 9 | true |
| armeabi-v7a CtsDpiTestCases2 | 6 | 0 | 0 | 0 | 6 | true |
| armeabi-v7a CtsDpiTestCases[instant] | 9 | 0 | 0 | 0 | 9 | true |
| armeabi-v7a CtsDreamsTestCases | 3 | 0 | 0 | 0 | 3 | true |
| armeabi-v7a CtsDreamsTestCases[instant] | 3 | 0 | 0 | 0 | 3 | true |
| armeabi-v7a CtsDrmTestCases | 43 | 0 | 0 | 0 | 43 | true |
| armeabi-v7a CtsDrmTestCases[instant] | 42 | 0 | 0 | 0 | 42 | true |
| armeabi-v7a CtsDropBoxManagerTestCases | 5 | 0 | 0 | 0 | 5 | true |
| armeabi-v7a CtsDumpsysHostTestCases | 4 | 0 | 0 | 0 | 4 | true |
| armeabi-v7a CtsDynamicLinkerTestCases | 3 | 0 | 0 | 0 | 3 | true |
| armeabi-v7a CtsDynamicLinkerTestCases[instant] | 3 | 0 | 0 | 0 | 3 | true |
| armeabi-v7a CtsEdiHostTestCases | 3 | 0 | 0 | 0 | 3 | true |
| armeabi-v7a CtsEffectTestCases | 6 | 0 | 0 | 0 | 6 | true |
| armeabi-v7a CtsEffectTestCases[instant] | 6 | 0 | 0 | 0 | 6 | true |
| armeabi-v7a CtsExtendedMockingTestCases | 103 | 0 | 0 | 1 | 104 | true |
| armeabi-v7a CtsExtendedMockingTestCases[instant] | 103 | 0 | 0 | 1 | 104 | true |
| armeabi-v7a CtsExternalServiceTestCases | 11 | 0 | 0 | 0 | 11 | true |
| armeabi-v7a CtsFileSystemTestCases | 5 | 0 | 0 | 0 | 5 | true |
| armeabi-v7a CtsFileSystemTestCases[instant] | 8 | 0 | 0 | 0 | 8 | true |
| armeabi-v7a CtsFragmentTestCases | 155 | 0 | 0 | 0 | 155 | true |
| armeabi-v7a CtsFragmentTestCasesSdk26 | 1 | 0 | 0 | 0 | 1 | true |
| armeabi-v7a CtsFragmentTestCasesSdk26[instant] | 1 | 0 | 0 | 0 | 1 | true |
| armeabi-v7a CtsFragmentTestCases[instant] | 155 | 0 | 0 | 0 | 155 | true |
| armeabi-v7a CtsGestureTestCases | 29 | 0 | 0 | 0 | 29 | true |
| armeabi-v7a CtsGestureTestCases[instant] | 29 | 0 | 0 | 0 | 29 | true |
| armeabi-v7a CtsGpuToolsHostTestCases | 17 | 0 | 0 | 0 | 17 | true |
| armeabi-v7a CtsGraphicsTestCases | 2153 | 0 | 0 | 1 | 2154 | true |
| armeabi-v7a CtsGraphicsTestCases[instant] | 2153 | 0 | 0 | 1 | 2154 | true |
| armeabi-v7a CtsHardwareTestCases | 23 | 0 | 0 | 0 | 23 | true |
| armeabi-v7a CtsHarmfulAppWarningHostTestCases | 1 | 0 | 0 | 0 | 1 | true |
| armeabi-v7a CtsHiddenApiBlacklistApi27TestCases | 4 | 0 | 0 | 0 | 4 | true |
| armeabi-v7a CtsHiddenApiBlacklistApi28TestCases | 4 | 0 | 0 | 0 | 4 | true |
| armeabi-v7a CtsHiddenApiBlacklistCurrentApiTestCases | 4 | 0 | 0 | 0 | 4 | true |
| armeabi-v7a CtsHiddenApiBlacklistDebugClassTestCases | 4 | 0 | 0 | 0 | 4 | true |
| armeabi-v7a CtsHiddenApiKillswitchDebugClassTestCases | 4 | 0 | 0 | 0 | 4 | true |
| armeabi-v7a CtsHiddenApiKillswitchWhitelistTestCases | 4 | 0 | 0 | 0 | 4 | true |
| armeabi-v7a CtsHiddenApiKillswitchWildcardTestCases | 4 | 0 | 0 | 0 | 4 | true |
| armeabi-v7a CtsHostTzDataTests | 24 | 0 | 0 | 0 | 24 | true |
| armeabi-v7a CtsHostsideNetworkTests | 63 | 0 | 0 | 0 | 63 | true |
| armeabi-v7a CtsHostsideNetworkTests[instant] | 63 | 0 | 0 | 0 | 63 | true |
| armeabi-v7a CtsHostsideNumberBlockingTestCases | 1 | 0 | 0 | 0 | 1 | true |
| armeabi-v7a CtsHostsideTvTests | 1 | 0 | 0 | 0 | 1 | true |
| armeabi-v7a CtsHostsideWebViewTests | 6 | 1 | 0 | 0 | 7 | true |
| armeabi-v7a CtsHostsideWebViewTests[instant] | 5 | 1 | 0 | 0 | 6 | true |
| armeabi-v7a CtsIcuTestCases | 4426 | 0 | 4 | 28 | 4458 | true |
| armeabi-v7a CtsIncidentHostTestCases | 47 | 0 | 0 | 0 | 47 | true |
| armeabi-v7a CtsIncidentHostTestCases[instant] | 48 | 0 | 0 | 0 | 48 | true |
| armeabi-v7a CtsInlineMockingTestCases | 64 | 0 | 0 | 1 | 65 | true |
| armeabi-v7a CtsInlineMockingTestCases[instant] | 64 | 0 | 0 | 1 | 65 | true |
| armeabi-v7a CtsInputMethodServiceHostTestCases | 13 | 0 | 2 | 0 | 15 | true |
| armeabi-v7a CtsInputMethodServiceHostTestCases[instant] | 13 | 0 | 2 | 0 | 15 | true |
| armeabi-v7a CtsInputMethodTestCases | 67 | 0 | 3 | 0 | 70 | true |
| armeabi-v7a CtsInputMethodTestCases[instant] | 66 | 0 | 3 | 0 | 69 | true |
| armeabi-v7a CtsIntentSignatureTestCases | 1 | 0 | 0 | 0 | 1 | true |
| armeabi-v7a CtsJdwpSecurityHostTestCases | 1 | 0 | 0 | 0 | 1 | true |
| armeabi-v7a CtsJdwpTestCases | 379 | 0 | 0 | 0 | 379 | true |
| armeabi-v7a CtsJdwpTestCases[instant] | 379 | 0 | 0 | 0 | 379 | true |
| armeabi-v7a CtsJdwpTunnelHostTestCases | 1 | 0 | 0 | 0 | 1 | true |
| armeabi-v7a CtsJniTestCases | 67 | 0 | 0 | 0 | 67 | true |
| armeabi-v7a CtsJniTestCases[instant] | 67 | 0 | 0 | 0 | 67 | true |
| armeabi-v7a CtsJobSchedulerSharedUidTestCases | 13 | 0 | 0 | 0 | 13 | true |
| armeabi-v7a CtsJobSchedulerTestCases | 33 | 4 | 4 | 0 | 41 | true |
| armeabi-v7a CtsJvmtiAttachingHostTestCases | 4 | 0 | 0 | 0 | 4 | true |
| armeabi-v7a CtsJvmtiAttachingTestCases | 28 | 0 | 0 | 0 | 28 | true |
| armeabi-v7a CtsJvmtiRedefineClassesHostTestCases | 1 | 0 | 0 | 0 | 1 | true |
| armeabi-v7a CtsJvmtiRunTest1900HostTestCases | 1 | 0 | 0 | 0 | 1 | true |
| armeabi-v7a CtsJvmtiRunTest1901HostTestCases | 1 | 0 | 0 | 0 | 1 | true |
| armeabi-v7a CtsJvmtiRunTest1902HostTestCases | 1 | 0 | 0 | 0 | 1 | true |
| armeabi-v7a CtsJvmtiRunTest1903HostTestCases | 1 | 0 | 0 | 0 | 1 | true |
| armeabi-v7a CtsJvmtiRunTest1904HostTestCases | 1 | 0 | 0 | 0 | 1 | true |
| armeabi-v7a CtsJvmtiRunTest1906HostTestCases | 1 | 0 | 0 | 0 | 1 | true |
| armeabi-v7a CtsJvmtiRunTest1907HostTestCases | 1 | 0 | 0 | 0 | 1 | true |
| armeabi-v7a CtsJvmtiRunTest1908HostTestCases | 1 | 0 | 0 | 0 | 1 | true |
| armeabi-v7a CtsJvmtiRunTest1909HostTestCases | 1 | 0 | 0 | 0 | 1 | true |
| armeabi-v7a CtsJvmtiRunTest1910HostTestCases | 1 | 0 | 0 | 0 | 1 | true |
| armeabi-v7a CtsJvmtiRunTest1911HostTestCases | 1 | 0 | 0 | 0 | 1 | true |
| armeabi-v7a CtsJvmtiRunTest1912HostTestCases | 1 | 0 | 0 | 0 | 1 | true |
| armeabi-v7a CtsJvmtiRunTest1913HostTestCases | 1 | 0 | 0 | 0 | 1 | true |
| armeabi-v7a CtsJvmtiRunTest1914HostTestCases | 1 | 0 | 0 | 0 | 1 | true |
| armeabi-v7a CtsJvmtiRunTest1915HostTestCases | 1 | 0 | 0 | 0 | 1 | true |
| armeabi-v7a CtsJvmtiRunTest1916HostTestCases | 1 | 0 | 0 | 0 | 1 | true |
| armeabi-v7a CtsJvmtiRunTest1917HostTestCases | 1 | 0 | 0 | 0 | 1 | true |
| armeabi-v7a CtsJvmtiRunTest1920HostTestCases | 1 | 0 | 0 | 0 | 1 | true |
| armeabi-v7a CtsJvmtiRunTest1921HostTestCases | 1 | 0 | 0 | 0 | 1 | true |
| armeabi-v7a CtsJvmtiRunTest1922HostTestCases | 1 | 0 | 0 | 0 | 1 | true |
| armeabi-v7a CtsJvmtiRunTest1923HostTestCases | 1 | 0 | 0 | 0 | 1 | true |
| armeabi-v7a CtsJvmtiRunTest1924HostTestCases | 1 | 0 | 0 | 0 | 1 | true |
| armeabi-v7a CtsJvmtiRunTest1925HostTestCases | 1 | 0 | 0 | 0 | 1 | true |
| armeabi-v7a CtsJvmtiRunTest1926HostTestCases | 1 | 0 | 0 | 0 | 1 | true |
| armeabi-v7a CtsJvmtiRunTest1927HostTestCases | 1 | 0 | 0 | 0 | 1 | true |
| armeabi-v7a CtsJvmtiRunTest1928HostTestCases | 1 | 0 | 0 | 0 | 1 | true |
| armeabi-v7a CtsJvmtiRunTest1930HostTestCases | 1 | 0 | 0 | 0 | 1 | true |
| armeabi-v7a CtsJvmtiRunTest1931HostTestCases | 1 | 0 | 0 | 0 | 1 | true |
| armeabi-v7a CtsJvmtiRunTest1932HostTestCases | 1 | 0 | 0 | 0 | 1 | true |
| armeabi-v7a CtsJvmtiRunTest1933HostTestCases | 1 | 0 | 0 | 0 | 1 | true |
| armeabi-v7a CtsJvmtiRunTest1934HostTestCases | 1 | 0 | 0 | 0 | 1 | true |
| armeabi-v7a CtsJvmtiRunTest1936HostTestCases | 1 | 0 | 0 | 0 | 1 | true |
| armeabi-v7a CtsJvmtiRunTest1937HostTestCases | 1 | 0 | 0 | 0 | 1 | true |
| armeabi-v7a CtsJvmtiRunTest1939HostTestCases | 1 | 0 | 0 | 0 | 1 | true |
| armeabi-v7a CtsJvmtiRunTest1941HostTestCases | 1 | 0 | 0 | 0 | 1 | true |
| armeabi-v7a CtsJvmtiRunTest1942HostTestCases | 1 | 0 | 0 | 0 | 1 | true |
| armeabi-v7a CtsJvmtiRunTest1943HostTestCases | 1 | 0 | 0 | 0 | 1 | true |
| armeabi-v7a CtsJvmtiRunTest1953HostTestCases | 1 | 0 | 0 | 0 | 1 | true |
| armeabi-v7a CtsJvmtiRunTest1958HostTestCases | 1 | 0 | 0 | 0 | 1 | true |
| armeabi-v7a CtsJvmtiRunTest902HostTestCases | 1 | 0 | 0 | 0 | 1 | true |
| armeabi-v7a CtsJvmtiRunTest903HostTestCases | 1 | 0 | 0 | 0 | 1 | true |
| armeabi-v7a CtsJvmtiRunTest904HostTestCases | 1 | 0 | 0 | 0 | 1 | true |
| armeabi-v7a CtsJvmtiRunTest905HostTestCases | 1 | 0 | 0 | 0 | 1 | true |
| armeabi-v7a CtsJvmtiRunTest906HostTestCases | 1 | 0 | 0 | 0 | 1 | true |
| armeabi-v7a CtsJvmtiRunTest907HostTestCases | 1 | 0 | 0 | 0 | 1 | true |
| armeabi-v7a CtsJvmtiRunTest908HostTestCases | 1 | 0 | 0 | 0 | 1 | true |
| armeabi-v7a CtsJvmtiRunTest910HostTestCases | 1 | 0 | 0 | 0 | 1 | true |
| armeabi-v7a CtsJvmtiRunTest911HostTestCases | 1 | 0 | 0 | 0 | 1 | true |
| armeabi-v7a CtsJvmtiRunTest912HostTestCases | 1 | 0 | 0 | 0 | 1 | true |
| armeabi-v7a CtsJvmtiRunTest913HostTestCases | 1 | 0 | 0 | 0 | 1 | true |
| armeabi-v7a CtsJvmtiRunTest914HostTestCases | 1 | 0 | 0 | 0 | 1 | true |
| armeabi-v7a CtsJvmtiRunTest915HostTestCases | 1 | 0 | 0 | 0 | 1 | true |
| armeabi-v7a CtsJvmtiRunTest917HostTestCases | 1 | 0 | 0 | 0 | 1 | true |
| armeabi-v7a CtsJvmtiRunTest918HostTestCases | 1 | 0 | 0 | 0 | 1 | true |
| armeabi-v7a CtsJvmtiRunTest919HostTestCases | 1 | 0 | 0 | 0 | 1 | true |
| armeabi-v7a CtsJvmtiRunTest920HostTestCases | 1 | 0 | 0 | 0 | 1 | true |
| armeabi-v7a CtsJvmtiRunTest922HostTestCases | 1 | 0 | 0 | 0 | 1 | true |
| armeabi-v7a CtsJvmtiRunTest923HostTestCases | 1 | 0 | 0 | 0 | 1 | true |
| armeabi-v7a CtsJvmtiRunTest924HostTestCases | 1 | 0 | 0 | 0 | 1 | true |
| armeabi-v7a CtsJvmtiRunTest926HostTestCases | 1 | 0 | 0 | 0 | 1 | true |
| armeabi-v7a CtsJvmtiRunTest927HostTestCases | 1 | 0 | 0 | 0 | 1 | true |
| armeabi-v7a CtsJvmtiRunTest928HostTestCases | 1 | 0 | 0 | 0 | 1 | true |
| armeabi-v7a CtsJvmtiRunTest930HostTestCases | 1 | 0 | 0 | 0 | 1 | true |
| armeabi-v7a CtsJvmtiRunTest931HostTestCases | 1 | 0 | 0 | 0 | 1 | true |
| armeabi-v7a CtsJvmtiRunTest932HostTestCases | 1 | 0 | 0 | 0 | 1 | true |
| armeabi-v7a CtsJvmtiRunTest940HostTestCases | 1 | 0 | 0 | 0 | 1 | true |
| armeabi-v7a CtsJvmtiRunTest942HostTestCases | 1 | 0 | 0 | 0 | 1 | true |
| armeabi-v7a CtsJvmtiRunTest944HostTestCases | 1 | 0 | 0 | 0 | 1 | true |
| armeabi-v7a CtsJvmtiRunTest945HostTestCases | 1 | 0 | 0 | 0 | 1 | true |
| armeabi-v7a CtsJvmtiRunTest947HostTestCases | 1 | 0 | 0 | 0 | 1 | true |
| armeabi-v7a CtsJvmtiRunTest951HostTestCases | 1 | 0 | 0 | 0 | 1 | true |
| armeabi-v7a CtsJvmtiRunTest982HostTestCases | 1 | 0 | 0 | 0 | 1 | true |
| armeabi-v7a CtsJvmtiRunTest983HostTestCases | 1 | 0 | 0 | 0 | 1 | true |
| armeabi-v7a CtsJvmtiRunTest984HostTestCases | 1 | 0 | 0 | 0 | 1 | true |
| armeabi-v7a CtsJvmtiRunTest985HostTestCases | 1 | 0 | 0 | 0 | 1 | true |
| armeabi-v7a CtsJvmtiRunTest986HostTestCases | 1 | 0 | 0 | 0 | 1 | true |
| armeabi-v7a CtsJvmtiRunTest988HostTestCases | 1 | 0 | 0 | 0 | 1 | true |
| armeabi-v7a CtsJvmtiRunTest989HostTestCases | 1 | 0 | 0 | 0 | 1 | true |
| armeabi-v7a CtsJvmtiRunTest990HostTestCases | 1 | 0 | 0 | 0 | 1 | true |
| armeabi-v7a CtsJvmtiRunTest991HostTestCases | 1 | 0 | 0 | 0 | 1 | true |
| armeabi-v7a CtsJvmtiRunTest992HostTestCases | 1 | 0 | 0 | 0 | 1 | true |
| armeabi-v7a CtsJvmtiRunTest993HostTestCases | 1 | 0 | 0 | 0 | 1 | true |
| armeabi-v7a CtsJvmtiRunTest994HostTestCases | 1 | 0 | 0 | 0 | 1 | true |
| armeabi-v7a CtsJvmtiRunTest995HostTestCases | 1 | 0 | 0 | 0 | 1 | true |
| armeabi-v7a CtsJvmtiRunTest996HostTestCases | 1 | 0 | 0 | 0 | 1 | true |
| armeabi-v7a CtsJvmtiRunTest997HostTestCases | 1 | 0 | 0 | 0 | 1 | true |
| armeabi-v7a CtsJvmtiTaggingHostTestCases | 1 | 0 | 0 | 0 | 1 | true |
| armeabi-v7a CtsJvmtiTrackingHostTestCases | 1 | 0 | 0 | 0 | 1 | true |
| armeabi-v7a CtsKernelConfigTestCases | 5 | 0 | 0 | 0 | 5 | true |
| armeabi-v7a CtsKeystoreTestCases | 1037 | 0 | 0 | 0 | 1037 | true |
| armeabi-v7a CtsLeanbackJankTestCases | 0 | 1 | 0 | 0 | 1 | true |
| armeabi-v7a CtsLegacyNotification20TestCases | 1 | 0 | 0 | 0 | 1 | true |
| armeabi-v7a CtsLegacyNotification27TestCases | 14 | 0 | 0 | 0 | 14 | true |
| armeabi-v7a CtsLegacyNotification28TestCases | 1 | 0 | 0 | 0 | 1 | true |
| armeabi-v7a CtsLegacyNotification29TestCases | 22 | 0 | 0 | 0 | 22 | true |
| armeabi-v7a CtsLibcoreApiEvolutionTestCases | 9 | 0 | 0 | 0 | 9 | true |
| armeabi-v7a CtsLibcoreFileIOTestCases | 18 | 0 | 0 | 0 | 18 | true |
| armeabi-v7a CtsLibcoreJsr166TestCases | 3373 | 0 | 0 | 0 | 3373 | true |
| armeabi-v7a CtsLibcoreLegacy22TestCases | 5 | 0 | 0 | 0 | 5 | true |
| armeabi-v7a CtsLibcoreOjTestCases | 3978 | 1 | 0 | 0 | 3979 | true |
| armeabi-v7a CtsLibcoreOkHttpTestCases | 1968 | 0 | 0 | 19 | 1987 | true |
| armeabi-v7a CtsLibcoreTestCases | 23497 | 2 | 3 | 0 | 23502 | true |
| armeabi-v7a CtsLibcoreWycheproofBCTestCases | 53 | 0 | 0 | 0 | 53 | true |
| armeabi-v7a CtsLibcoreWycheproofConscryptTestCases | 41 | 0 | 0 | 0 | 41 | true |
| armeabi-v7a CtsLiblogTestCases | 76 | 0 | 0 | 0 | 76 | true |
| armeabi-v7a CtsLocation2TestCases | 9 | 0 | 0 | 0 | 9 | true |
| armeabi-v7a CtsLocation2TestCases[instant] | 10 | 0 | 0 | 0 | 10 | true |
| armeabi-v7a CtsLocationTestCases | 140 | 0 | 0 | 0 | 140 | true |
| armeabi-v7a CtsLocationTestCases[instant] | 131 | 0 | 0 | 0 | 131 | true |
| armeabi-v7a CtsLogdTestCases | 13 | 0 | 0 | 0 | 13 | true |
| armeabi-v7a CtsMediaBitstreamsTestCases | 4541 | 0 | 0 | 0 | 4541 | true |
| armeabi-v7a CtsMediaHostTestCases | 4 | 0 | 0 | 0 | 4 | true |
| armeabi-v7a CtsMediaHostTestCases[instant] | 4 | 0 | 0 | 0 | 4 | true |
| armeabi-v7a CtsMediaStressTestCases | 120 | 0 | 0 | 0 | 120 | true |
| armeabi-v7a CtsMediaTestCases | 2328 | 0 | 0 | 0 | 2328 | true |
| armeabi-v7a CtsMediaTestCases[instant] | 600 | 0 | 0 | 0 | 600 | true |
| armeabi-v7a CtsMidiTestCases | 7 | 0 | 0 | 0 | 7 | true |
| armeabi-v7a CtsMockingDebuggableTestCases | 29 | 0 | 0 | 1 | 30 | true |
| armeabi-v7a CtsMockingDebuggableTestCases[instant] | 29 | 0 | 0 | 1 | 30 | true |
| armeabi-v7a CtsMockingTestCases | 28 | 0 | 1 | 1 | 30 | true |
| armeabi-v7a CtsMockingTestCases[instant] | 28 | 0 | 1 | 1 | 30 | true |
| armeabi-v7a CtsMonkeyTestCases | 10 | 0 | 0 | 0 | 10 | true |
| armeabi-v7a CtsMultiUserHostTestCases | 10 | 0 | 0 | 0 | 10 | true |
| armeabi-v7a CtsMultiUserHostTestCases[instant] | 10 | 0 | 0 | 0 | 10 | true |
| armeabi-v7a CtsMultiUserTestCases | 1 | 0 | 0 | 0 | 1 | true |
| armeabi-v7a CtsMultiUserTestCases[instant] | 1 | 0 | 0 | 0 | 1 | true |
| armeabi-v7a CtsNNAPIBenchmarkTestCases | 14 | 0 | 0 | 0 | 14 | true |
| armeabi-v7a CtsNNAPIBenchmarkTestCases[instant] | 14 | 0 | 0 | 0 | 14 | true |
| armeabi-v7a CtsNNAPITestCases | 16957 | 0 | 0 | 0 | 16957 | true |
| armeabi-v7a CtsNativeHardwareTestCases | 328 | 0 | 0 | 0 | 328 | true |
| armeabi-v7a CtsNativeMediaAAudioTestCases | 122 | 0 | 0 | 0 | 122 | true |
| armeabi-v7a CtsNativeMediaAAudioTestCases[instant] | 122 | 0 | 0 | 0 | 122 | true |
| armeabi-v7a CtsNativeMediaSlTestCases | 10 | 0 | 0 | 0 | 10 | true |
| armeabi-v7a CtsNativeMediaSlTestCases[instant] | 10 | 0 | 0 | 0 | 10 | true |
| armeabi-v7a CtsNativeMediaXaTestCases | 2 | 0 | 0 | 0 | 2 | true |
| armeabi-v7a CtsNativeMediaXaTestCases[instant] | 2 | 0 | 0 | 0 | 2 | true |
| armeabi-v7a CtsNativeMidiTestCases | 9 | 0 | 0 | 0 | 9 | true |
| armeabi-v7a CtsNativeNetDnsTestCases | 6 | 0 | 0 | 0 | 6 | true |
| armeabi-v7a CtsNativeNetDnsTestCases[instant] | 6 | 0 | 0 | 0 | 6 | true |
| armeabi-v7a CtsNativeNetTestCases | 3 | 0 | 0 | 0 | 3 | true |
| armeabi-v7a CtsNativeNetTestCases[instant] | 3 | 0 | 0 | 0 | 3 | true |
| armeabi-v7a CtsNdefTestCases | 11 | 0 | 0 | 0 | 11 | true |
| armeabi-v7a CtsNdkBinderTestCases | 275 | 0 | 0 | 0 | 275 | true |
| armeabi-v7a CtsNdkBinderTestCases[instant] | 275 | 0 | 0 | 0 | 275 | true |
| armeabi-v7a CtsNetApi23TestCases | 0 | 3 | 0 | 0 | 3 | true |
| armeabi-v7a CtsNetSecConfigAttributeTestCases | 1 | 0 | 0 | 0 | 1 | true |
| armeabi-v7a CtsNetSecConfigAttributeTestCases[instant] | 1 | 0 | 0 | 0 | 1 | true |
| armeabi-v7a CtsNetSecConfigBasicDebugDisabledTestCases | 1 | 0 | 0 | 0 | 1 | true |
| armeabi-v7a CtsNetSecConfigBasicDebugDisabledTestCases[instant] | 1 | 0 | 0 | 0 | 1 | true |
| armeabi-v7a CtsNetSecConfigBasicDebugEnabledTestCases | 1 | 0 | 0 | 0 | 1 | true |
| armeabi-v7a CtsNetSecConfigBasicDebugEnabledTestCases[instant] | 1 | 0 | 0 | 0 | 1 | true |
| armeabi-v7a CtsNetSecConfigBasicDomainConfigTestCases | 3 | 0 | 0 | 0 | 3 | true |
| armeabi-v7a CtsNetSecConfigBasicDomainConfigTestCases[instant] | 3 | 0 | 0 | 0 | 3 | true |
| armeabi-v7a CtsNetSecConfigCleartextTrafficTestCases | 3 | 0 | 0 | 0 | 3 | true |
| armeabi-v7a CtsNetSecConfigCleartextTrafficTestCases[instant] | 3 | 0 | 0 | 0 | 3 | true |
| armeabi-v7a CtsNetSecConfigDownloadManagerTestCases | 3 | 0 | 0 | 0 | 3 | true |
| armeabi-v7a CtsNetSecConfigInvalidPinTestCases | 2 | 0 | 0 | 0 | 2 | true |
| armeabi-v7a CtsNetSecConfigInvalidPinTestCases[instant] | 2 | 0 | 0 | 0 | 2 | true |
| armeabi-v7a CtsNetSecConfigNestedDomainConfigTestCases | 2 | 0 | 0 | 0 | 2 | true |
| armeabi-v7a CtsNetSecConfigNestedDomainConfigTestCases[instant] | 2 | 0 | 0 | 0 | 2 | true |
| armeabi-v7a CtsNetSecConfigPrePCleartextTrafficTestCases | 3 | 0 | 0 | 0 | 3 | true |
| armeabi-v7a CtsNetSecConfigResourcesSrcTestCases | 5 | 0 | 0 | 0 | 5 | true |
| armeabi-v7a CtsNetSecConfigResourcesSrcTestCases[instant] | 5 | 0 | 0 | 0 | 5 | true |
| armeabi-v7a CtsNetSecPolicyUsesCleartextTrafficFalseTestCases | 6 | 0 | 0 | 0 | 6 | true |
| armeabi-v7a CtsNetSecPolicyUsesCleartextTrafficTrueTestCases | 6 | 0 | 0 | 0 | 6 | true |
| armeabi-v7a CtsNetSecPolicyUsesCleartextTrafficUnspecifiedTestCases | 6 | 0 | 0 | 0 | 6 | true |
| armeabi-v7a CtsNetTestCases | 466 | 33 | 0 | 0 | 499 | true |
| armeabi-v7a CtsNetTestCasesInternetPermission | 1 | 0 | 0 | 0 | 1 | true |
| armeabi-v7a CtsNetTestCasesInternetPermission[instant] | 1 | 0 | 0 | 0 | 1 | true |
| armeabi-v7a CtsNetTestCasesLegacyApi22 | 3 | 0 | 0 | 0 | 3 | true |
| armeabi-v7a CtsNetTestCasesLegacyPermission22 | 3 | 0 | 0 | 0 | 3 | true |
| armeabi-v7a CtsNetTestCasesUpdateStatsPermission | 2 | 0 | 0 | 0 | 2 | true |
| armeabi-v7a CtsNetTestCasesUpdateStatsPermission[instant] | 2 | 0 | 0 | 0 | 2 | true |
| armeabi-v7a CtsNetTestCases[instant] | 285 | 0 | 0 | 0 | 285 | true |
| armeabi-v7a CtsNoPermissionTestCases | 2 | 0 | 0 | 0 | 2 | true |
| armeabi-v7a CtsNoPermissionTestCases25 | 2 | 0 | 0 | 0 | 2 | true |
| armeabi-v7a CtsOmapiTestCases | 12 | 0 | 0 | 0 | 12 | true |
| armeabi-v7a CtsOpenGLTestCases | 57 | 0 | 0 | 1 | 58 | true |
| armeabi-v7a CtsOpenGlPerf2TestCases | 9 | 0 | 0 | 0 | 9 | true |
| armeabi-v7a CtsOpenGlPerfTestCases | 4 | 0 | 0 | 0 | 4 | true |
| armeabi-v7a CtsOsHostTestCases | 23 | 0 | 0 | 1 | 24 | true |
| armeabi-v7a CtsOsHostTestCases[instant] | 21 | 0 | 0 | 1 | 22 | true |
| armeabi-v7a CtsOsTestCases | 550 | 0 | 0 | 0 | 550 | true |
| armeabi-v7a CtsOsTestCases[instant] | 532 | 0 | 0 | 0 | 532 | true |
| armeabi-v7a CtsPackageInstallTestCases | 16 | 0 | 0 | 0 | 16 | true |
| armeabi-v7a CtsPackageInstallTestCases[instant] | 4 | 0 | 0 | 0 | 4 | true |
| armeabi-v7a CtsPackageInstallerTapjackingTestCases | 1 | 0 | 0 | 0 | 1 | true |
| armeabi-v7a CtsPackageUninstallTestCases | 1 | 0 | 0 | 0 | 1 | true |
| armeabi-v7a CtsPdfTestCases | 5241 | 0 | 0 | 0 | 5241 | true |
| armeabi-v7a CtsPdfTestCases[instant] | 5241 | 0 | 0 | 0 | 5241 | true |
| armeabi-v7a CtsPerfettoTestCases | 24 | 0 | 0 | 0 | 24 | true |
| armeabi-v7a CtsPermission2TestCases | 94 | 0 | 0 | 0 | 94 | true |
| armeabi-v7a CtsPermission2TestCases[instant] | 22 | 0 | 0 | 0 | 22 | true |
| armeabi-v7a CtsPermissionTestCases | 224 | 0 | 12 | 0 | 236 | true |
| armeabi-v7a CtsPermissionTestCasesSdk28 | 1 | 0 | 0 | 0 | 1 | true |
| armeabi-v7a CtsPermissionTestCasesSdk28[instant] | 1 | 0 | 0 | 0 | 1 | true |
| armeabi-v7a CtsPermissionTestCasesTelephony | 10 | 0 | 0 | 0 | 10 | true |
| armeabi-v7a CtsPermissionTestCasesTelephony[instant] | 10 | 0 | 0 | 0 | 10 | true |
| armeabi-v7a CtsPermissionTestCases[instant] | 118 | 0 | 6 | 0 | 124 | true |
| armeabi-v7a CtsPreferenceTestCases | 131 | 0 | 12 | 0 | 143 | true |
| armeabi-v7a CtsPreferenceTestCases[instant] | 131 | 0 | 12 | 0 | 143 | true |
| armeabi-v7a CtsPrintTestCases | 21 | 0 | 350 | 0 | 371 | true |
| armeabi-v7a CtsPrintTestCases[instant] | 21 | 0 | 338 | 0 | 359 | true |
| armeabi-v7a CtsProtoTestCases | 156 | 0 | 0 | 0 | 156 | true |
| armeabi-v7a CtsProtoTestCases[instant] | 156 | 0 | 0 | 0 | 156 | true |
| armeabi-v7a CtsProviderTestCases | 500 | 0 | 20 | 0 | 520 | true |
| armeabi-v7a CtsProviderUiTestCases | 4 | 0 | 0 | 0 | 4 | true |
| armeabi-v7a CtsRenderscriptLegacyTestCases | 11 | 0 | 0 | 0 | 11 | true |
| armeabi-v7a CtsRenderscriptTestCases | 744 | 0 | 0 | 0 | 744 | true |
| armeabi-v7a CtsRenderscriptTestCases[instant] | 744 | 0 | 0 | 0 | 744 | true |
| armeabi-v7a CtsResolverServiceTestCases | 2 | 0 | 0 | 0 | 2 | true |
| armeabi-v7a CtsRoleTestCases | 30 | 0 | 4 | 0 | 34 | true |
| armeabi-v7a CtsRollbackManagerHostTestCases | 1 | 0 | 3 | 0 | 4 | true |
| armeabi-v7a CtsRsBlasTestCases | 198 | 0 | 0 | 0 | 198 | true |
| armeabi-v7a CtsRsCppTestCases | 123 | 0 | 0 | 0 | 123 | true |
| armeabi-v7a CtsSampleDeviceTestCases | 6 | 0 | 0 | 0 | 6 | true |
| armeabi-v7a CtsSampleDeviceTestCases[instant] | 6 | 0 | 0 | 0 | 6 | true |
| armeabi-v7a CtsSampleHostTestCases | 6 | 0 | 1 | 0 | 7 | true |
| armeabi-v7a CtsSaxTestCases | 2 | 0 | 0 | 0 | 2 | true |
| armeabi-v7a CtsSeccompHostTestCases | 3 | 0 | 0 | 0 | 3 | true |
| armeabi-v7a CtsSeccompHostTestCases[instant] | 3 | 0 | 0 | 0 | 3 | true |
| armeabi-v7a CtsSecureElementAccessControlTestCases1 | 6 | 0 | 0 | 0 | 6 | true |
| armeabi-v7a CtsSecureElementAccessControlTestCases2 | 6 | 0 | 0 | 0 | 6 | true |
| armeabi-v7a CtsSecureElementAccessControlTestCases3 | 5 | 0 | 0 | 0 | 5 | true |
| armeabi-v7a CtsSecurityBulletinHostTestCases | 0 | 0 | 0 | 0 | 0 | true |
| armeabi-v7a CtsSecurityHostTestCases | 963 | 0 | 0 | 0 | 963 | true |
| armeabi-v7a CtsSecurityTestCases | 19 | 0 | 0 | 0 | 19 | true |
| armeabi-v7a CtsSecurityTestCases[instant] | 18 | 0 | 0 | 0 | 18 | true |
| armeabi-v7a CtsSelinuxEphemeralTestCases | 0 | 0 | 0 | 0 | 0 | true |
| armeabi-v7a CtsSelinuxEphemeralTestCases[instant] | 4 | 0 | 0 | 0 | 4 | true |
| armeabi-v7a CtsSelinuxTargetSdk25TestCases | 5 | 0 | 0 | 0 | 5 | true |
| armeabi-v7a CtsSelinuxTargetSdk27TestCases | 5 | 0 | 0 | 0 | 5 | true |
| armeabi-v7a CtsSelinuxTargetSdk28TestCases | 5 | 0 | 0 | 0 | 5 | true |
| armeabi-v7a CtsSelinuxTargetSdkCurrentTestCases | 5 | 0 | 0 | 0 | 5 | true |
| armeabi-v7a CtsSensorTestCases | 296 | 0 | 0 | 0 | 296 | true |
| armeabi-v7a CtsSensorTestCases[instant] | 317 | 0 | 0 | 0 | 317 | true |
| armeabi-v7a CtsSharedLibsApiSignatureTestCases | 1 | 0 | 0 | 0 | 1 | true |
| armeabi-v7a CtsShortcutHostTestCases | 12 | 0 | 0 | 0 | 12 | true |
| armeabi-v7a CtsShortcutManagerTestCases | 62 | 0 | 0 | 0 | 62 | true |
| armeabi-v7a CtsSignedConfigHostTestCases | 13 | 0 | 1 | 0 | 14 | true |
| armeabi-v7a CtsSimRestrictedApisTestCases | 19 | 0 | 0 | 0 | 19 | true |
| armeabi-v7a CtsSimpleCpuTestCases | 8 | 0 | 0 | 0 | 8 | true |
| armeabi-v7a CtsSimpleperfTestCases | 235 | 0 | 0 | 0 | 235 | true |
| armeabi-v7a CtsSkQPTestCases | 1612 | 0 | 0 | 0 | 1612 | true |
| armeabi-v7a CtsSliceTestCases | 41 | 0 | 0 | 0 | 41 | true |
| armeabi-v7a CtsSpeechTestCases | 6 | 0 | 0 | 0 | 6 | true |
| armeabi-v7a CtsStagedInstallHostTestCases | 15 | 0 | 19 | 0 | 34 | true |
| armeabi-v7a CtsStatsdHostTestCases | 104 | 3 | 0 | 0 | 107 | true |
| armeabi-v7a CtsStatsdHostTestCases[instant] | 104 | 3 | 0 | 0 | 107 | true |
| armeabi-v7a CtsSustainedPerformanceHostTestCases | 1 | 0 | 0 | 0 | 1 | true |
| armeabi-v7a CtsSyncAccountAccessOtherCertTestCases | 0 | 0 | 1 | 0 | 1 | true |
| armeabi-v7a CtsSyncContentHostTestCases | 0 | 0 | 0 | 0 | 0 | true |
| armeabi-v7a CtsSyncManagerTestsCases | 3 | 0 | 0 | 0 | 3 | true |
| armeabi-v7a CtsSystemApiAnnotationTestCases | 1 | 0 | 0 | 0 | 1 | true |
| armeabi-v7a CtsSystemApiSignatureTestCases | 1 | 0 | 0 | 0 | 1 | true |
| armeabi-v7a CtsSystemIntentTestCases | 1 | 0 | 0 | 0 | 1 | true |
| armeabi-v7a CtsSystemUiHostTestCases | 11 | 0 | 0 | 0 | 11 | true |
| armeabi-v7a CtsSystemUiHostTestCases[instant] | 11 | 0 | 0 | 0 | 11 | true |
| armeabi-v7a CtsSystemUiTestCases | 1 | 0 | 13 | 0 | 14 | true |
| armeabi-v7a CtsSystemUiTestCases[instant] | 1 | 0 | 12 | 0 | 13 | true |
| armeabi-v7a CtsTelecomTestCases | 268 | 0 | 0 | 0 | 268 | true |
| armeabi-v7a CtsTelecomTestCases2 | 8 | 0 | 0 | 0 | 8 | true |
| armeabi-v7a CtsTelecomTestCases3 | 3 | 0 | 0 | 0 | 3 | true |
| armeabi-v7a CtsTelephony2TestCases | 1 | 0 | 0 | 0 | 1 | true |
| armeabi-v7a CtsTelephony2TestCases[instant] | 1 | 0 | 0 | 0 | 1 | true |
| armeabi-v7a CtsTelephony3TestCases | 1 | 0 | 0 | 0 | 1 | true |
| armeabi-v7a CtsTelephonyProviderTestCases | 0 | 0 | 9 | 0 | 9 | true |
| armeabi-v7a CtsTelephonySdk28TestCases | 3 | 0 | 0 | 0 | 3 | true |
| armeabi-v7a CtsTelephonyTestCases | 271 | 0 | 0 | 1 | 272 | true |
| armeabi-v7a CtsTextTestCases | 1211 | 0 | 4 | 0 | 1215 | true |
| armeabi-v7a CtsTextTestCases[instant] | 1211 | 0 | 4 | 0 | 1215 | true |
| armeabi-v7a CtsTfliteNnapiDelegateTestCases | 64 | 0 | 0 | 0 | 64 | true |
| armeabi-v7a CtsThemeDeviceTestCases | 25 | 0 | 0 | 0 | 25 | true |
| armeabi-v7a CtsThemeHostTestCases | 1 | 0 | 0 | 0 | 1 | true |
| armeabi-v7a CtsToastLegacyTestCases | 8 | 0 | 0 | 0 | 8 | true |
| armeabi-v7a CtsToastTestCases | 3 | 0 | 0 | 0 | 3 | true |
| armeabi-v7a CtsToastTestCases[instant] | 3 | 0 | 0 | 0 | 3 | true |
| armeabi-v7a CtsTransitionTestCases | 121 | 0 | 0 | 0 | 121 | true |
| armeabi-v7a CtsTrustedVoiceHostTestCases | 1 | 0 | 0 | 0 | 1 | true |
| armeabi-v7a CtsTvProviderTestCases | 2 | 0 | 0 | 0 | 2 | true |
| armeabi-v7a CtsTvTestCases | 75 | 0 | 0 | 0 | 75 | true |
| armeabi-v7a CtsUiAutomationTestCases | 11 | 0 | 0 | 0 | 11 | true |
| armeabi-v7a CtsUiAutomationTestCases[instant] | 5 | 0 | 0 | 0 | 5 | true |
| armeabi-v7a CtsUiRenderingTestCases | 378 | 0 | 0 | 1 | 379 | true |
| armeabi-v7a CtsUiRenderingTestCases27 | 2 | 0 | 0 | 0 | 2 | true |
| armeabi-v7a CtsUiRenderingTestCases27[instant] | 2 | 0 | 0 | 0 | 2 | true |
| armeabi-v7a CtsUiRenderingTestCases[instant] | 378 | 0 | 0 | 1 | 379 | true |
| armeabi-v7a CtsUidIsolationTestCases | 2 | 0 | 0 | 0 | 2 | true |
| armeabi-v7a CtsUidIsolationTestCases[instant] | 2 | 0 | 0 | 0 | 2 | true |
| armeabi-v7a CtsUsageStatsTestCases | 36 | 8 | 1 | 1 | 46 | true |
| armeabi-v7a CtsUsageStatsTestCases[instant] | 17 | 0 | 0 | 1 | 18 | true |
| armeabi-v7a CtsUsbTests | 1 | 0 | 0 | 0 | 1 | true |
| armeabi-v7a CtsUsbTests[instant] | 1 | 0 | 0 | 0 | 1 | true |
| armeabi-v7a CtsUsesLibraryHostTestCases | 3 | 0 | 0 | 0 | 3 | true |
| armeabi-v7a CtsUtilTestCases | 292 | 0 | 0 | 0 | 292 | true |
| armeabi-v7a CtsUtilTestCases[instant] | 292 | 0 | 0 | 0 | 292 | true |
| armeabi-v7a CtsVideoTestCases | 363 | 0 | 0 | 0 | 363 | true |
| armeabi-v7a CtsViewInspectorAnnotationProcessorTestCases | 16 | 0 | 0 | 0 | 16 | true |
| armeabi-v7a CtsViewInspectorAnnotationProcessorTestCases[instant] | 16 | 0 | 0 | 0 | 16 | true |
| armeabi-v7a CtsViewTestCases | 1095 | 1 | 4 | 4 | 1104 | true |
| armeabi-v7a CtsViewTestCasesSdk28 | 1 | 0 | 0 | 0 | 1 | true |
| armeabi-v7a CtsViewTestCasesSdk28[instant] | 1 | 0 | 0 | 0 | 1 | true |
| armeabi-v7a CtsVoiceInteractionTestCases | 6 | 0 | 0 | 0 | 6 | true |
| armeabi-v7a CtsVoiceInteractionTestCases[instant] | 2 | 0 | 0 | 0 | 2 | true |
| armeabi-v7a CtsVoiceSettingsTestCases | 3 | 0 | 0 | 0 | 3 | true |
| armeabi-v7a CtsVoiceSettingsTestCases[instant] | 3 | 0 | 0 | 0 | 3 | true |
| armeabi-v7a CtsVrTestCases | 16 | 0 | 0 | 0 | 16 | true |
| armeabi-v7a CtsWebkitTestCases | 272 | 0 | 0 | 0 | 272 | true |
| armeabi-v7a CtsWebkitTestCases[instant] | 60 | 0 | 0 | 0 | 60 | true |
| armeabi-v7a CtsWidgetTestCases | 2706 | 0 | 0 | 0 | 2706 | true |
| armeabi-v7a CtsWidgetTestCases[instant] | 2580 | 0 | 0 | 0 | 2580 | true |
| armeabi-v7a CtsWifiBroadcastsHostTestCases | 1 | 0 | 0 | 0 | 1 | true |
| armeabi-v7a CtsWifiBroadcastsHostTestCases[instant] | 1 | 0 | 0 | 0 | 1 | true |
| armeabi-v7a CtsWindowManagerDeviceTestCases | 452 | 0 | 204 | 10 | 666 | true |
| armeabi-v7a CtsWindowManagerSdk25TestCases | 1 | 0 | 0 | 0 | 1 | true |
| armeabi-v7a CtsWindowManagerSdk28TestCases | 0 | 0 | 1 | 0 | 1 | true |
| armeabi-v7a CtsWrapNoWrapTestCases | 1 | 0 | 0 | 0 | 1 | true |
| armeabi-v7a CtsWrapWrapDebugMallocDebugTestCases | 1 | 0 | 0 | 0 | 1 | true |
| armeabi-v7a CtsWrapWrapDebugTestCases | 1 | 0 | 0 | 0 | 1 | true |
| armeabi-v7a CtsWrapWrapNoDebugTestCases | 1 | 0 | 0 | 0 | 1 | true |
| armeabi-v7a cts-shared-libs-all.api | 1 | 0 | 0 | 0 | 1 | true |
| armeabi-v7a cts-system-all.api | 1 | 0 | 0 | 0 | 1 | true |
| armeabi-v7a signed-CtsSecureElementAccessControlTestCases1 | 6 | 0 | 0 | 0 | 6 | true |
| armeabi-v7a signed-CtsSecureElementAccessControlTestCases2 | 6 | 0 | 0 | 0 | 6 | true |
| armeabi-v7a signed-CtsSecureElementAccessControlTestCases3 | 5 | 0 | 0 | 0 | 5 | true |
| armeabi-v7a vm-tests-tf | 3126 | 0 | 0 | 0 | 3126 | true |
| armeabi-v7a CtsAppTestCases | ||
| Test | Result | Details |
|---|---|---|
| android.app.cts.SystemFeaturesTest#testWifiFeature |
fail
|
java.lang.AssertionError: expected:<true> but was:<false>
|
| armeabi-v7a CtsAppTestCases[instant] | ||
| Test | Result | Details |
|---|---|---|
| android.app.cts.SystemFeaturesTest#testWifiFeature |
fail
|
java.lang.AssertionError: expected:<true> but was:<false>
|
| armeabi-v7a CtsHostsideWebViewTests | ||
| Test | Result | Details |
|---|---|---|
| com.android.cts.webkit.WebViewHostSideStartupTest#testStrictMode |
fail
|
junit.framework.AssertionFailedError: java.lang.RuntimeException: StrictMode ThreadPolicy violation
|
| armeabi-v7a CtsHostsideWebViewTests[instant] | ||
| Test | Result | Details |
|---|---|---|
| com.android.cts.webkit.WebViewHostSideStartupTest#testStrictMode |
fail
|
junit.framework.AssertionFailedError: java.lang.RuntimeException: StrictMode ThreadPolicy violation
|
| armeabi-v7a CtsJobSchedulerTestCases | ||
| Test | Result | Details |
|---|---|---|
| android.jobscheduler.cts.ConnectivityConstraintTest#testConnectivityConstraintExecutes_withWifi |
fail
|
junit.framework.AssertionFailedError: Wifi must be configured to connect to an access point for this test.
|
| android.jobscheduler.cts.ConnectivityConstraintTest#testConnectivityConstraintExecutes_withWifi_DataSaverOn |
fail
|
junit.framework.AssertionFailedError: Wifi must be configured to connect to an access point for this test.
|
| android.jobscheduler.cts.ConnectivityConstraintTest#testUnmeteredConstraintExecutes_withWifi |
fail
|
junit.framework.AssertionFailedError: Wifi must be configured to connect to an access point for this test.
|
| android.jobscheduler.cts.JobThrottlingTest#testBackgroundConnectivityJobsThrottled |
fail
|
junit.framework.AssertionFailedError: Wifi must be configured to connect to an access point for this test.
|
| armeabi-v7a CtsLeanbackJankTestCases | ||
| Test | Result | Details |
|---|---|---|
| android.leanbackjank.cts.CtsDeviceLeanback#testScrollingByTimer |
fail
|
junit.framework.AssertionFailedError: Too few frames received. Monitor: GfxMonitorImpl, Expected: 100, Received: 63.
|
| armeabi-v7a CtsLibcoreOjTestCases | ||
| Test | Result | Details |
|---|---|---|
| test.java.security.cert.AKISerialNumberTest#main |
fail
|
sun.security.provider.certpath.SunCertPathBuilderException: unable to find valid certification path to requested target
|
| armeabi-v7a CtsLibcoreTestCases | ||
| Test | Result | Details |
|---|---|---|
| libcore.java.net.InetAddressTest#test_isReachable_by_ICMP |
fail
|
java.lang.AssertionError
|
| libcore.java.security.cert.X509CertificateTest#test_Provider |
fail
|
java.lang.Exception: Errors encountered:
|
| armeabi-v7a CtsNetApi23TestCases | ||
| Test | Result | Details |
|---|---|---|
| android.net.cts.api23test.ConnectivityManagerApi23Test#testConnectivityChanged_manifestRequestOnlyPreN_shouldReceiveIntent |
fail
|
java.lang.AssertionError
|
| android.net.cts.api23test.ConnectivityManagerApi23Test#testConnectivityChanged_manifestRequestOnly_shouldNotReceiveIntent |
fail
|
java.lang.AssertionError
|
| android.net.cts.api23test.ConnectivityManagerApi23Test#testConnectivityChanged_whenRegistered_shouldReceiveIntent |
fail
|
java.lang.AssertionError
|
| armeabi-v7a CtsNetTestCases | ||
| Test | Result | Details |
|---|---|---|
| android.net.cts.ConnectivityManagerTest#testCreateTcpKeepalive |
fail
|
java.lang.AssertionError
|
| android.net.cts.ConnectivityManagerTest#testGetMultipathPreference |
fail
|
java.lang.AssertionError
|
| android.net.cts.ConnectivityManagerTest#testKeepaliveWifiUnsupported |
fail
|
java.lang.AssertionError
|
| android.net.cts.ConnectivityManagerTest#testRegisterNetworkCallback |
fail
|
java.lang.AssertionError
|
| android.net.cts.ConnectivityManagerTest#testRegisterNetworkCallback_withPendingIntent |
fail
|
java.lang.AssertionError
|
| android.net.cts.ConnectivityManagerTest#testRestrictedNetworks |
fail
|
junit.framework.AssertionFailedError: No exception thrown when restricted network requested.
|
| android.net.cts.ConnectivityManagerTest#testSocketKeepaliveLimitWifi |
fail
|
java.lang.AssertionError
|
| android.net.cts.ConnectivityManagerTest#testSocketKeepaliveUnprivileged |
fail
|
java.lang.AssertionError
|
| android.net.wifi.cts.ScanResultTest#testScanResultMatchesWifiInfo |
fail
|
junit.framework.AssertionFailedError
|
| android.net.wifi.cts.ScanResultTest#testScanResultProperties |
fail
|
junit.framework.AssertionFailedError
|
| android.net.wifi.cts.ScanResultTest#testScanResultTimeStamp |
fail
|
junit.framework.AssertionFailedError
|
| android.net.wifi.cts.WifiEnterpriseConfigTest#testEnterpriseConfigDoesNotPrintPassword |
fail
|
junit.framework.AssertionFailedError
|
| android.net.wifi.cts.WifiEnterpriseConfigTest#testSettersAndGetters |
fail
|
junit.framework.AssertionFailedError
|
| android.net.wifi.cts.WifiInfoTest#testWifiInfoProperties |
fail
|
junit.framework.AssertionFailedError
|
| android.net.wifi.cts.WifiManagerTest#testDeprecatedApis |
fail
|
junit.framework.AssertionFailedError
|
| android.net.wifi.cts.WifiManagerTest#testMaxNumberOfNetworkSuggestionsPerApp |
fail
|
junit.framework.AssertionFailedError
|
| android.net.wifi.cts.WifiManagerTest#testNetworkCarrierProvisioningPermission |
fail
|
junit.framework.AssertionFailedError
|
| android.net.wifi.cts.WifiManagerTest#testNetworkManagedProvisioningPermission |
fail
|
junit.framework.AssertionFailedError
|
| android.net.wifi.cts.WifiManagerTest#testNetworkSettingsPermission |
fail
|
junit.framework.AssertionFailedError
|
| android.net.wifi.cts.WifiManagerTest#testNetworkSetupWizardPermission |
fail
|
junit.framework.AssertionFailedError
|
| android.net.wifi.cts.WifiManagerTest#testNetworkStackPermission |
fail
|
junit.framework.AssertionFailedError
|
| android.net.wifi.cts.WifiManagerTest#testScreenOffDoesNotTurnOffWifiScanningWhenWifiDisabled |
fail
|
junit.framework.AssertionFailedError
|
| android.net.wifi.cts.WifiManagerTest#testScreenOffDoesNotTurnOffWifiScanningWhenWifiEnabled |
fail
|
junit.framework.AssertionFailedError
|
| android.net.wifi.cts.WifiManagerTest#testSignal |
fail
|
junit.framework.AssertionFailedError
|
| android.net.wifi.cts.WifiManagerTest#testStartLocalOnlyHotspotSingleRequestByApps |
fail
|
junit.framework.AssertionFailedError
|
| android.net.wifi.cts.WifiManagerTest#testStartLocalOnlyHotspotSuccess |
fail
|
junit.framework.AssertionFailedError
|
| android.net.wifi.cts.WifiManagerTest#testUpdateWifiUsabilityStatsScorePermission |
fail
|
junit.framework.AssertionFailedError
|
| android.net.wifi.cts.WifiManagerTest#testWifiManagerLock |
fail
|
junit.framework.AssertionFailedError
|
| android.net.wifi.cts.WifiManagerTest#testWifiManagerProperties |
fail
|
junit.framework.AssertionFailedError
|
| android.net.wifi.cts.WifiManagerTest#testWifiManagerScanWhenWifiOffLocationTurnedOn |
fail
|
junit.framework.AssertionFailedError
|
| android.net.wifi.cts.WifiManagerTest#testWifiScanTimestamp |
fail
|
junit.framework.AssertionFailedError
|
| android.net.wifi.cts.WifiManagerTest#testWifiSetDeviceMobilityStatePermission |
fail
|
junit.framework.AssertionFailedError
|
| android.net.wifi.cts.WifiManagerTest#testWifiWatchdog |
fail
|
junit.framework.AssertionFailedError
|
| armeabi-v7a CtsStatsdHostTestCases | ||
| Test | Result | Details |
|---|---|---|
| android.cts.statsd.atom.UidAtomTests#testWifiLockHighPerf |
fail
|
junit.framework.AssertionFailedError: Too few states found (0)
|
| android.cts.statsd.atom.UidAtomTests#testWifiLockLowLatency |
fail
|
junit.framework.AssertionFailedError: Too few states found (0)
|
| android.cts.statsd.atom.UidAtomTests#testWifiScan |
fail
|
junit.framework.AssertionFailedError: data.size() [0] should be >= 2
|
| armeabi-v7a CtsStatsdHostTestCases[instant] | ||
| Test | Result | Details |
|---|---|---|
| android.cts.statsd.atom.UidAtomTests#testWifiLockHighPerf |
fail
|
junit.framework.AssertionFailedError: Too few states found (0)
|
| android.cts.statsd.atom.UidAtomTests#testWifiLockLowLatency |
fail
|
junit.framework.AssertionFailedError: Too few states found (0)
|
| android.cts.statsd.atom.UidAtomTests#testWifiScan |
fail
|
junit.framework.AssertionFailedError: data.size() [0] should be >= 2
|
| armeabi-v7a CtsUsageStatsTestCases | ||
| Test | Result | Details |
|---|---|---|
| android.app.usage.cts.NetworkUsageStatsTest#testAppDetails |
fail
|
junit.framework.AssertionFailedError: android.hardware.wifi is a reported system feature, however no corresponding connected network interface was found or the attempt to connect has timed out (timeout = 15000ms). Please make sure you are connected to a WiFi access point.
|
| android.app.usage.cts.NetworkUsageStatsTest#testAppSummary |
fail
|
junit.framework.AssertionFailedError: android.hardware.wifi is a reported system feature, however no corresponding connected network interface was found or the attempt to connect has timed out (timeout = 15000ms). Please make sure you are connected to a WiFi access point.
|
| android.app.usage.cts.NetworkUsageStatsTest#testCallback |
fail
|
junit.framework.AssertionFailedError: android.hardware.wifi is a reported system feature, however no corresponding connected network interface was found or the attempt to connect has timed out (timeout = 15000ms). Please make sure you are connected to a WiFi access point.
|
| android.app.usage.cts.NetworkUsageStatsTest#testDeviceSummary |
fail
|
junit.framework.AssertionFailedError: android.hardware.wifi is a reported system feature, however no corresponding connected network interface was found or the attempt to connect has timed out (timeout = 15000ms). Please make sure you are connected to a WiFi access point.
|
| android.app.usage.cts.NetworkUsageStatsTest#testTagDetails |
fail
|
junit.framework.AssertionFailedError: android.hardware.wifi is a reported system feature, however no corresponding connected network interface was found or the attempt to connect has timed out (timeout = 15000ms). Please make sure you are connected to a WiFi access point.
|
| android.app.usage.cts.NetworkUsageStatsTest#testUidDetails |
fail
|
junit.framework.AssertionFailedError: android.hardware.wifi is a reported system feature, however no corresponding connected network interface was found or the attempt to connect has timed out (timeout = 15000ms). Please make sure you are connected to a WiFi access point.
|
| android.app.usage.cts.NetworkUsageStatsTest#testUidTagStateDetails |
fail
|
junit.framework.AssertionFailedError: android.hardware.wifi is a reported system feature, however no corresponding connected network interface was found or the attempt to connect has timed out (timeout = 15000ms). Please make sure you are connected to a WiFi access point.
|
| android.app.usage.cts.NetworkUsageStatsTest#testUserSummary |
fail
|
junit.framework.AssertionFailedError: android.hardware.wifi is a reported system feature, however no corresponding connected network interface was found or the attempt to connect has timed out (timeout = 15000ms). Please make sure you are connected to a WiFi access point.
|
| armeabi-v7a CtsViewTestCases | ||
| Test | Result | Details |
|---|---|---|
| android.view.cts.DisplayRefreshRateTest#testRefreshRate |
fail
|
java.lang.AssertionError
|