![]() |
| Summary | |
|---|---|
| Suite / Plan | TVTS / tvts-cert |
| Suite / Build | 2.9_r1 / P72529667 |
| Host Info | Result/@start dev2google04-MINIPC-PN50 (Linux - 6.5.0-41-generic) |
| Start time / End Time | Thu Jul 04 18:37:32 KST 2024 / Thu Jul 04 20:36:10 KST 2024 |
| Tests Passed | 193 |
| Tests Failed | 3 |
| Modules Done | 31 |
| Modules Total | 32 |
| Fingerprint | SKB/BFX_UA300/BFX-UA300:10/QT/19.541.521-20240701:user/release-keys |
| Security Patch | 2024-05-01 |
| Release (SDK) | 10 (29) |
| ABIs | armeabi-v7a,armeabi |
| Module | Passed | Failed | Assumption Failure | Ignored | Total Tests | Done |
|---|---|---|---|---|---|---|
| armeabi-v7a AssistantLatencyTestBench | 1 | 0 | 0 | 0 | 1 | true |
| armeabi-v7a AssistantPluginHandler | 2 | 0 | 0 | 0 | 2 | true |
| armeabi-v7a CtsEdiHostTestCases | 5 | 0 | 0 | 0 | 5 | true |
| armeabi-v7a GtvAttestationHostTestCases | 0 | 0 | 1 | 0 | 1 | true |
| armeabi-v7a GtvComplianceTestCases | 0 | 0 | 2 | 0 | 2 | true |
| armeabi-v7a GtvLauncherXLaunchStateHostTestCases | 0 | 0 | 5 | 0 | 5 | true |
| armeabi-v7a GtvLmkCujHostTestCases | 0 | 0 | 3 | 0 | 3 | true |
| armeabi-v7a GtvScorecardHostTestCases | 0 | 0 | 4 | 0 | 4 | true |
| armeabi-v7a GtvScorecardMediaBriefPlaybackTestCases | 0 | 0 | 1 | 0 | 1 | true |
| armeabi-v7a GtvScorecardMediaPlaybackErrorTestCases | 0 | 0 | 1 | 0 | 1 | true |
| armeabi-v7a GtvScorecardVideoRenderedQualityTestCases | 0 | 0 | 1 | 0 | 1 | true |
| armeabi-v7a TvConcurrentMediaPlaybackHostTestCases | 0 | 0 | 0 | 0 | 0 | false |
| armeabi-v7a TvtsApkTestCases | 1 | 0 | 0 | 0 | 1 | true |
| armeabi-v7a TvtsAppStartTimesHostTestCases | 3 | 0 | 0 | 0 | 3 | true |
| armeabi-v7a TvtsAssistant4TestCases | 3 | 0 | 3 | 0 | 6 | true |
| armeabi-v7a TvtsAttestationTestCases | 2 | 0 | 0 | 0 | 2 | true |
| armeabi-v7a TvtsBootToBootCompletedHostTestCases | 1 | 0 | 0 | 0 | 1 | true |
| armeabi-v7a TvtsCpuHostTestCases | 2 | 0 | 0 | 0 | 2 | true |
| armeabi-v7a TvtsDefaultSettingsTestCases | 0 | 0 | 1 | 0 | 1 | true |
| armeabi-v7a TvtsHdmiHostTestCases | 0 | 0 | 1 | 0 | 1 | true |
| armeabi-v7a TvtsHomeJankCujHostTestCases | 1 | 0 | 1 | 0 | 2 | true |
| armeabi-v7a TvtsJankHostTestCases | 1 | 2 | 0 | 0 | 3 | true |
| armeabi-v7a TvtsMediaLaunchTimesHostTestCases | 2 | 0 | 0 | 0 | 2 | true |
| armeabi-v7a TvtsMemoryScoreNewVideoTestCases | 1 | 0 | 0 | 0 | 1 | true |
| armeabi-v7a TvtsMemoryScoreTestCases | 1 | 0 | 0 | 0 | 1 | true |
| armeabi-v7a TvtsPerfCujTestCases | 1 | 0 | 0 | 0 | 1 | true |
| armeabi-v7a TvtsPiaHostTestCases | 3 | 0 | 0 | 0 | 3 | true |
| armeabi-v7a TvtsProvisioningHostTestCases | 0 | 0 | 1 | 0 | 1 | true |
| armeabi-v7a TvtsReportTestCases | 1 | 0 | 0 | 0 | 1 | true |
| armeabi-v7a TvtsRvisTestCases | 8 | 0 | 0 | 0 | 8 | true |
| armeabi-v7a TvtsSmokeTestCases | 154 | 0 | 0 | 0 | 154 | true |
| armeabi-v7a TvtsYouTubeTS | 0 | 1 | 1135 | 0 | 1136 | true |
| armeabi-v7a TvtsJankHostTestCases | ||
| Test | Result | Details |
|---|---|---|
| com.google.android.jank.tvts.TvtsJankHostTest#testVerticalScrollHighResolution |
fail
|
java.lang.AssertionError:
|
| com.google.android.jank.tvts.TvtsJankHostTest#testVerticalScrollLowResolution |
fail
|
java.lang.AssertionError:
|
| armeabi-v7a TvtsYouTubeTS | ||
| Test | Result | Details |
|---|---|---|
| com.google.android.apps.yts.tvts.TvtsYouTubeTS#testYTS |
fail
|
java.lang.AssertionError:
|
| Incomplete Modules |
|---|
| armeabi-v7a TvConcurrentMediaPlaybackHostTestCases |