TEXT: 
============================================
================= Results ==================
=============== Consumed Time ==============
    armeabi-v7a GtsMediaTestCases: 4h 38m 5s
    armeabi-v7a GtsExoPlayerTestCases: 58m 40s
    armeabi-v7a GtsGmscoreHostTestCases: 43m 41s
    armeabi-v7a GtsStatsdHostTestCases: 7m 17s
    armeabi-v7a GtsEdiHostTestCases: 5m 5s
    armeabi-v7a GtsDevicePolicyGmsInstrumentationTestCases: 2m 24s
    armeabi-v7a GtsStagedInstallHostTestCases: 2m 15s
    armeabi-v7a GtsSecurityHostTestCases: 2m 0s
    armeabi-v7a GtsFeaturesTestCases: 1m 57s
    armeabi-v7a GtsRollbackManagerTest: 1m 37s
    armeabi-v7a GtsArtManagerHostTestCases: 1m 27s
    armeabi-v7a CtsEdiHostTestCases: 1m 15s
    armeabi-v7a GtsPackageManagerHostTestCases: 1m 9s
    armeabi-v7a GtsDevicePolicyTestCases: 1m 0s
    armeabi-v7a GtsPlayStoreHostTestCases: 1m 0s
    armeabi-v7a GtsPermissionTestCases: 50s
    armeabi-v7a GtsYouTubeTestCases: 47s
    armeabi-v7a GtsPermissionUiTestCases: 44s
    armeabi-v7a GtsBootStatsTestCases: 40s
    armeabi-v7a GtsHealthConnectTests: 40s
    armeabi-v7a GtsSuspendAppsTestCases: 39s
    armeabi-v7a GtsAppTestCases: 38s
    armeabi-v7a GtsPackageInstallTestCases: 36s
    armeabi-v7a GtsNotificationTestCases: 34s
    armeabi-v7a GtsDuoReadyTestCases: 33s
    armeabi-v7a GtsPlacementTestCases: 32s
    armeabi-v7a GtsUnofficialApisUsageTestCases: 31s
    armeabi-v7a GtsLocationTestCases: 31s
    armeabi-v7a GtsNetTestCases: 31s
    armeabi-v7a GtsContentTestCases: 31s
    armeabi-v7a GtsOsTestCases: 29s
    armeabi-v7a GtsDozeDeviceTestCases: 28s
    armeabi-v7a GtsNetworkWatchlistTestCases: 26s
    armeabi-v7a GtsMbaPrivilegedPermissionTestCases: 26s
    armeabi-v7a GtsBackupTestCases: 24s
    armeabi-v7a GtsDeviceConfigTestCases: 24s
    armeabi-v7a GtsTvTestCases: 21s
    armeabi-v7a GtsUsageStatsTestCases: 21s
    armeabi-v7a GtsPrintTestCases: 20s
    armeabi-v7a GtsLensTestCases: 20s
    armeabi-v7a GtsPersonalSafetyTestCases: 20s
    armeabi-v7a GtsBackupHostTestCases: 20s
    armeabi-v7a GtsPlayAutoInstallTestCases: 19s
    armeabi-v7a GtsNmgiarcTestCases: 19s
    armeabi-v7a GtsTelephonyTestCases: 19s
    armeabi-v7a GtsWellbeingTestCases: 18s
    armeabi-v7a GtsLargeApkHostTestCases: 18s
    armeabi-v7a GtsTelecomManagerTests: 18s
    armeabi-v7a GtsWebViewTestCases: 18s
    armeabi-v7a GtsAssistIntentTestCases: 18s
    armeabi-v7a GtsTetheringTestCases: 18s
    armeabi-v7a GtsViewTestCases: 17s
    armeabi-v7a GtsAppBlacklistDeviceTestCases: 17s
    armeabi-v7a GtsRlzTestCases: 17s
    armeabi-v7a GtsAfwTestCases: 16s
    armeabi-v7a GtsContextHubPermissionDeviceTestCases: 16s
    armeabi-v7a GtsNoPermissionTestCases25: 16s
    armeabi-v7a GtsWallpaperTestCases: 16s
    armeabi-v7a GtsCameraTestCases: 16s
    armeabi-v7a GtsNoPermissionTestCases: 16s
    armeabi-v7a GtsAndroidAutoDeviceTestCases: 16s
    armeabi-v7a GtsRegulationComplianceTestCases: 15s
    armeabi-v7a GtsOemLockServiceTestCases: 15s
    armeabi-v7a GtsTelephonyNumberVerificationHostCases: 15s
    armeabi-v7a GtsSuspendAppsPermissionTestCases: 15s
    armeabi-v7a GtsPackageInstallerTapjackingTestCases: 14s
    armeabi-v7a GtsSettingsTestCases: 14s
    armeabi-v7a GtsContactsTest: 14s
    armeabi-v7a GtsDialerAudioTestCases: 14s
    armeabi-v7a GtsThemingTestCases: 14s
    armeabi-v7a GtsCalendarTests: 14s
    armeabi-v7a GtsSimAppDialogTestCases: 14s
    armeabi-v7a GtsIncidentManagerTestCases: 14s
    armeabi-v7a GtsSupervisionTestCases: 14s
    armeabi-v7a GtsAdminTestCases: 14s
    armeabi-v7a GtsPackageRoleEnforcementTests: 14s
    armeabi-v7a GtsWellbeingPermissionPolicyTestCases: 14s
    armeabi-v7a GtsStorageTestCases: 13s
    armeabi-v7a GtsContactsAppDeviceTestCases: 13s
    armeabi-v7a GtsTvBugReportTestCases: 13s
    armeabi-v7a GtsSpeechServicesTestCases: 13s
    armeabi-v7a GtsFilesByGoogleTestCases: 13s
    armeabi-v7a GtsAppVisibilityDeviceTestCases: 13s
    armeabi-v7a GtsCNGCoreTestCases: 13s
    armeabi-v7a GtsPropertiesTestCases: 13s
    armeabi-v7a GtsIntelligenceTestCases: 13s
    armeabi-v7a GtsPackageUninstallTestCases: 12s
    armeabi-v7a GtsVoiceInteractionHostTestCases: 12s
    armeabi-v7a GtsEntertainmentSpaceDeviceTestCases: 12s
    armeabi-v7a GtsMemoryTestCases: 12s
    armeabi-v7a GtsInstallPackagesWhitelistDeviceTestCases: 12s
    armeabi-v7a GtsPackageNameCertPairsDeviceTestCases: 12s
    armeabi-v7a GtsSsaidHostTestCases: 12s
    armeabi-v7a GtsModuleMetadataTestCases: 12s
    armeabi-v7a GtsCallLogTestCases: 12s
    armeabi-v7a GtsPrivacyTestCases: 12s
    armeabi-v7a GtsSafetyCenterTestCases: 12s
    armeabi-v7a GtsSetupWizardNoPermissionTestCases: 12s
    armeabi-v7a GtsPartnerBookmarksTestCases: 12s
    armeabi-v7a GtsSmartBatteryDeviceTestCases: 12s
    armeabi-v7a GtsNetStatsHostTestCases: 12s
    armeabi-v7a GtsSensorHostTestCases: 10s
    armeabi-v7a GtsLocationHostTestCases: 10s
    armeabi-v7a GtsCastHostTestCases: 10s
    armeabi-v7a GtsIncrementalInstallProxyHostTestCases: 8s
    armeabi-v7a GtsNetworkStackHostTestCases: 8s
    armeabi-v7a GtsTvHostTestCases: 6s
    armeabi-v7a GtsPermissionControllerHostTestCases: 6s
    armeabi-v7a GtsSetupWizardHostTestCases: 5s
    armeabi-v7a GtsAssistantHostTestCases: 5s
    armeabi-v7a GtsMemoryHostTestCases: 3s
    armeabi-v7a GtsInstantAppsHostTestCases: 3s
    armeabi-v7a GtsGraphicsHostTestCases: 2s
    armeabi-v7a GtsContentHostTestCases: 2s
    armeabi-v7a GtsWebViewHostTestCases: 2s
    armeabi-v7a GtsDozeHostSideTestCases: 2s
    armeabi-v7a GtsSettingsHostTestCases: 1s
    armeabi-v7a GtsKidsHomeHostTestCases: 1s
    armeabi-v7a GtsPreserveLegacyStorageHostTest: 1s
    armeabi-v7a GtsWellbeingHostTestCases: 1s
    armeabi-v7a GtsAssistantMicHostTestCases: 1s
    armeabi-v7a GtsSearchHostTestCases: 1s
    armeabi-v7a GtsUserspaceRebootHostSideTestCases: 1s
    armeabi-v7a GtsEntertainmentSpaceHostTestCases: 1s
    armeabi-v7a GtsGameOverlayTestCases: 1s
    armeabi-v7a GtsLinkerConfigTestCases: 1s
    armeabi-v7a GtsScreenshotHostTestCases: 985 ms
    armeabi-v7a GtsVndkDependencyTestCases: 874 ms
    armeabi-v7a GtsHomeHostTestCases: 846 ms
    armeabi-v7a GtsBootHealthHostTestCases: 844 ms
    armeabi-v7a CtsClasspathDeviceInfoTestCases: 825 ms
    armeabi-v7a CtsScopedStorageHostTest: 0 ms
Total aggregated tests run time: 7h 19m 29s
============== TOP 110 Slow Modules ==============
    armeabi-v7a GtsRollbackManagerTest: 0.01 tests/sec [1 tests / 97082 msec]
    armeabi-v7a GtsExoPlayerTestCases: 0.01 tests/sec [42 tests / 3520333 msec]
    armeabi-v7a GtsEdiHostTestCases: 0.02 tests/sec [7 tests / 305218 msec]
    armeabi-v7a GtsBootStatsTestCases: 0.02 tests/sec [1 tests / 40900 msec]
    armeabi-v7a GtsMediaTestCases: 0.03 tests/sec [571 tests / 16685262 msec]
    armeabi-v7a GtsStagedInstallHostTestCases: 0.05 tests/sec [7 tests / 135662 msec]
    armeabi-v7a GtsAppTestCases: 0.05 tests/sec [2 tests / 38308 msec]
    armeabi-v7a CtsEdiHostTestCases: 0.05 tests/sec [4 tests / 75344 msec]
    armeabi-v7a GtsLargeApkHostTestCases: 0.05 tests/sec [1 tests / 18471 msec]
    armeabi-v7a GtsAppBlacklistDeviceTestCases: 0.06 tests/sec [1 tests / 17200 msec]
    armeabi-v7a GtsContextHubPermissionDeviceTestCases: 0.06 tests/sec [1 tests / 16437 msec]
    armeabi-v7a GtsTelephonyNumberVerificationHostCases: 0.07 tests/sec [1 tests / 15067 msec]
    armeabi-v7a GtsPackageInstallerTapjackingTestCases: 0.07 tests/sec [1 tests / 14788 msec]
    armeabi-v7a GtsPermissionUiTestCases: 0.07 tests/sec [3 tests / 44354 msec]
    armeabi-v7a GtsDialerAudioTestCases: 0.07 tests/sec [1 tests / 14438 msec]
    armeabi-v7a GtsThemingTestCases: 0.07 tests/sec [1 tests / 14342 msec]
    armeabi-v7a GtsPackageRoleEnforcementTests: 0.07 tests/sec [1 tests / 14135 msec]
    armeabi-v7a GtsStorageTestCases: 0.07 tests/sec [1 tests / 13967 msec]
    armeabi-v7a GtsContactsAppDeviceTestCases: 0.07 tests/sec [1 tests / 13900 msec]
    armeabi-v7a GtsTvBugReportTestCases: 0.07 tests/sec [1 tests / 13524 msec]
    armeabi-v7a GtsFilesByGoogleTestCases: 0.07 tests/sec [1 tests / 13342 msec]
    armeabi-v7a GtsCNGCoreTestCases: 0.08 tests/sec [1 tests / 13063 msec]
    armeabi-v7a GtsPropertiesTestCases: 0.08 tests/sec [1 tests / 13041 msec]
    armeabi-v7a GtsIntelligenceTestCases: 0.08 tests/sec [1 tests / 13039 msec]
    armeabi-v7a GtsPackageUninstallTestCases: 0.08 tests/sec [1 tests / 12933 msec]
    armeabi-v7a GtsEntertainmentSpaceDeviceTestCases: 0.08 tests/sec [1 tests / 12724 msec]
    armeabi-v7a GtsMemoryTestCases: 0.08 tests/sec [1 tests / 12680 msec]
    armeabi-v7a GtsInstallPackagesWhitelistDeviceTestCases: 0.08 tests/sec [1 tests / 12656 msec]
    armeabi-v7a GtsPackageNameCertPairsDeviceTestCases: 0.08 tests/sec [1 tests / 12600 msec]
    armeabi-v7a GtsArtManagerHostTestCases: 0.08 tests/sec [7 tests / 87555 msec]
    armeabi-v7a GtsModuleMetadataTestCases: 0.08 tests/sec [1 tests / 12408 msec]
    armeabi-v7a GtsCallLogTestCases: 0.08 tests/sec [1 tests / 12289 msec]
    armeabi-v7a GtsPrivacyTestCases: 0.08 tests/sec [1 tests / 12244 msec]
    armeabi-v7a GtsSafetyCenterTestCases: 0.08 tests/sec [1 tests / 12242 msec]
    armeabi-v7a GtsSetupWizardNoPermissionTestCases: 0.08 tests/sec [1 tests / 12195 msec]
    armeabi-v7a GtsPartnerBookmarksTestCases: 0.08 tests/sec [1 tests / 12174 msec]
    armeabi-v7a GtsSmartBatteryDeviceTestCases: 0.08 tests/sec [1 tests / 12070 msec]
    armeabi-v7a GtsPlayStoreHostTestCases: 0.08 tests/sec [5 tests / 60317 msec]
    armeabi-v7a GtsNetStatsHostTestCases: 0.08 tests/sec [1 tests / 12002 msec]
    armeabi-v7a GtsStatsdHostTestCases: 0.09 tests/sec [39 tests / 437924 msec]
    armeabi-v7a GtsUnofficialApisUsageTestCases: 0.09 tests/sec [3 tests / 31685 msec]
    armeabi-v7a GtsCastHostTestCases: 0.10 tests/sec [1 tests / 10085 msec]
    armeabi-v7a GtsYouTubeTestCases: 0.11 tests/sec [5 tests / 47171 msec]
    armeabi-v7a GtsAssistIntentTestCases: 0.11 tests/sec [2 tests / 18216 msec]
    armeabi-v7a GtsNetworkWatchlistTestCases: 0.11 tests/sec [3 tests / 26648 msec]
    armeabi-v7a GtsViewTestCases: 0.12 tests/sec [2 tests / 17213 msec]
    armeabi-v7a GtsGmscoreHostTestCases: 0.12 tests/sec [319 tests / 2621288 msec]
    armeabi-v7a GtsNoPermissionTestCases25: 0.12 tests/sec [2 tests / 16382 msec]
    armeabi-v7a GtsHealthConnectTests: 0.12 tests/sec [5 tests / 40580 msec]
    armeabi-v7a GtsNoPermissionTestCases: 0.12 tests/sec [2 tests / 16211 msec]
    armeabi-v7a GtsDeviceConfigTestCases: 0.12 tests/sec [3 tests / 24164 msec]
    armeabi-v7a GtsAndroidAutoDeviceTestCases: 0.12 tests/sec [2 tests / 16043 msec]
    armeabi-v7a GtsNetTestCases: 0.13 tests/sec [4 tests / 31482 msec]
    armeabi-v7a GtsUsageStatsTestCases: 0.14 tests/sec [3 tests / 21553 msec]
    armeabi-v7a GtsCalendarTests: 0.14 tests/sec [2 tests / 14316 msec]
    armeabi-v7a GtsSupervisionTestCases: 0.14 tests/sec [2 tests / 14182 msec]
    armeabi-v7a GtsWellbeingPermissionPolicyTestCases: 0.14 tests/sec [2 tests / 14015 msec]
    armeabi-v7a GtsPrintTestCases: 0.14 tests/sec [3 tests / 20930 msec]
    armeabi-v7a GtsAppVisibilityDeviceTestCases: 0.15 tests/sec [2 tests / 13201 msec]
    armeabi-v7a GtsTvHostTestCases: 0.15 tests/sec [1 tests / 6469 msec]
    armeabi-v7a GtsPackageManagerHostTestCases: 0.17 tests/sec [12 tests / 69642 msec]
    armeabi-v7a GtsCameraTestCases: 0.18 tests/sec [3 tests / 16296 msec]
    armeabi-v7a GtsRegulationComplianceTestCases: 0.19 tests/sec [3 tests / 15897 msec]
    armeabi-v7a GtsSensorHostTestCases: 0.20 tests/sec [2 tests / 10236 msec]
    armeabi-v7a GtsLocationHostTestCases: 0.20 tests/sec [2 tests / 10116 msec]
    armeabi-v7a GtsNotificationTestCases: 0.21 tests/sec [7 tests / 34072 msec]
    armeabi-v7a GtsSettingsTestCases: 0.21 tests/sec [3 tests / 14596 msec]
    armeabi-v7a GtsContactsTest: 0.21 tests/sec [3 tests / 14565 msec]
    armeabi-v7a GtsSimAppDialogTestCases: 0.21 tests/sec [3 tests / 14259 msec]
    armeabi-v7a GtsVoiceInteractionHostTestCases: 0.23 tests/sec [3 tests / 12775 msec]
    armeabi-v7a GtsSsaidHostTestCases: 0.24 tests/sec [3 tests / 12447 msec]
    armeabi-v7a GtsSuspendAppsPermissionTestCases: 0.27 tests/sec [4 tests / 15028 msec]
    armeabi-v7a GtsPackageInstallTestCases: 0.28 tests/sec [10 tests / 36069 msec]
    armeabi-v7a GtsAdminTestCases: 0.28 tests/sec [4 tests / 14153 msec]
    armeabi-v7a GtsAfwTestCases: 0.30 tests/sec [5 tests / 16480 msec]
    armeabi-v7a GtsDevicePolicyGmsInstrumentationTestCases: 0.30 tests/sec [44 tests / 144459 msec]
    armeabi-v7a GtsOemLockServiceTestCases: 0.32 tests/sec [5 tests / 15500 msec]
    armeabi-v7a GtsSecurityHostTestCases: 0.34 tests/sec [41 tests / 120807 msec]
    armeabi-v7a GtsRlzTestCases: 0.35 tests/sec [6 tests / 17119 msec]
    armeabi-v7a GtsIncidentManagerTestCases: 0.35 tests/sec [5 tests / 14222 msec]
    armeabi-v7a GtsNmgiarcTestCases: 0.35 tests/sec [7 tests / 19790 msec]
    armeabi-v7a GtsTvTestCases: 0.37 tests/sec [8 tests / 21773 msec]
    armeabi-v7a GtsWallpaperTestCases: 0.37 tests/sec [6 tests / 16312 msec]
    armeabi-v7a GtsSpeechServicesTestCases: 0.37 tests/sec [5 tests / 13387 msec]
    armeabi-v7a GtsTelecomManagerTests: 0.38 tests/sec [7 tests / 18454 msec]
    armeabi-v7a GtsWebViewTestCases: 0.38 tests/sec [7 tests / 18400 msec]
    armeabi-v7a GtsSuspendAppsTestCases: 0.38 tests/sec [15 tests / 39231 msec]
    armeabi-v7a GtsTetheringTestCases: 0.39 tests/sec [7 tests / 18149 msec]
    armeabi-v7a GtsPlayAutoInstallTestCases: 0.40 tests/sec [8 tests / 19871 msec]
    armeabi-v7a GtsFeaturesTestCases: 0.45 tests/sec [53 tests / 117495 msec]
    armeabi-v7a GtsLensTestCases: 0.49 tests/sec [10 tests / 20417 msec]
    armeabi-v7a GtsDozeDeviceTestCases: 0.49 tests/sec [14 tests / 28525 msec]
    armeabi-v7a GtsMbaPrivilegedPermissionTestCases: 0.49 tests/sec [13 tests / 26447 msec]
    armeabi-v7a GtsPersonalSafetyTestCases: 0.59 tests/sec [12 tests / 20317 msec]
    armeabi-v7a GtsLocationTestCases: 0.60 tests/sec [19 tests / 31584 msec]
    armeabi-v7a GtsPermissionTestCases: 0.71 tests/sec [36 tests / 50641 msec]
    armeabi-v7a GtsDevicePolicyTestCases: 0.72 tests/sec [44 tests / 60764 msec]
    armeabi-v7a GtsDuoReadyTestCases: 0.84 tests/sec [28 tests / 33305 msec]
    armeabi-v7a GtsPlacementTestCases: 0.90 tests/sec [29 tests / 32237 msec]
    armeabi-v7a GtsNetworkStackHostTestCases: 0.94 tests/sec [8 tests / 8494 msec]
    armeabi-v7a GtsContentTestCases: 1.02 tests/sec [32 tests / 31423 msec]
    armeabi-v7a GtsOsTestCases: 1.03 tests/sec [30 tests / 29084 msec]
    armeabi-v7a GtsBackupTestCases: 1.13 tests/sec [28 tests / 24687 msec]
    armeabi-v7a GtsAssistantHostTestCases: 1.46 tests/sec [8 tests / 5486 msec]
    armeabi-v7a GtsPermissionControllerHostTestCases: 1.46 tests/sec [9 tests / 6147 msec]
    armeabi-v7a GtsWellbeingTestCases: 1.81 tests/sec [34 tests / 18820 msec]
    armeabi-v7a GtsBackupHostTestCases: 2.46 tests/sec [50 tests / 20316 msec]
    armeabi-v7a GtsSetupWizardHostTestCases: 3.01 tests/sec [18 tests / 5971 msec]
    armeabi-v7a GtsTelephonyTestCases: 3.96 tests/sec [78 tests / 19704 msec]
    armeabi-v7a GtsIncrementalInstallProxyHostTestCases: 4.35 tests/sec [38 tests / 8744 msec]
============== Modules Preparation Times ==============
    armeabi-v7a GtsViewTestCases => prep = 3652 ms || clean = 1331 ms
    armeabi-v7a GtsArtManagerHostTestCases => prep = 3493 ms || clean = 1398 ms
    armeabi-v7a GtsPrivacyTestCases => prep = 3504 ms || clean = 1162 ms
    armeabi-v7a GtsOsTestCases => prep = 4918 ms || clean = 1393 ms
    armeabi-v7a GtsAndroidAutoDeviceTestCases => prep = 3784 ms || clean = 1153 ms
    armeabi-v7a GtsLinkerConfigTestCases => prep = 0 ms || clean = 695 ms
    armeabi-v7a GtsWellbeingPermissionPolicyTestCases => prep = 3364 ms || clean = 1145 ms
    armeabi-v7a GtsUsageStatsTestCases => prep = 7911 ms || clean = 2094 ms
    armeabi-v7a GtsAfwTestCases => prep = 3598 ms || clean = 1288 ms
    armeabi-v7a GtsStorageTestCases => prep = 4639 ms || clean = 1333 ms
    armeabi-v7a GtsVndkDependencyTestCases => prep = 0 ms || clean = 566 ms
    armeabi-v7a GtsDozeDeviceTestCases => prep = 4215 ms || clean = 1200 ms
    armeabi-v7a GtsPackageManagerHostTestCases => prep = 0 ms || clean = 660 ms
    armeabi-v7a GtsKidsHomeHostTestCases => prep = 0 ms || clean = 659 ms
    armeabi-v7a GtsDeviceConfigTestCases => prep = 1374 ms || clean = 1138 ms
    armeabi-v7a GtsThemingTestCases => prep = 4118 ms || clean = 1159 ms
    armeabi-v7a GtsAppVisibilityDeviceTestCases => prep = 8305 ms || clean = 1984 ms
    armeabi-v7a GtsPermissionControllerHostTestCases => prep = 243 ms || clean = 823 ms
    armeabi-v7a GtsUnofficialApisUsageTestCases => prep = 413 ms || clean = 591 ms
    armeabi-v7a GtsLocationHostTestCases => prep = 5 ms || clean = 684 ms
    armeabi-v7a CtsEdiHostTestCases => prep = 0 ms || clean = 583 ms
    armeabi-v7a GtsDevicePolicyTestCases => prep = 7866 ms || clean = 1195 ms
    armeabi-v7a GtsPreserveLegacyStorageHostTest => prep = 10434 ms || clean = 888 ms
    armeabi-v7a GtsHealthConnectTests => prep = 4262 ms || clean = 1355 ms
    armeabi-v7a GtsBootHealthHostTestCases => prep = 0 ms || clean = 647 ms
    armeabi-v7a GtsYouTubeTestCases => prep = 68248 ms || clean = 1537 ms
    armeabi-v7a GtsBackupTestCases => prep = 12732 ms || clean = 3324 ms
    armeabi-v7a GtsSetupWizardNoPermissionTestCases => prep = 3420 ms || clean = 1189 ms
    armeabi-v7a GtsSetupWizardHostTestCases => prep = 3581 ms || clean = 1205 ms
    armeabi-v7a GtsInstantAppsHostTestCases => prep = 1 ms || clean = 774 ms
    armeabi-v7a GtsCastHostTestCases => prep = 3507 ms || clean = 827 ms
    armeabi-v7a CtsClasspathDeviceInfoTestCases => prep = 0 ms || clean = 646 ms
    armeabi-v7a GtsRollbackManagerTest => prep = 0 ms || clean = 2693 ms
    armeabi-v7a GtsWebViewHostTestCases => prep = 0 ms || clean = 588 ms
    armeabi-v7a GtsPermissionUiTestCases => prep = 6599 ms || clean = 1756 ms
    armeabi-v7a GtsAssistIntentTestCases => prep = 11351 ms || clean = 2715 ms
    armeabi-v7a GtsPackageInstallTestCases => prep = 4657 ms || clean = 1427 ms
    armeabi-v7a GtsMemoryHostTestCases => prep = 4900 ms || clean = 1291 ms
    armeabi-v7a GtsTetheringTestCases => prep = 3519 ms || clean = 1313 ms
    armeabi-v7a GtsGmscoreHostTestCases => prep = 14846 ms || clean = 4794 ms
    armeabi-v7a GtsCNGCoreTestCases => prep = 3576 ms || clean = 1173 ms
    armeabi-v7a GtsPermissionTestCases => prep = 6070 ms || clean = 1841 ms
    armeabi-v7a GtsPackageNameCertPairsDeviceTestCases => prep = 4630 ms || clean = 1429 ms
    armeabi-v7a GtsEntertainmentSpaceDeviceTestCases => prep = 3614 ms || clean = 1235 ms
    armeabi-v7a GtsCalendarTests => prep = 3465 ms || clean = 1105 ms
    armeabi-v7a GtsAppBlacklistDeviceTestCases => prep = 4791 ms || clean = 1453 ms
    armeabi-v7a GtsBackupHostTestCases => prep = 17136 ms || clean = 5666 ms
    armeabi-v7a GtsAppTestCases => prep = 16750 ms || clean = 3395 ms
    armeabi-v7a GtsContactsTest => prep = 3578 ms || clean = 1194 ms
    armeabi-v7a GtsTelephonyTestCases => prep = 6693 ms || clean = 1725 ms
    armeabi-v7a GtsTvBugReportTestCases => prep = 3626 ms || clean = 1228 ms
    armeabi-v7a GtsSensorHostTestCases => prep = 0 ms || clean = 751 ms
    armeabi-v7a GtsIncidentManagerTestCases => prep = 4060 ms || clean = 1138 ms
    armeabi-v7a GtsDevicePolicyGmsInstrumentationTestCases => prep = 8017 ms || clean = 1149 ms
    armeabi-v7a GtsOemLockServiceTestCases => prep = 3266 ms || clean = 1244 ms
    armeabi-v7a GtsWellbeingHostTestCases => prep = 1730 ms || clean = 1253 ms
    armeabi-v7a GtsCameraTestCases => prep = 3591 ms || clean = 1200 ms
    armeabi-v7a GtsSimAppDialogTestCases => prep = 3360 ms || clean = 1197 ms
    armeabi-v7a GtsNetStatsHostTestCases => prep = 6830 ms || clean = 1993 ms
    armeabi-v7a GtsAdminTestCases => prep = 3598 ms || clean = 1160 ms
    armeabi-v7a GtsVoiceInteractionHostTestCases => prep = 5 ms || clean = 644 ms
    armeabi-v7a GtsWellbeingTestCases => prep = 3395 ms || clean = 1192 ms
    armeabi-v7a GtsContextHubPermissionDeviceTestCases => prep = 4713 ms || clean = 1333 ms
    armeabi-v7a GtsIntelligenceTestCases => prep = 3365 ms || clean = 1202 ms
    armeabi-v7a GtsNmgiarcTestCases => prep = 4707 ms || clean = 1365 ms
    armeabi-v7a GtsLocationTestCases => prep = 7738 ms || clean = 1365 ms
    armeabi-v7a GtsPackageInstallerTapjackingTestCases => prep = 4420 ms || clean = 1692 ms
    armeabi-v7a GtsPropertiesTestCases => prep = 3576 ms || clean = 1200 ms
    armeabi-v7a GtsSsaidHostTestCases => prep = 3226 ms || clean = 1974 ms
    armeabi-v7a GtsPackageUninstallTestCases => prep = 4520 ms || clean = 1722 ms
    armeabi-v7a GtsPlacementTestCases => prep = 4740 ms || clean = 1386 ms
    armeabi-v7a GtsSecurityHostTestCases => prep = 687 ms || clean = 870 ms
    armeabi-v7a GtsAssistantHostTestCases => prep = 3555 ms || clean = 1181 ms
    armeabi-v7a GtsEdiHostTestCases => prep = 3975 ms || clean = 1314 ms
    armeabi-v7a GtsPlayStoreHostTestCases => prep = 6564 ms || clean = 3064 ms
    armeabi-v7a GtsPartnerBookmarksTestCases => prep = 3449 ms || clean = 1172 ms
    armeabi-v7a GtsPlayAutoInstallTestCases => prep = 3409 ms || clean = 1157 ms
    armeabi-v7a GtsFeaturesTestCases => prep = 2578 ms || clean = 1437 ms
    armeabi-v7a GtsNetTestCases => prep = 4800 ms || clean = 1345 ms
    armeabi-v7a GtsNotificationTestCases => prep = 1365 ms || clean = 1249 ms
    armeabi-v7a GtsSearchHostTestCases => prep = 7 ms || clean = 639 ms
    armeabi-v7a GtsRegulationComplianceTestCases => prep = 3699 ms || clean = 1234 ms
    armeabi-v7a GtsSuspendAppsPermissionTestCases => prep = 4850 ms || clean = 1859 ms
    armeabi-v7a GtsNoPermissionTestCases => prep = 4897 ms || clean = 1251 ms
    armeabi-v7a GtsSafetyCenterTestCases => prep = 3551 ms || clean = 1122 ms
    armeabi-v7a GtsNetworkStackHostTestCases => prep = 7 ms || clean = 558 ms
    armeabi-v7a GtsSpeechServicesTestCases => prep = 3380 ms || clean = 1145 ms
    armeabi-v7a GtsSupervisionTestCases => prep = 3561 ms || clean = 1168 ms
    armeabi-v7a GtsInstallPackagesWhitelistDeviceTestCases => prep = 5026 ms || clean = 1406 ms
    armeabi-v7a GtsPackageRoleEnforcementTests => prep = 3936 ms || clean = 1243 ms
    armeabi-v7a GtsStagedInstallHostTestCases => prep = 9000 ms || clean = 2001 ms
    armeabi-v7a GtsExoPlayerTestCases => prep = 5652 ms || clean = 1792 ms
    armeabi-v7a GtsMbaPrivilegedPermissionTestCases => prep = 3842 ms || clean = 1235 ms
    armeabi-v7a GtsContentHostTestCases => prep = 3740 ms || clean = 1296 ms
    armeabi-v7a GtsBootStatsTestCases => prep = 0 ms || clean = 2377 ms
    armeabi-v7a GtsStatsdHostTestCases => prep = 9878 ms || clean = 1169 ms
    armeabi-v7a GtsDuoReadyTestCases => prep = 5228 ms || clean = 1582 ms
    armeabi-v7a GtsModuleMetadataTestCases => prep = 3557 ms || clean = 1306 ms
    armeabi-v7a GtsNoPermissionTestCases25 => prep = 4579 ms || clean = 1328 ms
    armeabi-v7a GtsSettingsTestCases => prep = 3695 ms || clean = 1106 ms
    armeabi-v7a GtsSettingsHostTestCases => prep = 0 ms || clean = 611 ms
    armeabi-v7a GtsScreenshotHostTestCases => prep = 7 ms || clean = 640 ms
    armeabi-v7a GtsTvHostTestCases => prep = 0 ms || clean = 931 ms
    armeabi-v7a GtsLensTestCases => prep = 4019 ms || clean = 1398 ms
    armeabi-v7a GtsLargeApkHostTestCases => prep = 1 ms || clean = 801 ms
    armeabi-v7a GtsSuspendAppsTestCases => prep = 7385 ms || clean = 3024 ms
    armeabi-v7a GtsCallLogTestCases => prep = 3518 ms || clean = 1176 ms
    armeabi-v7a GtsPrintTestCases => prep = 4326 ms || clean = 1178 ms
    armeabi-v7a GtsEntertainmentSpaceHostTestCases => prep = 0 ms || clean = 657 ms
    armeabi-v7a GtsRlzTestCases => prep = 3510 ms || clean = 1223 ms
    armeabi-v7a GtsGraphicsHostTestCases => prep = 0 ms || clean = 611 ms
    armeabi-v7a GtsTvTestCases => prep = 4719 ms || clean = 1699 ms
    armeabi-v7a GtsSmartBatteryDeviceTestCases => prep = 3400 ms || clean = 1237 ms
    armeabi-v7a GtsWallpaperTestCases => prep = 3514 ms || clean = 1196 ms
    armeabi-v7a GtsContactsAppDeviceTestCases => prep = 4225 ms || clean = 1265 ms
    armeabi-v7a GtsWebViewTestCases => prep = 3616 ms || clean = 1199 ms
    armeabi-v7a GtsPersonalSafetyTestCases => prep = 4039 ms || clean = 1181 ms
    armeabi-v7a GtsUserspaceRebootHostSideTestCases => prep = 0 ms || clean = 587 ms
    armeabi-v7a GtsGameOverlayTestCases => prep = 0 ms || clean = 609 ms
    armeabi-v7a GtsMediaTestCases => prep = 10904 ms || clean = 4918 ms
    armeabi-v7a GtsMemoryTestCases => prep = 4669 ms || clean = 1475 ms
    armeabi-v7a GtsHomeHostTestCases => prep = 110 ms || clean = 681 ms
    armeabi-v7a GtsNetworkWatchlistTestCases => prep = 4322 ms || clean = 1178 ms
    armeabi-v7a GtsTelecomManagerTests => prep = 3500 ms || clean = 1329 ms
    armeabi-v7a GtsIncrementalInstallProxyHostTestCases => prep = 1873 ms || clean = 1726 ms
    armeabi-v7a GtsDozeHostSideTestCases => prep = 3203 ms || clean = 1292 ms
    armeabi-v7a GtsFilesByGoogleTestCases => prep = 3529 ms || clean = 1889 ms
    armeabi-v7a GtsTelephonyNumberVerificationHostCases => prep = 0 ms || clean = 737 ms
    armeabi-v7a GtsAssistantMicHostTestCases => prep = 3897 ms || clean = 1138 ms
    armeabi-v7a GtsContentTestCases => prep = 4890 ms || clean = 1288 ms
    armeabi-v7a GtsDialerAudioTestCases => prep = 4687 ms || clean = 1532 ms
Total preparation time: 9m 34s  ||  Total tear down time: 3m 0s
=======================================================
=============== Summary ===============
Total Run time: 12m 7s
130/132 modules completed
Module(s) with run failure(s):
    armeabi-v7a CtsScopedStorageHostTest: There were 4 failures:
  com.android.tradefed.targetprep.TargetSetupError[APK_INSTALLATION_FAILED|520001|DEPENDENCY_ISSUE]: Failed to install android.scopedstorage.cts.testapp.A.withres with [/data/tmp/f1c33f96-a02e-4966-96e6-0d0858f2c515/android-gts/testcases/CtsScopedStorageHostTest/CtsScopedStorageTestAppA.apk] on SKBFXYWE0GRI. Reason: 'INSTALL_FAILED_OLDER_SDK: Failed parse during installPackageLI: /data/app/vmdl2007170659.tmp/base.apk (at Binary XML file line #18): Requires newer sdk version #30 (current version is #29)' [SKBFXYWE0GRI sequoia:bfx-ua300 QT]
	at com.android.tradefed.targetprep.TestAppInstallSetup.installSinglePackage(TestAppInstallSetup.java:558)
	at com.android.tradefed.targetprep.TestAppInstallSetup.installer(TestAppInstallSetup.java:525)
	at com.android.tradefed.targetprep.TestAppInstallSetup.setUp(TestAppInstallSetup.java:413)
	at com.android.tradefed.testtype.suite.ModuleDefinition.runPreparerSetup(ModuleDefinition.java:999)
	at com.android.tradefed.testtype.suite.ModuleDefinition.runTargetPreparation(ModuleDefinition.java:1432)
	at com.android.tradefed.testtype.suite.ModuleDefinition.runPreparation(ModuleDefinition.java:958)
	at com.android.tradefed.testtype.suite.ModuleDefinition.run(ModuleDefinition.java:484)
	at com.android.tradefed.testtype.suite.ITestSuite.runSingleModule(ITestSuite.java:937)
	at com.android.tradefed.testtype.suite.ITestSuite.run(ITestSuite.java:817)
	at com.android.tradefed.invoker.shard.TestsPoolPoller.run(TestsPoolPoller.java:161)
	at com.android.tradefed.invoker.InvocationExecution.runTest(InvocationExecution.java:1336)
	at com.android.tradefed.invoker.InvocationExecution.runTests(InvocationExecution.java:1115)
	at com.android.tradefed.invoker.TestInvocation.prepareAndRun(TestInvocation.java:617)
	at com.android.tradefed.invoker.TestInvocation.performInvocation(TestInvocation.java:275)
	at com.android.tradefed.invoker.TestInvocation.invoke(TestInvocation.java:1335)
	at com.android.tradefed.command.CommandScheduler$InvocationThread.run(CommandScheduler.java:678)

  com.android.tradefed.targetprep.TargetSetupError[APK_INSTALLATION_FAILED|520001|DEPENDENCY_ISSUE]: Failed to install android.scopedstorage.cts.testapp.A.withres with [/data/tmp/f1c33f96-a02e-4966-96e6-0d0858f2c515/android-gts/testcases/CtsScopedStorageHostTest/CtsScopedStorageTestAppA.apk] on SKBFXYWE0GMF. Reason: 'INSTALL_FAILED_OLDER_SDK: Failed parse during installPackageLI: /data/app/vmdl1548018301.tmp/base.apk (at Binary XML file line #18): Requires newer sdk version #30 (current version is #29)' [SKBFXYWE0GMF sequoia:bfx-ua300 QT]
	at com.android.tradefed.targetprep.TestAppInstallSetup.installSinglePackage(TestAppInstallSetup.java:558)
	at com.android.tradefed.targetprep.TestAppInstallSetup.installer(TestAppInstallSetup.java:525)
	at com.android.tradefed.targetprep.TestAppInstallSetup.setUp(TestAppInstallSetup.java:413)
	at com.android.tradefed.testtype.suite.ModuleDefinition.runPreparerSetup(ModuleDefinition.java:999)
	at com.android.tradefed.testtype.suite.ModuleDefinition.runTargetPreparation(ModuleDefinition.java:1432)
	at com.android.tradefed.testtype.suite.ModuleDefinition.runPreparation(ModuleDefinition.java:958)
	at com.android.tradefed.testtype.suite.ModuleDefinition.run(ModuleDefinition.java:484)
	at com.android.tradefed.testtype.suite.ITestSuite.runSingleModule(ITestSuite.java:937)
	at com.android.tradefed.testtype.suite.ITestSuite.run(ITestSuite.java:817)
	at com.android.tradefed.invoker.shard.TestsPoolPoller.run(TestsPoolPoller.java:161)
	at com.android.tradefed.invoker.InvocationExecution.runTest(InvocationExecution.java:1336)
	at com.android.tradefed.invoker.InvocationExecution.runTests(InvocationExecution.java:1115)
	at com.android.tradefed.invoker.TestInvocation.prepareAndRun(TestInvocation.java:617)
	at com.android.tradefed.invoker.TestInvocation.performInvocation(TestInvocation.java:275)
	at com.android.tradefed.invoker.TestInvocation.invoke(TestInvocation.java:1335)
	at com.android.tradefed.command.CommandScheduler$InvocationThread.run(CommandScheduler.java:678)

  com.android.tradefed.targetprep.TargetSetupError[APK_INSTALLATION_FAILED|520001|DEPENDENCY_ISSUE]: Failed to install android.scopedstorage.cts.testapp.A.withres with [/data/tmp/f1c33f96-a02e-4966-96e6-0d0858f2c515/android-gts/testcases/CtsScopedStorageHostTest/CtsScopedStorageTestAppA.apk] on SKBFXYWE0GMF. Reason: 'INSTALL_FAILED_OLDER_SDK: Failed parse during installPackageLI: /data/app/vmdl1896644611.tmp/base.apk (at Binary XML file line #18): Requires newer sdk version #30 (current version is #29)' [SKBFXYWE0GMF sequoia:bfx-ua300 QT]
	at com.android.tradefed.targetprep.TestAppInstallSetup.installSinglePackage(TestAppInstallSetup.java:558)
	at com.android.tradefed.targetprep.TestAppInstallSetup.installer(TestAppInstallSetup.java:525)
	at com.android.tradefed.targetprep.TestAppInstallSetup.setUp(TestAppInstallSetup.java:413)
	at com.android.tradefed.testtype.suite.ModuleDefinition.runPreparerSetup(ModuleDefinition.java:999)
	at com.android.tradefed.testtype.suite.ModuleDefinition.runTargetPreparation(ModuleDefinition.java:1432)
	at com.android.tradefed.testtype.suite.ModuleDefinition.runPreparation(ModuleDefinition.java:958)
	at com.android.tradefed.testtype.suite.ModuleDefinition.run(ModuleDefinition.java:484)
	at com.android.tradefed.testtype.suite.ITestSuite.runSingleModule(ITestSuite.java:937)
	at com.android.tradefed.testtype.suite.ITestSuite.run(ITestSuite.java:817)
	at com.android.tradefed.invoker.shard.TestsPoolPoller.run(TestsPoolPoller.java:161)
	at com.android.tradefed.invoker.InvocationExecution.runTest(InvocationExecution.java:1336)
	at com.android.tradefed.invoker.InvocationExecution.runTests(InvocationExecution.java:1115)
	at com.android.tradefed.invoker.TestInvocation.prepareAndRun(TestInvocation.java:617)
	at com.android.tradefed.invoker.TestInvocation.performInvocation(TestInvocation.java:275)
	at com.android.tradefed.invoker.TestInvocation.invoke(TestInvocation.java:1335)
	at com.android.tradefed.command.CommandScheduler$InvocationThread.run(CommandScheduler.java:678)

  com.android.tradefed.targetprep.TargetSetupError[APK_INSTALLATION_FAILED|520001|DEPENDENCY_ISSUE]: Failed to install android.scopedstorage.cts.testapp.A.withres with [/data/tmp/f1c33f96-a02e-4966-96e6-0d0858f2c515/android-gts/testcases/CtsScopedStorageHostTest/CtsScopedStorageTestAppA.apk] on SKBFXYWE0GRI. Reason: 'INSTALL_FAILED_OLDER_SDK: Failed parse during installPackageLI: /data/app/vmdl466462190.tmp/base.apk (at Binary XML file line #18): Requires newer sdk version #30 (current version is #29)' [SKBFXYWE0GRI sequoia:bfx-ua300 QT]
	at com.android.tradefed.targetprep.TestAppInstallSetup.installSinglePackage(TestAppInstallSetup.java:558)
	at com.android.tradefed.targetprep.TestAppInstallSetup.installer(TestAppInstallSetup.java:525)
	at com.android.tradefed.targetprep.TestAppInstallSetup.setUp(TestAppInstallSetup.java:413)
	at com.android.tradefed.testtype.suite.ModuleDefinition.runPreparerSetup(ModuleDefinition.java:999)
	at com.android.tradefed.testtype.suite.ModuleDefinition.runTargetPreparation(ModuleDefinition.java:1432)
	at com.android.tradefed.testtype.suite.ModuleDefinition.runPreparation(ModuleDefinition.java:958)
	at com.android.tradefed.testtype.suite.ModuleDefinition.run(ModuleDefinition.java:484)
	at com.android.tradefed.testtype.suite.ITestSuite.runSingleModule(ITestSuite.java:937)
	at com.android.tradefed.testtype.suite.ITestSuite.run(ITestSuite.java:817)
	at com.android.tradefed.invoker.shard.TestsPoolPoller.run(TestsPoolPoller.java:161)
	at com.android.tradefed.invoker.InvocationExecution.runTest(InvocationExecution.java:1336)
	at com.android.tradefed.invoker.InvocationExecution.runTests(InvocationExecution.java:1115)
	at com.android.tradefed.invoker.TestInvocation.prepareAndRun(TestInvocation.java:617)
	at com.android.tradefed.invoker.TestInvocation.performInvocation(TestInvocation.java:275)
	at com.android.tradefed.invoker.TestInvocation.invoke(TestInvocation.java:1335)
	at com.android.tradefed.command.CommandScheduler$InvocationThread.run(CommandScheduler.java:678)

    armeabi-v7a GtsMediaTestCases: Instrumentation run failed due to 'Process crashed.'
Java Crash Messages sorted from most recent:
Failed to allocate a 730023 byte allocation with 170416 free bytes and 166KB until OOM, target footprint 268435456, growth limit 268435456
java.lang.OutOfMemoryError: Failed to allocate a 730023 byte allocation with 170416 free bytes and 166KB until OOM, target footprint 268435456, growth limit 268435456
	at dalvik.system.VMRuntime.newNonMovableArray(Native Method)
	at java.nio.DirectByteBuffer$MemoryRef.<init>(DirectByteBuffer.java:70)
	at java.nio.ByteBuffer.allocateDirect(ByteBuffer.java:258)
	at com.google.android.exoplayer2.decoder.DecoderInputBuffer.createReplacementByteBuffer(DecoderInputBuffer.java:201)
	at com.google.android.exoplayer2.decoder.DecoderInputBuffer.ensureSpaceForWrite(DecoderInputBuffer.java:136)
	at com.google.android.exoplayer2.source.SampleDataQueue.readToBuffer(SampleDataQueue.java:145)
	at com.google.android.exoplayer2.source.SampleQueue.read(SampleQueue.java:330)
	at com.google.android.exoplayer2.source.ProgressiveMediaPeriod.readData(ProgressiveMediaPeriod.java:478)
	at com.google.android.exoplayer2.source.ProgressiveMediaPeriod$SampleStreamImpl.readData(ProgressiveMediaPeriod.java:894)
	at com.google.android.media.gts.extractor.ExoPlayer2ExtractorAdapter$7.run(ExoPlayer2ExtractorAdapter.java:565)
	at com.google.android.media.gts.extractor.ExoPlayer2ExtractorAdapter$7.run(ExoPlayer2ExtractorAdapter.java:555)
	at com.google.android.media.gts.extractor.LooperThread$3.run(LooperThread.java:93)
	at android.os.Handler.handleCallback(Handler.java:883)
	at android.os.Handler.dispatchMessage(Handler.java:100)
	at android.os.Looper.loop(Looper.java:214)
	at android.os.HandlerThread.run(HandlerThread.java:67)
Total Tests       : 2034
PASSED            : 1289
FAILED            : 36
IGNORED           : 12
ASSUMPTION_FAILURE: 633
IMPORTANT: Some modules failed to run to completion, tests counts may be inaccurate.
Shard 0 used: [SKBFXYWE0GMF]
Shard 1 used: [SKBFXYWE0GRI]
============== End of Results ==============
============================================
