![]() |
| Summary | |
|---|---|
| Suite / Plan | CTS / cts |
| Suite / Build | 10_r8 / 7337080 |
| Host Info | Result/@start jason-VirtualBox (Linux - 4.15.0-142-generic) |
| Start time / End Time | Thu Aug 12 14:45:49 CST 2021 / Thu Aug 12 14:48:17 CST 2021 |
| Tests Passed | 0 |
| Tests Failed | 2 |
| Modules Done | 2 |
| Modules Total | 2 |
| Fingerprint | SKB/BFX_UA300/BFX-UA300:10/QT/19.531.10-20210804:userdebug/release-keys |
| Security Patch | 2021-06-05 |
| Release (SDK) | 10 (29) |
| ABIs | armeabi-v7a,armeabi |
| Module | Passed | Failed | Assumption Failure | Ignored | Total Tests | Done |
|---|---|---|---|---|---|---|
| armeabi-v7a CtsAppTestCases | 0 | 1 | 0 | 0 | 1 | true |
| armeabi-v7a CtsAppTestCases[instant] | 0 | 1 | 0 | 0 | 1 | true |
| armeabi-v7a CtsAppTestCases | ||
| Test | Result | Details |
|---|---|---|
| android.app.cts.ActivityManagerProcessStateTest#testCantSaveStateLaunchAndSwitch |
fail
|
java.lang.IllegalStateException: Timed out waiting for next line: cmd=cached procState=null
at android.app.cts.android.app.cts.tools.WatchUidRunner.waitForNextLine(WatchUidRunner.java:203)
at android.app.cts.android.app.cts.tools.WatchUidRunner.expect(WatchUidRunner.java:136)
at android.app.cts.android.app.cts.tools.WatchUidRunner.expect(WatchUidRunner.java:131)
at android.app.cts.ActivityManagerProcessStateTest.testCantSaveStateLaunchAndSwitch(ActivityManagerProcessStateTest.java:1330)
at java.lang.reflect.Method.invoke(Native Method)
at android.test.InstrumentationTestCase.runMethod(InstrumentationTestCase.java:220)
at android.test.InstrumentationTestCase.runTest(InstrumentationTestCase.java:205)
at junit.framework.TestCase.runBare(TestCase.java:134)
at junit.framework.TestResult$1.protect(TestResult.java:115)
at androidx.test.internal.runner.junit3.AndroidTestResult.runProtected(AndroidTestResult.java:73)
at junit.framework.TestResult.run(TestResult.java:118)
at androidx.test.internal.runner.junit3.AndroidTestResult.run(AndroidTestResult.java:51)
at junit.framework.TestCase.run(TestCase.java:124)
at androidx.test.internal.runner.junit3.NonLeakyTestSuite$NonLeakyTest.run(NonLeakyTestSuite.java:62)
at androidx.test.internal.runner.junit3.AndroidTestSuite$2.run(AndroidTestSuite.java:101)
at java.util.concurrent.Executors$RunnableAdapter.call(Executors.java:462)
at java.util.concurrent.FutureTask.run(FutureTask.java:266)
at java.util.concurrent.ThreadPoolExecutor.runWorker(ThreadPoolExecutor.java:1167)
at java.util.concurrent.ThreadPoolExecutor$Worker.run(ThreadPoolExecutor.java:641)
at java.lang.Thread.run(Thread.java:919)
|
| armeabi-v7a CtsAppTestCases[instant] | ||
| Test | Result | Details |
|---|---|---|
| android.app.cts.ActivityManagerProcessStateTest#testCantSaveStateLaunchAndSwitch |
fail
|
java.lang.IllegalStateException: Timed out waiting for next line: cmd=cached procState=null
at android.app.cts.android.app.cts.tools.WatchUidRunner.waitForNextLine(WatchUidRunner.java:203)
at android.app.cts.android.app.cts.tools.WatchUidRunner.expect(WatchUidRunner.java:136)
at android.app.cts.android.app.cts.tools.WatchUidRunner.expect(WatchUidRunner.java:131)
at android.app.cts.ActivityManagerProcessStateTest.testCantSaveStateLaunchAndSwitch(ActivityManagerProcessStateTest.java:1330)
at java.lang.reflect.Method.invoke(Native Method)
at android.test.InstrumentationTestCase.runMethod(InstrumentationTestCase.java:220)
at android.test.InstrumentationTestCase.runTest(InstrumentationTestCase.java:205)
at junit.framework.TestCase.runBare(TestCase.java:134)
at junit.framework.TestResult$1.protect(TestResult.java:115)
at androidx.test.internal.runner.junit3.AndroidTestResult.runProtected(AndroidTestResult.java:73)
at junit.framework.TestResult.run(TestResult.java:118)
at androidx.test.internal.runner.junit3.AndroidTestResult.run(AndroidTestResult.java:51)
at junit.framework.TestCase.run(TestCase.java:124)
at androidx.test.internal.runner.junit3.NonLeakyTestSuite$NonLeakyTest.run(NonLeakyTestSuite.java:62)
at androidx.test.internal.runner.junit3.AndroidTestSuite$2.run(AndroidTestSuite.java:101)
at java.util.concurrent.Executors$RunnableAdapter.call(Executors.java:462)
at java.util.concurrent.FutureTask.run(FutureTask.java:266)
at java.util.concurrent.ThreadPoolExecutor.runWorker(ThreadPoolExecutor.java:1167)
at java.util.concurrent.ThreadPoolExecutor$Worker.run(ThreadPoolExecutor.java:641)
at java.lang.Thread.run(Thread.java:919)
|
| armeabi-v7a CtsAppTestCases | ||
| Test | Result | Details |
|---|---|---|
| android.app.cts.ActivityManagerProcessStateTest#testCantSaveStateLaunchAndSwitch |
fail
|
java.lang.IllegalStateException: Timed out waiting for next line: cmd=cached procState=null
|
| armeabi-v7a CtsAppTestCases[instant] | ||
| Test | Result | Details |
|---|---|---|
| android.app.cts.ActivityManagerProcessStateTest#testCantSaveStateLaunchAndSwitch |
fail
|
java.lang.IllegalStateException: Timed out waiting for next line: cmd=cached procState=null
|